· 9 years ago · Jan 01, 2017, 11:00 PM
1<6>[ 0.000000]@0 Initializing cgroup subsys cpuset
2<6>[ 0.000000]@0 Initializing cgroup subsys cpu
3<6>[ 0.000000]@0 Initializing cgroup subsys cpuacct
4<5>[ 0.000000]@0 Linux version 3.18.20-blu_spark-custom (engstk@sparky) (gcc version 6.2.1 20161016 (crosstool-NG 1.22.0-301 - blu_naro-6.2-2016.11-rc2) ) #161 SMP PREEMPT Tue Nov 29 18:29:18 WET 2016
5<4>[ 0.000000]@0 CPU: AArch64 Processor [511f2112] revision 2
6<6>[ 0.000000]@0 Machine: Qualcomm Technologies, Inc. MSM 8996 v3 + PMI8996 MTP
7<6>[ 0.000000]@0 efi: Getting EFI parameters from FDT:
8<6>[ 0.000000]@0 efi: UEFI not found.
9<6>[ 0.000000]@0 Reserved memory: reserved region for node 'removed_regions@85800000': base 0x0000000085800000, size 48 MiB
10<6>[ 0.000000]@0 Reserved memory: reserved region for node 'peripheral_region@8ea00000': base 0x000000008ea00000, size 43 MiB
11<6>[ 0.000000]@0 Reserved memory: reserved region for node 'modem_region@88800000': base 0x0000000088800000, size 98 MiB
12<6>[ 0.000000]@0 Reserved memory: reserved region for node 'dfps_data_mem@83400000': base 0x0000000083400000, size 0 MiB
13<6>[ 0.000000]@0 Reserved memory: reserved region for node 'cont_splash_mem@83401000': base 0x0000000083401000, size 35 MiB
14<6>[ 0.000000]@0 Reserved memory: reserved region for node 'ramoops_mem@ac000000': base 0x00000000ac000000, size 2 MiB
15<6>[ 0.000000]@0 Reserved memory: reserved region for node 'param_mem@ac200000': base 0x00000000ac200000, size 1 MiB
16<6>[ 0.000000]@0 Reserved memory: reserved region for node 'bootloader_log_mem@ac300000': base 0x00000000ac300000, size 1 MiB
17<6>[ 0.000000]@0 Reserved memory: reserved region for node 'mtp_mem@ac400000': base 0x00000000ac400000, size 1 MiB
18<6>[ 0.000000]@0 Reserved memory: reserved region for node 'cont_splash_mem_hdmi@b1c00000': base 0x00000000b1c00000, size 35 MiB
19<6>[ 0.000000]@0 Removed memory: created DMA memory pool at 0x0000000085800000, size 48 MiB
20<6>[ 0.000000]@0 Reserved memory: initialized node removed_regions@85800000, compatible id removed-dma-pool
21<6>[ 0.000000]@0 Removed memory: created DMA memory pool at 0x000000008ea00000, size 43 MiB
22<6>[ 0.000000]@0 Reserved memory: initialized node peripheral_region@8ea00000, compatible id removed-dma-pool
23<6>[ 0.000000]@0 Reserved memory: allocated memory for 'adsp_region' node: base 0x00000000ffb00000, size 4 MiB
24<3>[ 0.000000]@0 Reserved memory: incorrect alignment of CMA region
25<6>[ 0.000000]@0 Reserved memory: allocated memory for 'qseecom_region' node: base 0x00000000fe400000, size 20 MiB
26<6>[ 0.000000]@0 Reserved memory: created CMA memory pool at 0x00000000fe400000, size 20 MiB
27<6>[ 0.000000]@0 Reserved memory: initialized node qseecom_region, compatible id shared-dma-pool
28<6>[ 0.000000]@0 Reserved memory: allocated memory for 'secure_region' node: base 0x00000000f8800000, size 92 MiB
29<6>[ 0.000000]@0 Reserved memory: created CMA memory pool at 0x00000000f8800000, size 92 MiB
30<6>[ 0.000000]@0 Reserved memory: initialized node secure_region, compatible id shared-dma-pool
31<6>[ 0.000000]@0 Removed memory: created DMA memory pool at 0x0000000088800000, size 98 MiB
32<6>[ 0.000000]@0 Reserved memory: initialized node modem_region@88800000, compatible id removed-dma-pool
33<6>[ 0.000000]@0 Reserved memory: created DMA memory pool at 0x0000000083400000, size 0 MiB
34<6>[ 0.000000]@0 Reserved memory: initialized node dfps_data_mem@83400000, compatible id shared-dma-pool
35<6>[ 0.000000]@0 cma: Reserved 32 MiB at 0x00000000f6800000
36<7>[ 0.000000]@0 On node 0 totalpages: 1514575
37<7>[ 0.000000]@0 DMA zone: 11532 pages used for memmap
38<7>[ 0.000000]@0 DMA zone: 0 pages reserved
39<7>[ 0.000000]@0 DMA zone: 738047 pages, LIFO batch:31
40<7>[ 0.000000]@0 Normal zone: 12134 pages used for memmap
41<7>[ 0.000000]@0 Normal zone: 776528 pages, LIFO batch:31
42<6>[ 0.000000]@0 psci: probing for conduit method from DT.
43<6>[ 0.000000]@0 psci: PSCIv1.0 detected in firmware.
44<6>[ 0.000000]@0 psci: Using standard PSCI v0.2 function IDs
45<6>[ 0.000000]@0 psci: Initializing psco_cpu_init
46<6>[ 0.000000]@0 psci: Initializing psco_cpu_init
47<6>[ 0.000000]@0 psci: Initializing psco_cpu_init
48<6>[ 0.000000]@0 PERCPU: Embedded 14 pages/cpu @ffffffc17d71a000 s18816 r8192 d30336 u57344
49<7>[ 0.000000]@0 pcpu-alloc: s18816 r8192 d30336 u57344 alloc=14*4096
50<7>[ 0.000000]@0 pcpu-alloc: [0] 0 [0] 1 [0] 2 [0] 3
51<4>[ 0.000000]@0 Built 1 zonelists in Zone order, mobility grouping on. Total pages: 1490909
52<5>[ 0.000000]@0 Kernel command line: sched_enable_hmp=1 sched_enable_power_aware=1 androidboot.hardware=qcom user_debug=31 msm_rtb.filter=0x237 ehci-hcd.park=3 lpm_levels.sleep_disabled=1 cma=32M@0-0xffffffff androidboot.selinux=permissive androidboot.bootdevice=624000.ufshc androidboot.verifiedbootstate=orange androidboot.veritymode=logging androidboot.keymaster=1 androidboot.serialno=f43145a3 gpt androidboot.baseband=msm mdss_mdp.panel=1:dsi:0:qcom,mdss_dsi_samsung_s6e3fa3_1080p_cmd:1:none:cfg:single_dsi androidboot.mode=recovery androidboot.ftm_mode=ftm_recovery androidboot.project_name=15801 androidboot.selinux=permissive androidboot.rf_version=21 androidboot.hw_version=16 ddr_manufacture_info=Samsung ddr_row0_info=16 androidboot.pcba_number=001580206828032700004764 androidboot.enable_dm_verity=1 androidboot.secboot=enabled androidboot.angela=disabled androidboot.nobatt=0 androidboot.rpmb_enable=true
53<6>[ 0.000000]@0 PID hash table entries: 4096 (order: 3, 32768 bytes)
54<6>[ 0.000000]@0 Dentry cache hash table entries: 1048576 (order: 11, 8388608 bytes)
55<6>[ 0.000000]@0 Inode-cache hash table entries: 524288 (order: 10, 4194304 bytes)
56<4>[ 0.000000]@0 Memory: 5681624K/6058300K available (12156K kernel code, 1421K rwdata, 6260K rodata, 284K init, 3374K bss, 376676K reserved)
57<5>[ 0.000000]@0 Virtual kernel memory layout:
58<5> vmalloc : 0xffffff8000000000 - 0xffffffbdbfff0000 ( 246 GB)
59<5> vmemmap : 0xffffffbdc0000000 - 0xffffffbfc0000000 ( 8 GB maximum)
60<5> 0xffffffbdc1000000 - 0xffffffbdc6f65400 ( 95 MB actual)
61<5> PCI I/O : 0xffffffbffa000000 - 0xffffffbffb000000 ( 16 MB)
62<5> fixed : 0xffffffbffbdfe000 - 0xffffffbffbdff000 ( 4 KB)
63<5> modules : 0xffffffbffc000000 - 0xffffffc000000000 ( 64 MB)
64<5> memory : 0xffffffc000000000 - 0xffffffc17d950000 ( 6105 MB)
65<5> .init : 0xffffffc00127e000 - 0xffffffc0012c5000 ( 284 KB)
66<5> .text : 0xffffffc000080000 - 0xffffffc00127d1b4 ( 18421 KB)
67<5> .data : 0xffffffc0012cf000 - 0xffffffc001432420 ( 1422 KB)
68<6>[ 0.000000]@0 SLUB: HWalign=128, Order=0-0, MinObjects=0, CPUs=4, Nodes=1
69<6>[ 0.000000]@0 HMP scheduling enabled.
70<6>[ 0.000000]@0 Preemptible hierarchical RCU implementation.
71<6>[ 0.000000]@0 RCU dyntick-idle grace-period acceleration is enabled.
72<6>[ 0.000000]@0 Dump stacks of tasks blocking RCU-preempt GP.
73<6>[ 0.000000]@0 NR_IRQS:64 nr_irqs:64 0
74<4>[ 0.000000]@0 mpm_init_irq_domain(): Cannot find irq controller for qcom,gpio-parent
75<3>[ 0.000000]@0 MPM 1 irq mapping errored -517
76<6>[ 0.000000]@0 Offload RCU callbacks from all CPUs
77<6>[ 0.000000]@0 Offload RCU callbacks from CPUs: 0-3.
78<6>[ 0.000000]@0 Architected cp15 and mmio timer(s) running at 19.20MHz (virt/virt).
79<6>[ 0.000000]@0 sched_clock: 56 bits at 19MHz, resolution 52ns, wraps every 3579139424256ns
80<6>[ 0.000016]@0 Switched to clocksource arch_sys_counter
81<6>[ 0.000621]@0 Calibrating delay loop (skipped), value calculated using timer frequency.. 38.00 BogoMIPS (lpj=64000)
82<6>[ 0.000635]@0 pid_max: default: 32768 minimum: 301
83<6>[ 0.000695]@0 Security Framework initialized
84<6>[ 0.000711]@0 SELinux: Initializing.
85<7>[ 0.000732]@0 SELinux: Starting in permissive mode
86<6>[ 0.000764]@0 Mount-cache hash table entries: 16384 (order: 5, 131072 bytes)
87<6>[ 0.000773]@0 Mountpoint-cache hash table entries: 16384 (order: 5, 131072 bytes)
88<6>[ 0.001252]@0 Initializing cgroup subsys freezer
89<4>[ 0.001501]@0 /cpus/cpu@0: Unknown CPU type
90<4>[ 0.001510]@0 /cpus/cpu@1: Unknown CPU type
91<4>[ 0.001517]@0 /cpus/cpu@100: Unknown CPU type
92<4>[ 0.001524]@0 /cpus/cpu@101: Unknown CPU type
93<6>[ 0.001544]@0 hw perfevents: enabled with arm/armv8-pmuv3 PMU driver, 9 counters available
94<6>[ 0.001565]@0 EFI services will not be available.
95<4>[ 0.002615]@0 NOHZ: local_softirq_pending 02
96<6>[ 0.004575]@0 MSM Memory Dump base table set up
97<6>[ 0.004597]@0 MSM Memory Dump apps data table set up
98<6>[ 0.008612]@0 clock-cpu-8996: configuring clocks for the perf cluster
99<6>[ 0.008763]@0 cpu_clock_8996_early_init: finished CPU clock configuration
100<6>[ 0.011040]@0 _cpu_up by swapper/0[1]
101<6>[ 0.013166]@0 _cpu_up by swapper/0[1]
102<6>[ 0.015038]@0 _cpu_up by swapper/0[1]
103<6>[ 0.015049]@0 Brought up 4 CPUs
104<6>[ 0.015055]@0 SMP: Total of 4 processors activated.
105<6>[ 0.021228]@0 pinctrl core: initialized pinctrl subsystem
106<6>[ 0.021590]@0 regulator-dummy: no parameters
107<6>[ 0.074968]@0 NET: Registered protocol family 16
108<6>[ 0.090093]@1 cpuidle: using governor ladder
109<6>[ 0.096786]@1 cpuidle: using governor menu
110<6>[ 0.103440]@1 cpuidle: using governor qcom
111<6>[ 0.104277]@1 vdso: 2 pages (1 code @ ffffffc0012d5000, 1 data @ ffffffc0012d4000)
112<6>[ 0.104722]@1 software IO TLB [mem 0xf6400000-0xf6800000] (4MB) mapped at [ffffffc0b6400000-ffffffc0b67fffff]
113<6>[ 0.105389]@1 DMA: preallocated 256 KiB pool for atomic allocations
114<3>[ 0.105631]@1 msm_smem_init: unable to create logging context
115<3>[ 0.105665]@1 msm_smd_init: unable to create SMD logging context
116<3>[ 0.105671]@1 msm_smd_init: unable to create SMSM logging context
117<3>[ 0.105906]@0 <CORE> glink_init: unable to create log context
118<3>[ 0.106169]@2 <CORE> glink_core_register_transport: unable to create log context for [dsps:smd_trans]
119<3>[ 0.106322]@2 <CORE> glink_core_register_transport: unable to create log context for [lpass:smd_trans]
120<3>[ 0.106449]@2 <CORE> glink_core_register_transport: unable to create log context for [mpss:smd_trans]
121<3>[ 0.106580]@2 <CORE> glink_core_register_transport: unable to create log context for [wcnss:smd_trans]
122<3>[ 0.106735]@2 <CORE> glink_core_register_transport: unable to create log context for [rpm:smd_trans]
123<3>[ 0.107464]@2 Failed to create IPC log0
124<3>[ 0.107471]@2 Failed to create IPC log1
125<3>[ 0.107476]@2 Failed to create IPC log2
126<3>[ 0.107481]@2 Failed to create IPC log3
127<3>[ 0.107486]@2 Failed to create IPC log4
128<6>[ 0.107683]@2 kernel boot_mode = normal[0]
129<6>[ 0.109008]@2 platform 994400.qcom,mdss_dsi_pll: assigned reserved memory node dfps_data_mem@83400000
130<6>[ 0.117570]@2 qcom,msm-apm 99e0000.apm: overriding clock sources across APM switch
131<6>[ 0.118359]@2 sps:sps is ready.
132<6>[ 0.118834]@2 i2c-msm-v2 75ba000.i2c: could not find pctldev for node /soc/pinctrl@01010000/i2c_12/i2c_12_active, deferring probe
133<6>[ 0.119412]@2 i2c-msm-v2 757a000.i2c: could not find pctldev for node /soc/pinctrl@01010000/i2c_6/i2c_6_active, deferring probe
134<6>[ 0.119643]@2 i2c-msm-v2 75b5000.i2c: could not find pctldev for node /soc/pinctrl@01010000/i2c_7/i2c_7_active, deferring probe
135<6>[ 0.119884]@2 i2c-msm-v2 7577000.i2c: could not find pctldev for node /soc/pinctrl@01010000/i2c_3/i2c_3_active, deferring probe
136<6>[ 0.120154]@2 i2c-msm-v2 75b6000.i2c: could not find pctldev for node /soc/pinctrl@01010000/i2c_8/i2c_8_active, deferring probe
137<4>[ 0.120469]@2 irq: no irq domain found for /soc/pinctrl@01010000 !
138<3>[ 0.121904]@2 cpu-clock-8996 6400000.qcom,cpu-clock-8996: resources init failed
139<3>[ 0.142410]@2 smd_channel_probe_now: allocation table not initialized
140<3>[ 0.142662]@2 smd_channel_probe_now: allocation table not initialized
141<3>[ 0.142892]@2 smd_channel_probe_now: allocation table not initialized
142<3>[ 0.143131]@2 smd_channel_probe_now: allocation table not initialized
143<6>[ 0.143336]@2 msm_watchdog 9830000.qcom,wdt: wdog absent resource not present
144<6>[ 0.143590]@2 msm_watchdog 9830000.qcom,wdt: MSM Watchdog Initialized
145<6>[ 0.144222]@2 msm_rpm_dev_probe: APSS-RPM communication over GLINK
146<3>[ 0.151827]@2 spmi_pmic_arb 400f000.qcom,spmi: PMIC Arb Version-2 0x20010000
147<3>[ 0.153263]@2 spmi_pmic_arb 400f000.qcom,spmi: missing property: qcom,pmic-arb-max-periph-interrupts
148<6>[ 0.157461]@2 pmi8994_s2: 400 <--> 1015 mV at 1000 mV normal idle
149<6>[ 0.158005]@2 platform 9300000.qcom,lpass: assigned reserved memory node peripheral_region@8ea00000
150<6>[ 0.158236]@2 platform ce0000.qcom,venus: assigned reserved memory node peripheral_region@8ea00000
151<6>[ 0.158599]@2 platform 1c00000.qcom,ssc: assigned reserved memory node peripheral_region@8ea00000
152<6>[ 0.158896]@2 platform 2080000.qcom,mss: assigned reserved memory node modem_region@88800000
153<6>[ 0.161413]@1 msm-thermal 70000.qcom,msm-thermal: msm_thermal:Failed reading node=/soc/qcom,msm-thermal, key=qcom,rpm-phase-resource-type err=-22. KTM continues
154<6>[ 0.161436]@1 msm-thermal 70000.qcom,msm-thermal: msm_thermal:Failed reading node=/soc/qcom,msm-thermal, key=qcom,gfx-sensor-id. err=-22. KTM continues
155<6>[ 0.161455]@1 msm-thermal 70000.qcom,msm-thermal: probe_vdd_mx:Failed reading node=/soc/qcom,msm-thermal, key=qcom,mx-restriction-temp. KTM continues
156<6>[ 0.161469]@1 msm-thermal 70000.qcom,msm-thermal: probe_psm:Failed reading node=/soc/qcom,msm-thermal, key=qcom,pmic-sw-mode-temp. err=-22. KTM continues
157<6>[ 0.161572]@1 msm_thermal:vdd_restriction_reg_init Defer regulator vdd-dig probe
158<3>[ 0.161580]@1 msm_thermal:probe_vdd_rstr Err regulator init. err:-517. KTM continues.
159<6>[ 0.161589]@1 msm-thermal 70000.qcom,msm-thermal: probe_vdd_rstr:Failed reading node=/soc/qcom,msm-thermal, key=qcom,max-freq-level. err=-517. KTM continues
160<3>[ 0.161598]@1 msm_thermal:msm_thermal_dev_probe Failed reading node=/soc/qcom,msm-thermal, key=qcom,online-hotplug-core. err:-517
161<3>[ 0.166640]@2 <CORE> glink_core_register_transport: unable to create log context for [mpss:smem]
162<3>[ 0.167269]@2 <CORE> glink_core_register_transport: unable to create log context for [lpass:smem]
163<3>[ 0.167914]@2 <CORE> glink_core_register_transport: unable to create log context for [dsps:smem]
164<3>[ 0.168407]@2 <CORE> glink_core_register_transport: unable to create log context for [rpm:smem]
165<3>[ 0.168667]@0 smd_channel_probe_now: allocation table not initialized
166<6>[ 0.168783]@1 msm_rpm_trans_notify_state: glink config params: transport=(null), edge=rpm, name=rpm_requests
167<6>[ 0.169382]@2 msm_cache_erp64 6500000.qcom,cache_erp64: Registering for L1 error interrupts
168<6>[ 0.169470]@2 msm_cache_erp64 6500000.qcom,cache_erp64: Registering for L2 error interrupts
169<6>[ 0.169617]@2 msm_cache_erp64 6500000.qcom,cache_erp64: Registering for L3 error interrupts
170<6>[ 0.169845]@2 msm_m4m_erp 9a40000.qcom,m4m_erp64: Registering for M4M error interrupts
171<6>[ 0.173291]@2 console [pstore0] enabled
172<6>[ 0.173443]@2 pstore: Registered ramoops as persistent store backend
173<6>[ 0.173454]@2 ramoops: attached 0x200000@0xac000000, ecc: 0/0
174<3>[ 0.173594]@2 XCB bootloader_log_probe
175<6>[ 0.173814]@2 bootloader_log!
176<6>[ 0.174840]@2 apc0_pwrcl_mem_acc_corner: 0 <--> 0 mV
177<6>[ 0.175177]@2 apc1_perfcl_mem_acc_corner: 0 <--> 0 mV
178<6>[ 0.175495]@2 apcc_l3_mem_acc_corner: 0 <--> 0 mV
179<6>[ 0.175824]@2 gfx_mem_acc_corner: 0 <--> 0 mV
180<6>[ 0.176205]@2 kryo0-retention: 468 <--> 892 mV at 520 mV
181<6>[ 0.176403]@2 kryo0: 468 <--> 892 mV at 754 mV
182<6>[ 0.176545]@2 kryo_regulator_probe: kryo0: default LDO functional volt=754021 uV, LDO retention volt=521789 uV, Vref func=325285 + 4466*(val), cluster-num=0
183<6>[ 0.176877]@2 kryo1-retention: 468 <--> 892 mV at 520 mV
184<6>[ 0.177078]@2 kryo1: 468 <--> 892 mV at 754 mV
185<6>[ 0.177211]@2 kryo_regulator_probe: kryo1: default LDO functional volt=754021 uV, LDO retention volt=521789 uV, Vref func=325285 + 4466*(val), cluster-num=1
186<6>[ 0.181037]@2 platform soc:qcom,kgsl-hyp: assigned reserved memory node peripheral_region@8ea00000
187<3>[ 0.182246]@2 msm_mpm_dev_probe(): Cannot get clk resource for XO: -517
188<4>[ 0.199492]@2 __of_mpm_init(): MPM driver mapping exists
189<6>[ 0.201535]@1 i2c-msm-v2 75ba000.i2c: probing driver i2c-msm-v2
190<3>[ 0.201718]@1 i2c-msm-v2 75ba000.i2c: error on clk_get(core_clk):-517
191<3>[ 0.201735]@1 i2c-msm-v2 75ba000.i2c: error probe() failed with err:-517
192<6>[ 0.202185]@1 i2c-msm-v2 757a000.i2c: probing driver i2c-msm-v2
193<3>[ 0.202269]@1 i2c-msm-v2 757a000.i2c: error on clk_get(core_clk):-517
194<3>[ 0.202283]@1 i2c-msm-v2 757a000.i2c: error probe() failed with err:-517
195<6>[ 0.202685]@1 i2c-msm-v2 75b5000.i2c: probing driver i2c-msm-v2
196<3>[ 0.202769]@1 i2c-msm-v2 75b5000.i2c: error on clk_get(core_clk):-517
197<3>[ 0.202783]@1 i2c-msm-v2 75b5000.i2c: error probe() failed with err:-517
198<6>[ 0.203184]@1 i2c-msm-v2 7577000.i2c: probing driver i2c-msm-v2
199<3>[ 0.203267]@1 i2c-msm-v2 7577000.i2c: error on clk_get(core_clk):-517
200<3>[ 0.203280]@1 i2c-msm-v2 7577000.i2c: error probe() failed with err:-517
201<6>[ 0.203708]@1 i2c-msm-v2 75b6000.i2c: probing driver i2c-msm-v2
202<3>[ 0.203792]@1 i2c-msm-v2 75b6000.i2c: error on clk_get(core_clk):-517
203<3>[ 0.203805]@1 i2c-msm-v2 75b6000.i2c: error probe() failed with err:-517
204<3>[ 0.203989]@1 cpu-clock-8996 6400000.qcom,cpu-clock-8996: resources init failed
205<6>[ 0.204884]@1 pm8994_s1_corner: 0 <--> 0 mV at 0 mV normal idle
206<6>[ 0.205326]@1 pm8994_s1_floor_corner: 0 <--> 0 mV at 0 mV normal idle
207<6>[ 0.205694]@1 pm8994_s1_corner_ao: 0 <--> 0 mV at 0 mV normal idle
208<6>[ 0.206107]@1 pm8994_s2_corner: 0 <--> 0 mV at 0 mV normal idle
209<6>[ 0.206476]@1 pm8994_s2_corner_ao: 0 <--> 0 mV at 0 mV normal idle
210<6>[ 0.206934]@1 pm8994_s3: 1300 mV normal idle
211<6>[ 0.207355]@1 pm8994_s4: 1800 mV normal idle
212<6>[ 0.207774]@1 pm8994_s5: 2150 mV normal idle
213<6>[ 0.208187]@1 pm8994_s7: 800 mV normal idle
214<6>[ 0.208595]@1 pm8994_l1: 1000 mV normal idle
215<6>[ 0.209009]@1 pm8994_l2: 1250 mV normal idle
216<6>[ 0.209711]@1 pm8994_l3: 1100 mV normal idle
217<6>[ 0.210172]@1 pm8994_l4: 1225 mV normal idle
218<6>[ 0.210596]@1 pm8994_l6: 1200 mV normal idle
219<6>[ 0.211004]@1 pm8994_l8: 1800 mV normal idle
220<6>[ 0.211402]@1 pm8994_l9: 1800 mV normal idle
221<6>[ 0.211797]@1 pm8994_l10: 1800 mV normal idle
222<6>[ 0.212206]@1 pm8994_l11: 1150 mV normal idle
223<6>[ 0.212623]@1 pm8994_l12: 1800 mV normal idle
224<6>[ 0.213484]@1 pm8994_l13: 29500 <--> 2950 mV at 2950 mV normal idle
225<6>[ 0.213912]@1 pm8994_l15: 1800 mV normal idle
226<6>[ 0.214326]@1 pm8994_l16: 2700 mV normal idle
227<6>[ 0.214737]@1 pm8994_l17: 2600 mV normal idle
228<6>[ 0.215149]@1 pm8994_l18: 3300 mV normal idle
229<6>[ 0.215556]@1 pm8994_l19: 3000 mV normal idle
230<6>[ 0.215966]@1 pm8994_l20: 2950 mV normal idle
231<6>[ 0.216374]@1 pm8994_l21: 2950 mV normal idle
232<6>[ 0.216825]@1 pm8994_l22: 3000 <--> 3300 mV at 3000 mV normal idle
233<6>[ 0.217234]@1 pm8994_l23: 2800 mV normal idle
234<6>[ 0.217644]@1 pm8994_l24: 3075 mV normal idle
235<6>[ 0.218061]@1 pm8994_l25: 1200 mV normal idle
236<6>[ 0.218800]@1 pm8994_l26_corner: 0 <--> 0 mV at 0 mV normal idle
237<6>[ 0.219174]@1 pm8994_l26_floor_corner: 0 <--> 0 mV at 0 mV normal idle
238<6>[ 0.219584]@1 pm8994_l27: 1200 mV normal idle
239<6>[ 0.220001]@1 pm8994_l28: 925 mV normal idle
240<6>[ 0.220747]@1 pm8994_l29: 2800 mV normal idle
241<6>[ 0.221168]@1 pm8994_l30: 1800 mV normal idle
242<6>[ 0.221576]@1 pm8994_l32: 1800 mV normal idle
243<6>[ 0.221969]@1 pm8994_lvs1: no parameters
244<6>[ 0.222336]@1 pm8994_lvs2: no parameters
245<6>[ 0.222710]@1 pmi8994_s1: 1025 mV normal idle
246<6>[ 0.223105]@1 pmi8994_boost_5v: no parameters
247<3>[ 0.223247]@1 qcom,rpm-smd-regulator soc:qcom,rpm-smd:rpm-regulator-bstb:regulator-bst: Failed to find supply parent
248<3>[ 0.223389]@1 rpm_vreg_device_probe: regulator_register failed: pmi8994_boost_5v, rc=-517
249<6>[ 0.223711]@1 pmi8994_boost_pin_ctrl: no parameters
250<3>[ 0.223803]@1 qcom,rpm-smd-regulator soc:qcom,rpm-smd:rpm-regulator-bstb:regulator-bst-pin-ctrl: Failed to find supply parent
251<3>[ 0.223896]@1 rpm_vreg_device_probe: regulator_register failed: pmi8994_boost_pin_ctrl, rc=-517
252<6>[ 0.224243]@1 pmi8994_boostbypass: 3150 <--> 3600 mV at 3150 mV normal idle
253<6>[ 0.224586]@1 pm8994_s11: 470 <--> 1140 mV at 905 mV normal idle
254<6>[ 0.224800]@1 pm8994_s11_avs_limit: 470 <--> 1140 mV
255<6>[ 0.224908]@1 spm_regulator_probe: name=pm8994_s11, range=LV, voltage=905000 uV, mode=AUTO, step rate=2400 uV/us
256<6>[ 0.225702]@1 msm-thermal 70000.qcom,msm-thermal: msm_thermal:Failed reading node=/soc/qcom,msm-thermal, key=qcom,rpm-phase-resource-type err=-22. KTM continues
257<6>[ 0.225728]@1 msm-thermal 70000.qcom,msm-thermal: msm_thermal:Failed reading node=/soc/qcom,msm-thermal, key=qcom,gfx-sensor-id. err=-22. KTM continues
258<6>[ 0.225741]@1 msm_thermal:sensor_mgr_init_threshold threshold id already initialized
259<6>[ 0.225756]@1 msm-thermal 70000.qcom,msm-thermal: probe_vdd_mx:Failed reading node=/soc/qcom,msm-thermal, key=qcom,mx-restriction-temp. KTM continues
260<6>[ 0.225773]@1 msm-thermal 70000.qcom,msm-thermal: probe_psm:Failed reading node=/soc/qcom,msm-thermal, key=qcom,pmic-sw-mode-temp. err=-22. KTM continues
261<6>[ 0.226160]@1 msm_thermal:vdd_restriction_reg_init Defer regulator vdd-gfx probe
262<3>[ 0.226179]@1 msm_thermal:probe_vdd_rstr Err regulator init. err:-517. KTM continues.
263<6>[ 0.226192]@1 msm-thermal 70000.qcom,msm-thermal: probe_vdd_rstr:Failed reading node=/soc/qcom,msm-thermal, key=qcom,max-freq-level. err=-517. KTM continues
264<3>[ 0.226204]@1 msm_thermal:msm_thermal_dev_probe Failed reading node=/soc/qcom,msm-thermal, key=qcom,online-hotplug-core. err:-517
265<3>[ 0.227050]@1 msm_mpm_dev_probe(): Cannot get clk resource for XO: -517
266<6>[ 0.227522]@1 i2c-msm-v2 75ba000.i2c: probing driver i2c-msm-v2
267<3>[ 0.227616]@1 i2c-msm-v2 75ba000.i2c: error on clk_get(core_clk):-517
268<3>[ 0.227631]@1 i2c-msm-v2 75ba000.i2c: error probe() failed with err:-517
269<6>[ 0.228026]@1 i2c-msm-v2 757a000.i2c: probing driver i2c-msm-v2
270<3>[ 0.228108]@1 i2c-msm-v2 757a000.i2c: error on clk_get(core_clk):-517
271<3>[ 0.228122]@1 i2c-msm-v2 757a000.i2c: error probe() failed with err:-517
272<6>[ 0.228508]@1 i2c-msm-v2 75b5000.i2c: probing driver i2c-msm-v2
273<3>[ 0.228590]@1 i2c-msm-v2 75b5000.i2c: error on clk_get(core_clk):-517
274<3>[ 0.228604]@1 i2c-msm-v2 75b5000.i2c: error probe() failed with err:-517
275<6>[ 0.228984]@1 i2c-msm-v2 7577000.i2c: probing driver i2c-msm-v2
276<3>[ 0.229063]@1 i2c-msm-v2 7577000.i2c: error on clk_get(core_clk):-517
277<3>[ 0.229077]@1 i2c-msm-v2 7577000.i2c: error probe() failed with err:-517
278<6>[ 0.229421]@1 i2c-msm-v2 75b6000.i2c: probing driver i2c-msm-v2
279<3>[ 0.229500]@1 i2c-msm-v2 75b6000.i2c: error on clk_get(core_clk):-517
280<3>[ 0.229514]@1 i2c-msm-v2 75b6000.i2c: error probe() failed with err:-517
281<3>[ 0.229822]@1 cpu-clock-8996 6400000.qcom,cpu-clock-8996: resources init failed
282<6>[ 0.248905]@1 qcom,gcc-8996 300000.qcom,gcc: Registered GCC clocks.
283<6>[ 0.249894]@1 vfe0_clk_src: set OPP pair(75000000 Hz: 3 uV) on a10000.qcom,vfe0
284<6>[ 0.249920]@1 vfe0_clk_src: set OPP pair(320000000 Hz: 5 uV) on a10000.qcom,vfe0
285<6>[ 0.249932]@1 vfe0_clk_src: set OPP pair(600000000 Hz: 7 uV) on a10000.qcom,vfe0
286<6>[ 0.250300]@1 vfe1_clk_src: set OPP pair(75000000 Hz: 3 uV) on a14000.qcom,vfe1
287<6>[ 0.250322]@1 vfe1_clk_src: set OPP pair(320000000 Hz: 5 uV) on a14000.qcom,vfe1
288<6>[ 0.250333]@1 vfe1_clk_src: set OPP pair(600000000 Hz: 7 uV) on a14000.qcom,vfe1
289<6>[ 0.250691]@1 cpp_clk_src: set OPP pair(100000000 Hz: 3 uV) on a04000.qcom,cpp
290<6>[ 0.250709]@1 cpp_clk_src: set OPP pair(480000000 Hz: 5 uV) on a04000.qcom,cpp
291<6>[ 0.250719]@1 cpp_clk_src: set OPP pair(640000000 Hz: 7 uV) on a04000.qcom,cpp
292<6>[ 0.259684]@1 qcom,mmsscc-8996 8c0000.qcom,mmsscc: Registered MMSS clocks.
293<6>[ 0.261327]@1 pmi8994_boost_5v: no parameters
294<3>[ 0.261467]@1 qcom,rpm-smd-regulator soc:qcom,rpm-smd:rpm-regulator-bstb:regulator-bst: Failed to find supply parent
295<3>[ 0.261564]@1 rpm_vreg_device_probe: regulator_register failed: pmi8994_boost_5v, rc=-517
296<6>[ 0.261777]@1 pmi8994_boost_pin_ctrl: no parameters
297<3>[ 0.261840]@1 qcom,rpm-smd-regulator soc:qcom,rpm-smd:rpm-regulator-bstb:regulator-bst-pin-ctrl: Failed to find supply parent
298<3>[ 0.261928]@1 rpm_vreg_device_probe: regulator_register failed: pmi8994_boost_pin_ctrl, rc=-517
299<6>[ 0.262688]@1 msm-thermal 70000.qcom,msm-thermal: msm_thermal:Failed reading node=/soc/qcom,msm-thermal, key=qcom,rpm-phase-resource-type err=-22. KTM continues
300<6>[ 0.262714]@1 msm-thermal 70000.qcom,msm-thermal: msm_thermal:Failed reading node=/soc/qcom,msm-thermal, key=qcom,gfx-sensor-id. err=-22. KTM continues
301<6>[ 0.262727]@1 msm_thermal:sensor_mgr_init_threshold threshold id already initialized
302<6>[ 0.262741]@1 msm-thermal 70000.qcom,msm-thermal: probe_vdd_mx:Failed reading node=/soc/qcom,msm-thermal, key=qcom,mx-restriction-temp. KTM continues
303<6>[ 0.262757]@1 msm-thermal 70000.qcom,msm-thermal: probe_psm:Failed reading node=/soc/qcom,msm-thermal, key=qcom,pmic-sw-mode-temp. err=-22. KTM continues
304<6>[ 0.263004]@1 msm_thermal:vdd_restriction_reg_init Defer regulator vdd-gfx probe
305<3>[ 0.263018]@1 msm_thermal:probe_vdd_rstr Err regulator init. err:-517. KTM continues.
306<6>[ 0.263030]@1 msm-thermal 70000.qcom,msm-thermal: probe_vdd_rstr:Failed reading node=/soc/qcom,msm-thermal, key=qcom,max-freq-level. err=-517. KTM continues
307<3>[ 0.263042]@1 msm_thermal:msm_thermal_dev_probe Failed reading node=/soc/qcom,msm-thermal, key=qcom,online-hotplug-core. err:-517
308<6>[ 0.263756]@1 cpr3_msm8996_hmss_read_fuse_data: apc0_pwrcl_corner: speed bin = 0
309<6>[ 0.263777]@1 cpr3_msm8996_hmss_read_fuse_data: apc0_pwrcl_corner: CPR fusing revision = 6
310<6>[ 0.263787]@1 cpr3_msm8996_hmss_read_fuse_data: apc0_pwrcl_corner: using redundant fuses = N
311<6>[ 0.263798]@1 cpr3_msm8996_hmss_read_fuse_data: apc0_pwrcl_corner: CPR limitation = none
312<6>[ 0.263808]@1 cpr3_msm8996_hmss_read_fuse_data: apc0_pwrcl_corner: CPR partial binning limitation = none
313<6>[ 0.263819]@1 cpr3_msm8996_hmss_read_fuse_data: apc0_pwrcl_corner: Retention voltage fuses: VDD_MX = 4, VDD_APCC = 4
314<6>[ 0.264033]@1 cpr3_hmss_kvreg_init: apc0_pwrcl_corner: LDO min headroom=150000 uV, LDO max headroom=470000 uV, LDO adj=0 uV, LDO mode=allowed, LDO retention=490000 uV
315<6>[ 0.264220]@1 cpr3_msm8996_hmss_calculate_open_loop_voltages: apc0_pwrcl_corner: fused MinSVS: open-loop= 595000 uV
316<6>[ 0.264234]@1 cpr3_msm8996_hmss_calculate_open_loop_voltages: apc0_pwrcl_corner: fused SVS: open-loop= 695000 uV
317<6>[ 0.264244]@1 cpr3_msm8996_hmss_calculate_open_loop_voltages: apc0_pwrcl_corner: fused NOM: open-loop= 815000 uV
318<6>[ 0.264253]@1 cpr3_msm8996_hmss_calculate_open_loop_voltages: apc0_pwrcl_corner: fused TURBO: open-loop= 930000 uV
319<6>[ 0.264333]@1 cpr3_msm8996_hmss_calculate_target_quotients: apc0_pwrcl_corner: fused MinSVS: quot[ 7]= 326
320<6>[ 0.264342]@1 cpr3_msm8996_hmss_calculate_target_quotients: apc0_pwrcl_corner: fused SVS: quot[ 7]= 505, quot_offset[ 7]= 140
321<6>[ 0.264353]@1 cpr3_msm8996_hmss_calculate_target_quotients: apc0_pwrcl_corner: fused NOM: quot[ 7]= 742, quot_offset[ 7]= 235
322<6>[ 0.264363]@1 cpr3_msm8996_hmss_calculate_target_quotients: apc0_pwrcl_corner: fused TURBO: quot[ 7]= 944, quot_offset[ 7]= 200
323<6>[ 0.264481]@1 cpr3_msm8996_hmss_read_fuse_data: apc0_cbf_corner: speed bin = 0
324<6>[ 0.264490]@1 cpr3_msm8996_hmss_read_fuse_data: apc0_cbf_corner: CPR fusing revision = 6
325<6>[ 0.264500]@1 cpr3_msm8996_hmss_read_fuse_data: apc0_cbf_corner: using redundant fuses = N
326<6>[ 0.264510]@1 cpr3_msm8996_hmss_read_fuse_data: apc0_cbf_corner: CPR limitation = none
327<6>[ 0.264519]@1 cpr3_msm8996_hmss_read_fuse_data: apc0_cbf_corner: CPR partial binning limitation = none
328<6>[ 0.264530]@1 cpr3_msm8996_hmss_read_fuse_data: apc0_cbf_corner: Retention voltage fuses: VDD_MX = 4, VDD_APCC = 4
329<6>[ 0.264656]@1 cpr3_msm8996_hmss_calculate_open_loop_voltages: apc0_cbf_corner: fused MinSVS: open-loop= 595000 uV
330<6>[ 0.264666]@1 cpr3_msm8996_hmss_calculate_open_loop_voltages: apc0_cbf_corner: fused SVS: open-loop= 695000 uV
331<6>[ 0.264675]@1 cpr3_msm8996_hmss_calculate_open_loop_voltages: apc0_cbf_corner: fused NOM: open-loop= 815000 uV
332<6>[ 0.264684]@1 cpr3_msm8996_hmss_calculate_open_loop_voltages: apc0_cbf_corner: fused TURBO: open-loop= 930000 uV
333<6>[ 0.264724]@1 cpr3_msm8996_hmss_calculate_target_quotients: apc0_cbf_corner: fused MinSVS: quot[ 7]= 326
334<6>[ 0.264733]@1 cpr3_msm8996_hmss_calculate_target_quotients: apc0_cbf_corner: fused SVS: quot[ 7]= 505, quot_offset[ 7]= 140
335<6>[ 0.264742]@1 cpr3_msm8996_hmss_calculate_target_quotients: apc0_cbf_corner: fused NOM: quot[ 7]= 742, quot_offset[ 7]= 235
336<6>[ 0.264752]@1 cpr3_msm8996_hmss_calculate_target_quotients: apc0_cbf_corner: fused TURBO: quot[ 7]= 944, quot_offset[ 7]= 200
337<6>[ 0.264850]@1 cpr3_msm8996_hmss_read_fuse_data: apc1_corner: speed bin = 0
338<6>[ 0.264859]@1 cpr3_msm8996_hmss_read_fuse_data: apc1_corner: CPR fusing revision = 6
339<6>[ 0.264869]@1 cpr3_msm8996_hmss_read_fuse_data: apc1_corner: using redundant fuses = N
340<6>[ 0.264878]@1 cpr3_msm8996_hmss_read_fuse_data: apc1_corner: CPR limitation = none
341<6>[ 0.264887]@1 cpr3_msm8996_hmss_read_fuse_data: apc1_corner: CPR partial binning limitation = none
342<6>[ 0.264898]@1 cpr3_msm8996_hmss_read_fuse_data: apc1_corner: Retention voltage fuses: VDD_MX = 4, VDD_APCC = 4
343<6>[ 0.265122]@1 cpr3_hmss_kvreg_init: apc1_corner: LDO min headroom=150000 uV, LDO max headroom=470000 uV, LDO adj=0 uV, LDO mode=allowed, LDO retention=490000 uV
344<6>[ 0.265328]@1 cpr3_msm8996_hmss_calculate_open_loop_voltages: apc1_corner: fused MinSVS: open-loop= 585000 uV
345<6>[ 0.265342]@1 cpr3_msm8996_hmss_calculate_open_loop_voltages: apc1_corner: fused SVS: open-loop= 655000 uV
346<6>[ 0.265351]@1 cpr3_msm8996_hmss_calculate_open_loop_voltages: apc1_corner: fused NOM: open-loop= 745000 uV
347<6>[ 0.265359]@1 cpr3_msm8996_hmss_calculate_open_loop_voltages: apc1_corner: fused TURBO: open-loop= 990000 uV
348<6>[ 0.265464]@1 cpr3_msm8996_hmss_calculate_target_quotients: apc1_corner: fused MinSVS: quot[ 7]= 307
349<6>[ 0.265474]@1 cpr3_msm8996_hmss_calculate_target_quotients: apc1_corner: fused SVS: quot[ 7]= 423, quot_offset[ 7]= 75
350<6>[ 0.265484]@1 cpr3_msm8996_hmss_calculate_target_quotients: apc1_corner: fused NOM: quot[ 7]= 603, quot_offset[ 7]= 180
351<6>[ 0.265494]@1 cpr3_msm8996_hmss_calculate_target_quotients: apc1_corner: fused TURBO: quot[ 7]=1047, quot_offset[ 7]= 440
352<6>[ 0.265941]@1 cpr3_regulator_init_ctrl: apcc: Default CPR mode = SW closed-loop
353<6>apc0_pwrcl_corner: 0 <--> 0 mV at 0 mV
354<6>[ 0.266301]@1 apc0_cbf_corner: 0 <--> 0 mV at 0 mV
355<6>[ 0.269197]@1 cpr3_regulator_measure_aging: apcc: average quotient delta=1 (count=10)
356<6>[ 0.269231]@1 cpr3_regulator_aging_adjust: apcc: aging measurement successful; aging reference adjustment voltage=1562 uV
357<6>[ 0.269539]@1 apc1_corner: 0 <--> 0 mV at 0 mV
358<6>[ 0.271090]@2 cpr3_msm8996_mmss_read_fuse_data: gfx_corner: CPR fusing revision = 4
359<6>[ 0.271109]@2 cpr3_msm8996_mmss_read_fuse_data: gfx_corner: CPR limitation = none
360<6>[ 0.271368]@2 cpr3_msm8996_mmss_calculate_open_loop_voltages: gfx_corner: fuse_corner[0] open-loop= 640000 uV
361<6>[ 0.271379]@2 cpr3_msm8996_mmss_calculate_open_loop_voltages: gfx_corner: fuse_corner[1] open-loop= 685000 uV
362<6>[ 0.271388]@2 cpr3_msm8996_mmss_calculate_open_loop_voltages: gfx_corner: fuse_corner[2] open-loop= 815000 uV
363<6>[ 0.271397]@2 cpr3_msm8996_mmss_calculate_open_loop_voltages: gfx_corner: fuse_corner[3] open-loop= 895000 uV
364<6>[ 0.271555]@2 cpr3_regulator_init_ctrl: gfx: Default CPR mode = closed-loop
365<6>gfx_corner: 0 <--> 0 mV at 0 mV
366<6>[ 0.272945]@2 i2c-msm-v2 75ba000.i2c: probing driver i2c-msm-v2
367<3>[ 0.273023]@2 AXI: msm_bus_scale_register_client(): msm_bus_scale_register_client: Bus driver not ready.
368<6>i2c-msm-v2 75ba000.i2c: msm_bus_scale_register_client(mstr-id:84):0 (not a problem)
369<6>i2c-msm-v2 757a000.i2c: probing driver i2c-msm-v2
370<3>[ 0.274299]@2 AXI: msm_bus_scale_register_client(): msm_bus_scale_register_client: Bus driver not ready.
371<6>i2c-msm-v2 757a000.i2c: msm_bus_scale_register_client(mstr-id:86):0 (not a problem)
372<6>i2c-msm-v2 75b5000.i2c: probing driver i2c-msm-v2
373<3>[ 0.275842]@3 AXI: msm_bus_scale_register_client(): msm_bus_scale_register_client: Bus driver not ready.
374<6>i2c-msm-v2 75b5000.i2c: msm_bus_scale_register_client(mstr-id:84):0 (not a problem)
375<6>i2c-msm-v2 7577000.i2c: probing driver i2c-msm-v2
376<3>[ 0.277358]@3 AXI: msm_bus_scale_register_client(): msm_bus_scale_register_client: Bus driver not ready.
377<6>i2c-msm-v2 7577000.i2c: msm_bus_scale_register_client(mstr-id:86):0 (not a problem)
378<6>i2c-msm-v2 75b6000.i2c: probing driver i2c-msm-v2
379<3>[ 0.278270]@3 AXI: msm_bus_scale_register_client(): msm_bus_scale_register_client: Bus driver not ready.
380<6>i2c-msm-v2 75b6000.i2c: msm_bus_scale_register_client(mstr-id:84):0 (not a problem)
381<6>cpu-clock-8996 6400000.qcom,cpu-clock-8996: using perf/pwr/cbf speed bin 0 and pvs_ver 0
382<6>[ 0.281440]@3 clock-cpu-8996: set OPP pair (307200000 Hz, 615000 uv) on cpu0
383<6>[ 0.281485]@3 clock-cpu-8996: set OPP pair (1728000000 Hz, 905000 uv) on cpu0
384<6>[ 0.281504]@3 clock-cpu-8996: set OPP pair (307200000 Hz, 615000 uv) on cpu1
385<6>[ 0.281541]@3 clock-cpu-8996: set OPP pair (1728000000 Hz, 905000 uv) on cpu1
386<6>[ 0.281559]@3 clock-cpu-8996: set OPP pair (307200000 Hz, 605000 uv) on cpu2
387<6>[ 0.281614]@3 clock-cpu-8996: set OPP pair (2265600000 Hz, 975000 uv) on cpu2
388<6>[ 0.281631]@3 clock-cpu-8996: set OPP pair (307200000 Hz, 605000 uv) on cpu3
389<6>[ 0.281679]@3 clock-cpu-8996: set OPP pair (2265600000 Hz, 975000 uv) on cpu3
390<6>[ 0.281799]@3 clock-cpu-8996: set OPP pair (307200000 Hz, 640000 uv) on soc:qcom,m4m
391<6>[ 0.281841]@3 clock-cpu-8996: set OPP pair (1593600000 Hz, 905000 uv) on soc:qcom,m4m
392<6>[ 0.282170]@3 qcom,gpucc-8996 8c0000.qcom,gpucc: using speed bin 0
393<6>[ 0.282506]@3 gfx3d_clk_src_v2: set OPP pair(133000000 Hz: 570000 uV) on b00000.qcom,kgsl-3d0
394<6>[ 0.282532]@3 gfx3d_clk_src_v2: set OPP pair(624000000 Hz: 895000 uV) on b00000.qcom,kgsl-3d0
395<6>[ 0.283941]@3 qcom,gpucc-8996 8c0000.qcom,gpucc: Registered GPU clocks.
396<6>[ 0.284156]@3 pmi8994_boost_5v: no parameters
397<3>[ 0.284215]@3 qcom,rpm-smd-regulator soc:qcom,rpm-smd:rpm-regulator-bstb:regulator-bst: Failed to find supply parent
398<3>[ 0.284312]@3 rpm_vreg_device_probe: regulator_register failed: pmi8994_boost_5v, rc=-517
399<6>[ 0.284500]@3 pmi8994_boost_pin_ctrl: no parameters
400<3>[ 0.284542]@3 qcom,rpm-smd-regulator soc:qcom,rpm-smd:rpm-regulator-bstb:regulator-bst-pin-ctrl: Failed to find supply parent
401<3>[ 0.284628]@3 rpm_vreg_device_probe: regulator_register failed: pmi8994_boost_pin_ctrl, rc=-517
402<6>[ 0.285337]@3 msm-thermal 70000.qcom,msm-thermal: msm_thermal:Failed reading node=/soc/qcom,msm-thermal, key=qcom,rpm-phase-resource-type err=-22. KTM continues
403<6>[ 0.285356]@3 msm-thermal 70000.qcom,msm-thermal: msm_thermal:Failed reading node=/soc/qcom,msm-thermal, key=qcom,gfx-sensor-id. err=-22. KTM continues
404<6>[ 0.285370]@3 msm_thermal:sensor_mgr_init_threshold threshold id already initialized
405<6>[ 0.285383]@3 msm-thermal 70000.qcom,msm-thermal: probe_vdd_mx:Failed reading node=/soc/qcom,msm-thermal, key=qcom,mx-restriction-temp. KTM continues
406<6>[ 0.285399]@3 msm-thermal 70000.qcom,msm-thermal: probe_psm:Failed reading node=/soc/qcom,msm-thermal, key=qcom,pmic-sw-mode-temp. err=-22. KTM continues
407<3>[ 0.285635]@3 msm_thermal:update_cpu_freq Unable to update policy for cpu:0. err:-19
408<3>[ 0.285650]@3 msm_thermal:update_cpu_freq Unable to update policy for cpu:2. err:-19
409<3>[ 0.285661]@3 msm_thermal:update_cpu_freq Unable to update policy for cpu:2. err:-19
410<3>[ 0.285678]@3 msm-thermal 70000.qcom,msm-thermal: probe_ocr:Failed reading node=/soc/qcom,msm-thermal, key=qcom,pmic-opt-curr-temp err:-22. KTM continues
411<3>[ 0.286563]@3 msm_thermal:update_cpu_freq Unable to update policy for cpu:0. err:-19
412<3>[ 0.286580]@3 msm_thermal:update_cpu_freq Unable to update policy for cpu:2. err:-19
413<3>[ 0.286591]@3 msm_thermal:update_cpu_freq Unable to update policy for cpu:2. err:-19
414<6>[ 0.286777]@2 pmi8994_boost_5v: no parameters
415<3>[ 0.286840]@2 qcom,rpm-smd-regulator soc:qcom,rpm-smd:rpm-regulator-bstb:regulator-bst: Failed to find supply parent
416<3>[ 0.286938]@2 rpm_vreg_device_probe: regulator_register failed: pmi8994_boost_5v, rc=-517
417<6>[ 0.287147]@2 pmi8994_boost_pin_ctrl: no parameters
418<3>[ 0.287189]@2 qcom,rpm-smd-regulator soc:qcom,rpm-smd:rpm-regulator-bstb:regulator-bst-pin-ctrl: Failed to find supply parent
419<3>[ 0.287277]@2 rpm_vreg_device_probe: regulator_register failed: pmi8994_boost_pin_ctrl, rc=-517
420<6>[ 0.344075]@2 KPI: Bootloader start count = 32819
421<6>[ 0.344094]@2 KPI: Bootloader end count = 419343
422<6>[ 0.344103]@2 KPI: Bootloader display count = 419068
423<6>[ 0.344111]@2 KPI: Bootloader load kernel count = 2490
424<6>[ 0.344121]@2 KPI: Kernel MPM timestamp = 440622
425<6>[ 0.344128]@2 KPI: Kernel MPM Clock frequency = 32768
426<6>[ 0.344143]@2 socinfo_print: v0.11, id=246, ver=3.1, raw_id=2375, raw_ver=4, hw_plat=8, hw_plat_ver=65536
427<6> accessory_chip=0, hw_plat_subtype=0, pmic_model=65545, pmic_die_revision=131072 foundry_id=3 serial_number=3140558133 num_pmics=2
428<6>[ 0.344175]@2 init_project_info: project_name: 15801, fw_version: 1, hw_version: 16, rf_v1: 21, rf_v2: 1, rf_v3: 0
429<3>[ 0.344188]@2 init_project_info: aboard_version: 1
430<3>[ 0.345040]@2 op_rf_cable_probe: ftm_mode FOUND! use 1 always
431<3>[ 0.345056]@2 modify_rf_cable_smem_info: rf_cable: 1
432<3>[ 0.345064]@2 op_rf_cable_probe: probe ok!
433<6>[ 0.345406]@2 gdsc_mmagic_bimc: no parameters
434<6>[ 0.346000]@2 rome_vreg: no parameters
435<6>[ 0.346493]@2 vgaarb: loaded
436<5>[ 0.347837]@2 SCSI subsystem initialized
437<6>[ 0.348760]@2 usbcore: registered new interface driver usbfs
438<6>[ 0.348814]@2 usbcore: registered new interface driver hub
439<6>[ 0.348955]@2 usbcore: registered new device driver usb
440<4>[ 0.349294]@2 soc:usb_nop_phy supply vcc not found, using dummy regulator
441<6>[ 0.349876]@2 media: Linux media interface: v0.10
442<6>[ 0.349920]@2 Linux video capture interface: v2.00
443<6>[ 0.363797]@2 cpufreq: driver msm up and running
444<6>[ 0.364444]@2 platform soc:qcom,ion:qcom,ion-heap@27: assigned reserved memory node qseecom_region
445<6>[ 0.364550]@2 platform soc:qcom,ion:qcom,ion-heap@10: assigned reserved memory node secure_region
446<6>[ 0.364764]@2 ION heap system created
447<6>[ 0.364874]@3 ION heap kmalloc created
448<6>[ 0.364884]@3 ION heap adsp created at 0x00000000f6800000 with size 2000000
449<6>[ 0.364893]@3 ION heap qsecom created at 0x00000000fe400000 with size 1400000
450<6>[ 0.364905]@3 ION heap secure_display created at 0x00000000f8800000 with size 5c00000
451<6>[ 0.364915]@3 ION heap secure_heap created
452<3>[ 0.365655]@3 msm_bus_fabric_init_driver
453<3>[ 0.368247]@3 msm-bus-type fab-a0noc: Error: Failed to get regulator bus-gdsc:-517
454<3>[ 0.368259]@3 msm-bus-type fab-a0noc: Error: Failed to get regulator bus-a-gdsc:-517
455<3>[ 0.370984]@3 msm-bus-type slv-vmem-cfg: Error: Failed to get regulator node-gdsc:-517
456<3>[ 0.371407]@3 msm-bus-type slv-vmem: Error: Failed to get regulator node-gdsc:-517
457<3>[ 0.376946]@3 msm-bus-type fab-a0noc: Error: Failed to get regulator aggre0-snoc-axi-no-rate:-517
458<3>[ 0.376957]@3 msm-bus-type fab-a0noc: Error: Failed to get regulator aggre0-snoc-axi-no-rate:-517
459<3>[ 0.376967]@3 msm-bus-type fab-a0noc: Error: Failed to get regulator aggre0-snoc-axi-no-rate:-517
460<3>[ 0.377075]@3 msm-bus-type fab-mnoc: Error: Failed to get regulator mmagic-mdss-axi-no-rate:-517
461<3>[ 0.377097]@3 msm-bus-type fab-mnoc: Error: Failed to get regulator mmagic-mdss-axi-no-rate:-517
462<3>[ 0.377117]@3 msm-bus-type fab-mnoc: Error: Failed to get regulator mmagic-mdss-axi-no-rate:-517
463<3>[ 0.377136]@3 msm-bus-type fab-mnoc: Error: Failed to get regulator mmagic-mdss-axi-no-rate:-517
464<3>[ 0.377155]@3 msm-bus-type fab-mnoc: Error: Failed to get regulator mmagic-mdss-axi-no-rate:-517
465<3>[ 0.377174]@3 msm-bus-type fab-mnoc: Error: Failed to get regulator mmagic-mdss-axi-no-rate:-517
466<3>[ 0.377193]@3 msm-bus-type fab-mnoc: Error: Failed to get regulator mmagic-mdss-axi-no-rate:-517
467<6>[ 0.378423]@3 qcom,qpnp-power-on qpnp-power-on-ffffffc175d2dc00: PMIC@SID0 Power-on reason: Triggered from Hard Reset and 'cold' boot
468<6>[ 0.378444]@3 qcom,qpnp-power-on qpnp-power-on-ffffffc175d2dc00: PMIC@SID0: Power-off reason: Triggered from PS_HOLD (PS_HOLD/MSM controlled shutdown)
469<6>[ 0.378555]@3 input: qpnp_pon as /devices/virtual/input/input0
470<6>[ 0.379036]@3 pon_spare_reg: no parameters
471<6>[ 0.379090]@3 qcom,qpnp-power-on qpnp-power-on-ffffffc175d49000: No PON config. specified
472<6>[ 0.379145]@3 qcom,qpnp-power-on qpnp-power-on-ffffffc175d49000: PMIC@SID2 Power-on reason: Triggered from Hard Reset and 'cold' boot
473<6>[ 0.379161]@3 qcom,qpnp-power-on qpnp-power-on-ffffffc175d49000: PMIC@SID2: Power-off reason: Triggered from PS_HOLD (PS_HOLD/MSM controlled shutdown)
474<6>[ 0.379315]@3 PMIC@SID0: PM8994 v2.0 options: 0, 0, 2, 2
475<6>[ 0.379398]@3 PMIC@SID2: PMI8996 v1.1 options: 0, 0, 0, 0
476<3>[ 0.380413]@3 ipa ipa_uc_state_check:291 uC interface not initialized
477<3>[ 0.380426]@3 ipa ipa_sps_irq_control_all:925 EP (2) not allocated.
478<3>[ 0.380431]@3 ipa ipa_sps_irq_control_all:925 EP (5) not allocated.
479<3>[ 0.382190]@3 sps_register_bam_device : unable to create IPC Logging 0 for bam 0x0000000000684000
480<3>sps_register_bam_device : unable to create IPC Logging 1 for bam 0x0000000000684000sps_register_bam_device : unable to create IPC Logging 2 for bam 0x0000000000684000
481<3>sps_register_bam_device : unable to create IPC Logging 3 for bam 0x0000000000684000sps_register_bam_device : unable to create IPC Logging 4 for bam 0x0000000000684000
482<6>sps:BAM 0x0000000000684000 is registered.<3>ipa ipa_uc_state_check:291 uC interface not initialized
483<6>[ 0.383086]@3 sps:BAM 0x0000000000684000 (va:0xffffff80020c0000) enabled: ver:0x27, number of pipes:20
484<3>[ 0.384572]@3 ipa ipa_uc_state_check:291 uC interface not initialized
485<3>[ 0.393236]@3 ipa ipa_uc_state_check:291 uC interface not initialized
486<6>[ 0.394899]@3 IPA driver initialization was successful.
487<6>[ 0.396114]@3 gdsc_mmagic_video: no parameters
488<6>[ 0.396329]@3 gdsc_mmagic_mdss: no parameters
489<6>[ 0.396492]@3 gdsc_mmagic_camss: no parameters
490<6>[ 0.396779]@3 gdsc_venus: no parameters
491<6>[ 0.396801]@3 gdsc_venus: supplied by gdsc_mmagic_video
492<6>[ 0.396993]@3 gdsc_venus_core0: fast normal
493<6>[ 0.397157]@3 gdsc_venus_core1: fast normal
494<6>[ 0.397336]@3 gdsc_camss_top: no parameters
495<6>[ 0.397353]@3 gdsc_camss_top: supplied by gdsc_mmagic_camss
496<6>[ 0.397529]@3 gdsc_vfe0: no parameters
497<6>[ 0.397548]@3 gdsc_vfe0: supplied by gdsc_camss_top
498<6>[ 0.397735]@3 gdsc_vfe1: no parameters
499<6>[ 0.397754]@3 gdsc_vfe1: supplied by gdsc_camss_top
500<6>[ 0.397934]@3 gdsc_mdss: no parameters
501<6>[ 0.397953]@3 gdsc_mdss: supplied by gdsc_mmagic_mdss
502<6>[ 0.398226]@3 gdsc_jpeg: no parameters
503<6>[ 0.398242]@3 gdsc_jpeg: supplied by gdsc_camss_top
504<6>[ 0.398431]@3 gdsc_cpp: no parameters
505<6>[ 0.398448]@3 gdsc_cpp: supplied by gdsc_camss_top
506<6>[ 0.398614]@3 gdsc_pcie_0: no parameters
507<6>[ 0.398769]@3 gdsc_pcie_1: no parameters
508<6>[ 0.398920]@3 gdsc_pcie_2: no parameters
509<6>[ 0.399074]@3 gdsc_usb30: no parameters
510<6>[ 0.399209]@3 gdsc_ufs: no parameters
511<6>[ 0.399404]@3 gdsc_fd: no parameters
512<6>[ 0.399424]@3 gdsc_fd: supplied by gdsc_camss_top
513<6>[ 0.399602]@3 gdsc_gpu: no parameters
514<6>[ 0.399783]@3 gdsc_gpu_gx: no parameters
515<6>[ 0.400217]@3 gdsc_gpu_gx: supplied by gfx_corner
516<6>[ 0.400415]@3 gdsc_hlos1_vote_aggre0_noc: no parameters
517<6>[ 0.400577]@3 gdsc_hlos1_vote_lpass_adsp: no parameters
518<6>[ 0.400722]@3 gdsc_hlos1_vote_lpass_core: no parameters
519<6>[ 0.400878]@3 gdsc_aggre0_noc: no parameters
520<6>[ 0.402990]@3 mdss_pll_probe: MDSS pll label = MDSS DSI 0 PLL
521<6>[ 0.403026]@3 mdss_pll_probe: mdss_pll_probe: label=MDSS DSI 0 PLL PLL SSC enabled
522<6>[ 0.405080]@3 dsi_pll_clock_register_8996: Registered DSI PLL ndx=0 clocks successfully
523<6>[ 0.405145]@3 mdss_pll_probe: MDSS pll label = MDSS DSI 1 PLL
524<6>[ 0.405157]@3 mdss_pll_probe: mdss_pll_probe: label=MDSS DSI 1 PLL PLL SSC enabled
525<3>[ 0.406239]@3 pll_is_pll_locked_8996: DSI PLL ndx=1 status=0 failed to Lock
526<6>[ 0.406826]@3 dsi_pll_clock_register_8996: Registered DSI PLL ndx=1 clocks successfully
527<3>[ 0.420333]@3 arm-smmu d80000.arm,smmu-jpeg: found 4 context interrupt(s) but have 3 context banks. assuming 3 context interrupts.
528<3>[ 0.428016]@3 arm-smmu b40000.arm,smmu-kgsl: found 4 context interrupt(s) but have 2 context banks. assuming 2 context interrupts.
529<3>[ 0.436591]@3 arm-smmu da0000.arm,smmu-vfe: found 4 context interrupt(s) but have 2 context banks. assuming 2 context interrupts.
530<3>[ 0.445420]@3 arm-smmu d40000.arm,smmu-venus: found 11 context interrupt(s) but have 7 context banks. assuming 7 context interrupts.
531<3>[ 0.454372]@3 arm-smmu d00000.arm,smmu-mdp: found 4 context interrupt(s) but have 2 context banks. assuming 2 context interrupts.
532<3>[ 0.462951]@3 arm-smmu d20000.arm,smmu-rot: found 4 context interrupt(s) but have 2 context banks. assuming 2 context interrupts.
533<3>[ 0.471684]@3 arm-smmu d60000.arm,smmu-cpp_fd: found 4 context interrupt(s) but have 3 context banks. assuming 3 context interrupts.
534<3>[ 0.479445]@3 arm-smmu 1600000.arm,smmu-lpass_q6: found 16 context interrupt(s) but have 12 context banks. assuming 12 context interrupts.
535<3>[ 0.487741]@3 arm-smmu 1640000.arm,smmu-anoc0: found 6 context interrupt(s) but have 7 context banks. assuming 7 context interrupts.
536<3>[ 0.494894]@3 arm-smmu 1660000.arm,smmu-anoc1: found 8 context interrupt(s) but have 4 context banks. assuming 4 context interrupts.
537<3>[ 0.502066]@3 arm-smmu 1680000.arm,smmu-anoc2: found 12 context interrupt(s) but have 8 context banks. assuming 8 context interrupts.
538<6>[ 0.505052]@3 Advanced Linux Sound Architecture Driver Initialized.
539<6>[ 0.505668]@3 Bluetooth: Core ver 2.19
540<6>[ 0.505753]@3 NET: Registered protocol family 31
541<6>[ 0.505763]@3 Bluetooth: HCI device and connection manager initialized
542<6>[ 0.505780]@3 Bluetooth: HCI socket layer initialized
543<6>[ 0.505793]@3 Bluetooth: L2CAP socket layer initialized
544<6>[ 0.505828]@3 Bluetooth: SCO socket layer initialized
545<6>[ 0.506192]@3 cfg80211: Calling CRDA to update world regulatory domain
546<6>[ 0.506221]@3 cfg80211: World regulatory domain updated:
547<6>[ 0.506230]@3 cfg80211: DFS Master region: unset
548<6>cfg80211: (start_freq - end_freq @ bandwidth), (max_antenna_gain, max_eirp), (dfs_cac_time)
549<6>[ 0.506260]@3 cfg80211: (2402000 KHz - 2472000 KHz @ 40000 KHz), (N/A, 2000 mBm), (N/A)
550<6>[ 0.506271]@3 cfg80211: (2457000 KHz - 2482000 KHz @ 40000 KHz), (N/A, 2000 mBm), (N/A)
551<6>[ 0.506281]@3 cfg80211: (2474000 KHz - 2494000 KHz @ 20000 KHz), (N/A, 2000 mBm), (N/A)
552<6>[ 0.506290]@3 cfg80211: (5170000 KHz - 5250000 KHz @ 80000 KHz), (N/A, 2000 mBm), (N/A)
553<6>[ 0.506299]@3 cfg80211: (5250000 KHz - 5330000 KHz @ 80000 KHz), (N/A, 2000 mBm), (N/A)
554<6>[ 0.506307]@3 cfg80211: (5490000 KHz - 5710000 KHz @ 80000 KHz), (N/A, 2000 mBm), (N/A)
555<6>[ 0.506316]@3 cfg80211: (5735000 KHz - 5835000 KHz @ 80000 KHz), (N/A, 2000 mBm), (N/A)
556<6>[ 0.506325]@3 cfg80211: (57240000 KHz - 63720000 KHz @ 2160000 KHz), (N/A, 0 mBm), (N/A)
557<1>[ 0.506509]@3 pcie:pcie_init.
558<3>[ 0.506520]@3 pcie_init: unable to create IPC log context for pcie0-short
559<3>[ 0.506529]@3 pcie_init: unable to create IPC log context for pcie0-long
560<3>[ 0.506538]@3 pcie_init: unable to create IPC log context for pcie0-dump
561<3>[ 0.506548]@3 pcie_init: unable to create IPC log context for pcie1-short
562<3>[ 0.506556]@3 pcie_init: unable to create IPC log context for pcie1-long
563<3>[ 0.506564]@3 pcie_init: unable to create IPC log context for pcie1-dump
564<3>[ 0.506572]@3 pcie_init: unable to create IPC log context for pcie2-short
565<3>[ 0.506580]@3 pcie_init: unable to create IPC log context for pcie2-long
566<3>[ 0.506587]@3 pcie_init: unable to create IPC log context for pcie2-dump
567<4>[ 0.508295]@3 600000.qcom,pcie supply vreg-3.3 not found, using dummy regulator
568<3>[ 0.511133]@3 msm_pcie_get_resources: PCIe: RC0 can't get tcsr resource.
569<6>[ 0.513760]@0 pmi8994_boost_5v: no parameters
570<6>[ 0.514055]@0 pmi8994_boost_5v: supplied by pon_spare_reg
571<6>[ 0.514503]@0 pmi8994_boost_pin_ctrl: no parameters
572<6>[ 0.514616]@0 pmi8994_boost_pin_ctrl: supplied by pon_spare_reg
573<6>[ 0.515274]@3 Switched to clocksource arch_sys_counter
574<6>[ 0.515937]@3 bcl_peripheral:bcl_perph_init BCL Initialized
575<6>[ 0.517826]@3 NET: Registered protocol family 2
576<6>[ 0.518384]@3 TCP established hash table entries: 65536 (order: 7, 524288 bytes)
577<6>[ 0.518536]@3 TCP bind hash table entries: 65536 (order: 8, 1048576 bytes)
578<6>[ 0.519457]@3 TCP: Hash tables configured (established 65536 bind 65536)
579<6>[ 0.519625]@3 TCP: reno registered
580<6>[ 0.519664]@3 UDP hash table entries: 4096 (order: 5, 131072 bytes)
581<6>[ 0.519755]@3 UDP-Lite hash table entries: 4096 (order: 5, 131072 bytes)
582<6>[ 0.520367]@3 NET: Registered protocol family 1
583<7>[ 0.520447]@3 PCI: CLS 0 bytes, default 128
584<6>[ 0.520946]@3 Trying to unpack rootfs image as initramfs...
585<6>[ 0.710485]@3 Freeing initrd memory: 9496K (ffffffc002200000 - ffffffc002b46000)
586<6>[ 0.712360]@3 kryo perfevents: CPU pmu for kryo-pmuv3 detected
587<6>[ 0.717941]@3 futex hash table entries: 1024 (order: 5, 131072 bytes)
588<6>[ 0.718094]@3 audit: initializing netlink subsys (disabled)
589<5>[ 0.718209]@3 audit: type=2000 audit(0.716:1): initialized
590<4>[ 0.718699]@3 vmscan: error setting kswapd cpu affinity mask
591<6>[ 0.721740]@3 Registering sdcardfs 3.1.0
592<6>[ 0.722393]@3 ntfs: driver 2.1.31 [Flags: R/W].
593<6>[ 0.722495]@3 fuse init (API version 7.23)
594<6>[ 0.722825]@3 exFAT: Version 1.2.9
595<7>[ 0.722876]@3 SELinux: Registering netfilter hooks
596<6>[ 0.724927]@3 Block layer SCSI generic (bsg) driver version 0.4 loaded (major 246)
597<6>[ 0.724946]@3 io scheduler noop registered
598<6>[ 0.724957]@3 io scheduler deadline registered
599<6>[ 0.725052]@3 io scheduler cfq registered
600<6>[ 0.725067]@3 io scheduler fiops registered
601<6>[ 0.725077]@3 io scheduler zen registered (default)
602<4>[ 0.736102]@3 mdss_mdp_parse_dt_hw_settings: MDSS VBIF settings not found
603<6>[ 0.736155]@3 mdss_mdp_parse_dt_prop_len: prop qcom,mdss-smp-data : doesn't exist in device tree
604<6>[ 0.736237]@3 mdss_mdp_pipe_addr_setup: type:1 ftchid:0 xinid:0 num:0 ndx:0x1 prio:0
605<6>[ 0.736247]@3 mdss_mdp_pipe_addr_setup: type:1 ftchid:0 xinid:4 num:1 ndx:0x2 prio:1
606<6>[ 0.736256]@3 mdss_mdp_pipe_addr_setup: type:1 ftchid:0 xinid:8 num:2 ndx:0x4 prio:2
607<6>[ 0.736268]@3 mdss_mdp_pipe_addr_setup: type:2 ftchid:0 xinid:1 num:3 ndx:0x8 prio:4
608<6>[ 0.736276]@3 mdss_mdp_pipe_addr_setup: type:2 ftchid:0 xinid:5 num:4 ndx:0x10 prio:5
609<6>[ 0.736285]@3 mdss_mdp_pipe_addr_setup: type:2 ftchid:0 xinid:9 num:5 ndx:0x20 prio:6
610<6>[ 0.736296]@3 mdss_mdp_pipe_addr_setup: type:3 ftchid:0 xinid:2 num:6 ndx:0x40 prio:8
611<6>[ 0.736303]@3 mdss_mdp_pipe_addr_setup: type:3 ftchid:0 xinid:10 num:7 ndx:0x80 prio:9
612<6>[ 0.736311]@3 mdss_mdp_pipe_addr_setup: type:1 ftchid:0 xinid:12 num:8 ndx:0x100 prio:3
613<6>[ 0.736319]@3 mdss_mdp_pipe_addr_setup: type:2 ftchid:0 xinid:13 num:9 ndx:0x200 prio:7
614<3>[ 0.736338]@3 mdss_mdp_parse_dt_handler: Error from prop qcom,mdss-pipe-sw-reset-off : u32 array read
615<6>[ 0.736370]@3 mdss_mdp_pipe_addr_setup: type:4 ftchid:-1 xinid:7 num:10 ndx:0x400 prio:0
616<6>[ 0.736379]@3 mdss_mdp_pipe_addr_setup: type:4 ftchid:-1 xinid:7 num:11 ndx:0x800 prio:1
617<6>[ 0.736387]@3 mdss_mdp_parse_dt_pipe: dedicated vp cursors detected, num=2
618<3>[ 0.736457]@3 mdss_mdp_parse_dt_handler: Error from prop qcom,mdss-ib-factor-overlap : u32 array read
619<6>[ 0.736472]@3 mdss_mdp_parse_dt_prop_len: prop qcom,mdss-clk-levels : doesn't exist in device tree
620<6>[ 0.736513]@3 mdss_mdp_parse_dt_prop_len: prop qcom,mdss-smp-data : doesn't exist in device tree
621<3>[ 0.737433]@3 mdss_mdp_irq_clk_register: unable to get clk: lut_clk
622<6>[ 0.739019]@3 xlog_status: enable:0, panic:0, dump:2
623<3>[ 0.740257]@3 mdss_smmu_attach_v2: iommu device not attached for domain[0]
624<3>[ 0.740271]@3 mdss_mdp_clk_ctrl: IOMMU attach failed
625<3>[ 0.740281]@3 No change in context(0==0), skip
626<6>[ 0.741904]@3 mdss_mdp_probe: mdss version = 0x10070002, bootloader display is on
627<6>[ 0.746485]@3 mdss_smmu_probe: iommu v2 domain[0] mapping and clk register successful!
628<6>[ 0.746629]@3 mdss_smmu_probe: iommu v2 domain[1] mapping and clk register successful!
629<6>[ 0.746791]@3 mdss_smmu_probe: iommu v2 domain[2] mapping and clk register successful!
630<6>[ 0.746892]@3 mdss_smmu_probe: iommu v2 domain[3] mapping and clk register successful!
631<6>[ 0.749298]@3 mdss_dsi_ctrl_probe: DSI Ctrl name = MDSS DSI CTRL->0
632<6>[ 0.749605]@3 mdss_dsi_find_panel_of_node: cmdline:0:qcom,mdss_dsi_samsung_s6e3fa3_1080p_cmd:1:none:cfg:single_dsi panel_name:qcom,mdss_dsi_samsung_s6e3fa3_1080p_cmd
633<6>[ 0.749621]@3 mdss_dsi_panel_init: Panel Name = samsung s6e3fa3 1080p cmd mode dsi panel
634<6>[ 0.749718]@3 mdss_dsi_panel_timing_from_dt: found new timing "qcom,mdss_dsi_samsung_s6e3fa3_1080p_cmd" (ffffffc1764b34f8)
635<3>[ 0.749734]@3 mdss_dsi_parse_dcs_cmds: failed, key=qcom,mdss-dsi-timing-switch-command
636<6>[ 0.749832]@3 mdss_dsi_parse_panel_features: partial_update_enabled=0
637<6>[ 0.749842]@3 mdss_dsi_parse_panel_features: ulps feature disabled
638<6>[ 0.749849]@3 mdss_dsi_parse_panel_features: ulps during suspend feature disabled
639<6>mdss_dsi_parse_dms_config: dynamic switch feature enabled: 0
640<3>[ 0.749871]@3 mdss_dsi_parse_dcs_cmds: failed, key=qcom,mdss-dsi-panel-status-command
641<6>[ 0.749898]@3 mdss_dsi_panel_init: Panel Manufacture = SAMSUNG
642<6>[ 0.749903]@3 mdss_dsi_panel_init: Panel Version = S6E3FA3
643<3>[ 0.749912]@3 high brightness panel: 1
644<3>[ 0.750387]@3 mdss_dsi_parse_ctrl_params:3824 Unable to read qcom,display-id, data= (null),len=20
645<6>[ 0.750432]@3 mdss_dsi_parse_gpio_params: bklt_en gpio not specified
646<3>[ 0.750662]@3 msm_dss_get_res_byname: 'dsi_phy_regulator' resource not found
647<3>[ 0.750670]@3 mdss_dsi_retrieve_ctrl_resources+0x15c/0x1b8->msm_dss_ioremap_byname: 'dsi_phy_regulator' msm_dss_get_res_byname failed
648<6>[ 0.750698]@3 mdss_dsi_retrieve_ctrl_resources: ctrl_base=ffffff80021d2000 ctrl_size=400 phy_base=ffffff80021dc400 phy_size=588
649<6>[ 0.750858]@3 dsi_panel_device_register: Continuous splash enabled
650<6>[ 0.751461]@3 mdss_register_panel: adding framebuffer device 994000.qcom,mdss_dsi_ctrl0
651<6>[ 0.756048]@3 mdss_dsi_status_init: DSI status check interval:5000
652<6>[ 0.756514]@3 mdss_register_panel: adding framebuffer device soc:qcom,mdss_wb_panel
653<6>[ 0.758226]@3 mdss_fb_probe: fb0: split_mode:0 left:0 right:0
654<6>[ 0.758742]@3 mdss_fb_register: FrameBuffer[0] 1080x1920 registered successfully!
655<6>[ 0.759652]@3 mdss_fb_probe: fb1: split_mode:0 left:0 right:0
656<6>[ 0.759729]@3 mdss_fb_register: FrameBuffer[1] 640x480 registered successfully!
657<3>[ 0.759785]@3 mdss_mdp_splash_parse_dt: splash mem child node is not present
658<3>[ 0.760718]@3 mdss_mdp_kcal_store_fb0_ctl panel name samsung s6e3fa3 1080p cmd mode dsi panel
659<3>[ 0.760732]@3 mdss_mdp_kcal_store_fb0_ctl panel found...
660<6>[ 0.760768]@3 kcal_ctrl_init: registered
661<3>[ 0.763248]@3 glink_loopback_server_init: unable to create log context
662<3>[ 0.763589]@3 msm_smp2p_init: unable to create log context
663<3>[ 0.765769]@3 qmi_log_init: Unable to create QMI IPC logging for Req/Resp
664<3>logging for Indications: Unable to create QMI IPC qmi_log_init<6>l2cache-pmu soc:l2-pmu: Registered L2 cache PMU using 2 HW PMUs
665<5>[ 0.776467]@3 msm_rpm_log_probe: OK
666<3>[ 0.782138]@0 smd_channel_probe_now: allocation table not initialized
667<3>[ 0.786673]@3 uart_tx_gpio is not available
668<3>[ 0.786758]@3 uart_rx_gpio is not available
669<3>[ 0.786765]@3 uart_cts_gpio is not available
670<3>[ 0.786771]@3 uart_rfr_gpio is not available
671<3>[ 0.786907]@3 msm_serial_hs 7570000.uart: msm_hs_probe: error creating logging context
672<3>sps: BAM device 0x0000000007544000 is not registered yet.
673<3>[ 0.787593]@3 sps_register_bam_device : unable to create IPC Logging 0 for bam 0x0000000007544000
674<3>sps_register_bam_device : unable to create IPC Logging 1 for bam 0x0000000007544000sps_register_bam_device : unable to create IPC Logging 2 for bam 0x0000000007544000
675<3>sps_register_bam_device : unable to create IPC Logging 3 for bam 0x0000000007544000sps_register_bam_device : unable to create IPC Logging 4 for bam 0x0000000007544000
676<6>sps:BAM 0x0000000007544000 is registered.<3>msm_serial_hs 7570000.uart: msm_hs_probe: error creating tx logging context
677<3>msm_serial_hs 7570000.uart: msm_hs_probe: error creating rx logging context
678<3>msm_serial_hs 7570000.uart: msm_hs_probe: error creating usr logging context
679<6>7570000.uart: ttyHS0 at MMIO 0x7570000 (irq = 20, base_baud = 460800) is a MSM HS UART
680<6>[ 0.791400]@3 msm_serial_hs module loaded
681<6>[ 0.792143]@3 msm_serial_hsl_probe: detected port #0 (ttyHSL0)
682<6>[ 0.792993]@3 msm_serial_hsl_init: msm_hsl_platform_driver and msm_hsl_uart_driver unregister
683<3>[ 0.793023]@3 smd_tty_log_init: Unable to create IPC log
684<3>diag: Failed to create IPC logging context
685<6>[ 0.808429]@3 brd: module loaded
686<6>[ 0.809664]@3 loop: module loaded
687<6>[ 0.809783]@3 at24 6-0051: 4096 byte 24c32 EEPROM, writable, 1 bytes/write
688<6>[ 0.810789]@3 QSEECOM: qseecom_probe: qseecom.qsee_version = 0x1000000
689<4>[ 0.810846]@3 QSEECOM: qseecom_retrieve_ce_data: Device does not support PFE
690<6>QSEECOM: qseecom_probe: no-clock-support=0x1<4>QSEECOM: qseecom_probe: qseecom.qsee_reentrancy_support = 2
691<4>[ 0.812801]@3 i2c-core: driver [tusb320] using legacy suspend method
692<4>[ 0.812818]@3 i2c-core: driver [tusb320] using legacy resume method
693<4>[ 0.812864]@3 i2c-core: driver [fusb301] using legacy suspend method
694<4>[ 0.812870]@3 i2c-core: driver [fusb301] using legacy resume method
695<4>[ 0.812915]@3 i2c-core: driver [ptn5150] using legacy suspend method
696<4>[ 0.812921]@3 i2c-core: driver [ptn5150] using legacy resume method
697<3>[ 0.814621]@3 gpio_dev_probe
698<3>[ 0.814671]@3 i= 1 gpio=: 97
699<3>[ 0.814699]@3 i= 2 gpio=: 98
700<3>[ 0.814735]@3 i= 3 gpio=: 100
701<3>[ 0.814782]@3 i= 4 gpio=: 115
702<3>[ 0.814838]@3 i= 5 gpio=: 127
703<3>[ 0.814905]@3 i= 6 gpio=: 133
704<3>[ 0.814982]@3 i= 7 gpio=: 136
705<4>[ 0.815017]@3 gpio_pinctrl_init
706<4>[ 0.815387]@3 gpio_dev_probe ok!
707<4>[ 0.815704]@3 i2c-core: driver [tabla-i2c-core] using legacy suspend method
708<4>[ 0.815713]@3 i2c-core: driver [tabla-i2c-core] using legacy resume method
709<4>[ 0.815775]@3 i2c-core: driver [wcd9xxx-i2c-core] using legacy suspend method
710<4>[ 0.815781]@3 i2c-core: driver [wcd9xxx-i2c-core] using legacy resume method
711<4>[ 0.815830]@3 i2c-core: driver [tasha-i2c-core] using legacy suspend method
712<4>[ 0.815837]@3 i2c-core: driver [tasha-i2c-core] using legacy resume method
713<6>[ 0.817302]@3 Loading pn544 driver
714<6>[ 0.817400]@3 Enter pn544_probe !!!
715<6>[ 0.817612]@3 pn544_parse_dt: 9, 94, 12, 1015 ,1018, 0
716<6>[ 0.817734]@3 successfully got regulator_s4
717<6>[ 0.817914]@3 successfully set regulator voltage_s4
718<6>[ 0.817923]@3 get BBCLK2!!!
719<6>[ 0.817957]@3 clk_prepare_enable. ret = 0
720<6>[ 0.818097]@3 pn544_probe : requesting IRQ 298
721<6>[ 0.818221]@3 [NXP-P61] : Entry : p61_dev_init
722<6>[ 0.819397]@3 qce 660000.qcedev: Qualcomm Crypto 5.3.1 device found @0x660000
723<6>[ 0.819413]@3 qce 660000.qcedev: CE device = 0x0
724<6>, IO base, CE = 0xffffff8002740000
725<6>, Consumer (IN) PIPE 2, Producer (OUT) PIPE 3
726<6>IO base BAM = 0x (null)
727<6>BAM IRQ 156
728<6>Engines Availability = 0x2011053
729<3>[ 0.819455]@3 sps_register_bam_device : unable to create IPC Logging 0 for bam 0x0000000000644000
730<3>sps_register_bam_device : unable to create IPC Logging 1 for bam 0x0000000000644000sps_register_bam_device : unable to create IPC Logging 2 for bam 0x0000000000644000
731<3>sps_register_bam_device : unable to create IPC Logging 3 for bam 0x0000000000644000sps_register_bam_device : unable to create IPC Logging 4 for bam 0x0000000000644000
732<6>sps:BAM 0x0000000000644000 is registered.<6>sps:BAM 0x0000000000644000 (va:0xffffff8003640000) enabled: ver:0x27, number of pipes:16
733<6>[ 0.819870]@3 QCE50: qce_sps_init: Qualcomm MSM CE-BAM at 0x0000000000644000 irq 156
734<6>[ 0.827573]@3 qcrypto 660000.qcrypto: Qualcomm Crypto 5.3.1 device found @0x660000
735<6>[ 0.827601]@3 qcrypto 660000.qcrypto: CE device = 0x0
736<6>, IO base, CE = 0xffffff8003740000
737<6>, Consumer (IN) PIPE 4, Producer (OUT) PIPE 5
738<6>IO base BAM = 0x (null)
739<6>BAM IRQ 156
740<6>Engines Availability = 0x2011053
741<6>[ 0.827898]@3 QCE50: qce_sps_init: Qualcomm MSM CE-BAM at 0x0000000000644000 irq 156
742<6>[ 0.833514]@3 qcrypto 660000.qcrypto: qcrypto-ecb-aes
743<6>[ 0.833605]@3 qcrypto 660000.qcrypto: qcrypto-cbc-aes
744<6>[ 0.833684]@3 qcrypto 660000.qcrypto: qcrypto-ctr-aes
745<6>[ 0.833758]@3 qcrypto 660000.qcrypto: qcrypto-ecb-des
746<6>[ 0.833833]@3 qcrypto 660000.qcrypto: qcrypto-cbc-des
747<6>[ 0.833912]@3 qcrypto 660000.qcrypto: qcrypto-ecb-3des
748<6>[ 0.833991]@3 qcrypto 660000.qcrypto: qcrypto-cbc-3des
749<6>[ 0.834067]@3 qcrypto 660000.qcrypto: qcrypto-xts-aes
750<6>[ 0.834144]@3 qcrypto 660000.qcrypto: qcrypto-sha1
751<6>[ 0.834222]@3 qcrypto 660000.qcrypto: qcrypto-sha256
752<6>[ 0.834299]@3 qcrypto 660000.qcrypto: qcrypto-aead-hmac-sha1-cbc-aes
753<6>[ 0.834373]@3 qcrypto 660000.qcrypto: qcrypto-aead-hmac-sha1-cbc-des
754<6>[ 0.834449]@3 qcrypto 660000.qcrypto: qcrypto-aead-hmac-sha1-cbc-3des
755<6>[ 0.834526]@3 qcrypto 660000.qcrypto: qcrypto-aead-hmac-sha256-cbc-aes
756<6>[ 0.834603]@3 qcrypto 660000.qcrypto: qcrypto-aead-hmac-sha256-cbc-des
757<6>[ 0.834676]@3 qcrypto 660000.qcrypto: qcrypto-aead-hmac-sha256-cbc-3des
758<6>[ 0.834753]@3 qcrypto 660000.qcrypto: qcrypto-hmac-sha1
759<6>[ 0.834830]@3 qcrypto 660000.qcrypto: qcrypto-hmac-sha256
760<6>[ 0.834906]@3 qcrypto 660000.qcrypto: qcrypto-aes-ccm
761<6>[ 0.834982]@3 qcrypto 660000.qcrypto: qcrypto-rfc4309-aes-ccm
762<6>[ 0.837522]@3 ICE IRQ = 28
763<6>[ 0.841657]@3 qcom_ice_get_pdevice: found ice device ffffffc1738ad400
764<6>[ 0.841684]@3 qcom_ice_get_pdevice: matching platform device ffffffc175cd4c00
765<3>[ 0.842188]@3 scm_call failed: func id 0x42000c02, arginfo: 0x2, args: 0x13, 0x0, 0x0, 0x0, ret: -2, syscall returns: 0xfffffffffffffffc, 0x0, 0x0
766<3>[ 0.842828]@3 ufs_qcom_phy_qmp_14nm 627000.ufsphy: failed to get tx_iface_clk err -517
767<3>ufs_qcom_phy_qmp_14nm 627000.ufsphy: failed to get rx_iface_clk err -517
768<6>scsi host0: ufshcd
769<6>[ 0.847401]@2 qcom_ice 630000.ufsice: QC ICE 2.1.44 device found @0xffffff8002450000
770<6>[ 0.854999]@3 SCSI Media Changer driver v0.25
771<6>[ 0.865210]@3 sps:BAM 0x0000000007544000 (va:0xffffff80025c0000) enabled: ver:0x19, number of pipes:24
772<6>[ 0.865442]@3 [NXP-P61] : p61_probe chip select : 1 , bus number = 0
773<6>[ 0.865616]@3 p61_parse_dt: 34, 21 0
774<6>[ 0.865622]@3 [NXP-P61] : Entry : p61_hw_setup
775<6>[ 0.865655]@3 [NXP-P61] : Exit : p61_hw_setup
776<6>[ 0.865768]@3 [NXP-P61] : Entry : p61_disable_irq
777<6>[ 0.865775]@3 [NXP-P61] : Exit : p61_disable_irq
778<6>[ 0.865780]@3 [NXP-P61] : Exit : p61_probe
779<6>[ 0.866668]@3 Ethernet Channel Bonding Driver: v3.7.1 (April 27, 2011)
780<6>[ 0.867849]@3 tun: Universal TUN/TAP device driver, 1.6
781<6>[ 0.867858]@3 tun: (C) 1999-2004 Max Krasnyansky <maxk@qualcomm.com>
782<6>[ 0.867914]@3 PPP generic driver version 2.4.2
783<6>[ 0.867978]@3 PPP BSD Compression module registered
784<6>[ 0.867985]@3 PPP Deflate Compression module registered
785<6>[ 0.868023]@3 PPP MPPE Compression module registered
786<6>[ 0.868033]@3 NET: Registered protocol family 24
787<3>[ 0.868057]@3 Context not found
788<3>[ 0.874842]@0 ufshcd 624000.ufshc: ufshcd_print_pwr_info:[RX, TX]: gear=[1, 1], lane[1, 1], pwr[SLOWAUTO_MODE, SLOWAUTO_MODE], rate = 0
789<6>[ 0.956025]@1 PCI host bridge /soc/qcom,pcie@00600000 ranges:
790<6>[ 0.956056]@1 No bus range found for /soc/qcom,pcie@00600000, using [bus 00-ff]
791<6>[ 0.956085]@1 IO 0x0c200000..0x0c2fffff -> 0x0c200000
792<6>[ 0.956099]@1 MEM 0x0c300000..0x0cffffff -> 0x0c300000
793<6>[ 0.956234]@1 pci-msm 600000.qcom,pcie: PCI host bridge to bus 0000:00
794<6>[ 0.956246]@1 pci_bus 0000:00: root bus resource [bus 00-ff]
795<6>[ 0.956257]@1 pci_bus 0000:00: root bus resource [io 0x0000-0xfffff] (bus address [0xc200000-0xc2fffff])
796<6>[ 0.956267]@1 pci_bus 0000:00: root bus resource [mem 0x0c300000-0x0cffffff]
797<7>[ 0.956308]@1 pci 0000:00:00.0: [17cb:0104] type 01 class 0x060400
798<3>[ 0.956336]@1 msm_pcie_oper_conf: Read of RC0 0:0x00 + 0x0014[4] is all FFs
799<7>[ 0.956348]@1 pci 0000:00:00.0: reg 0x10: [mem 0x00000000-0x00000fff 64bit]
800<7>[ 0.956419]@1 pci 0000:00:00.0: PME# supported from D0 D3hot D3cold
801<3>[ 0.956439]@1 pci 0000:00:00.0: of_irq_parse_pci() failed with rc=-19
802<6>[ 0.956606]@1 pci 0000:00:00.0: bridge configuration invalid ([bus 00-00]), reconfiguring
803<7>[ 0.956765]@1 pci 0000:01:00.0: [168c:003e] type 00 class 0x028000
804<3>[ 0.956819]@1 msm_pcie_oper_conf: Read of RC0 1:0x00 + 0x0014[4] is all FFs
805<7>[ 0.956828]@1 pci 0000:01:00.0: reg 0x10: [mem 0x00000000-0x001fffff 64bit]
806<7>[ 0.957080]@1 pci 0000:01:00.0: PME# supported from D0 D3hot D3cold
807<7>[ 0.957464]@1 pci_bus 0000:01: busn_res: [bus 01-ff] end is updated to 01
808<3>[ 0.957548]@1 msm_pcie_oper_conf: Read of RC0 0:0x00 + 0x0028[4] is all FFs
809<6>[ 0.957575]@1 pci 0000:00:00.0: BAR 8: assigned [mem 0x0c400000-0x0c5fffff]
810<6>[ 0.957586]@1 pci 0000:00:00.0: BAR 0: assigned [mem 0x0c300000-0x0c300fff 64bit]
811<6>[ 0.957607]@1 pci 0000:01:00.0: BAR 0: assigned [mem 0x0c400000-0x0c5fffff 64bit]
812<6>[ 0.957805]@1 pci 0000:00:00.0: PCI bridge to [bus 01]
813<6>[ 0.957835]@1 pci 0000:00:00.0: bridge window [mem 0x0c400000-0x0c5fffff]
814<6>[ 0.972955]@1 cnss: Platform driver probed successfully.
815<6>[ 0.974115]@1 usbcore: registered new interface driver asix
816<6>[ 0.974225]@1 usbcore: registered new interface driver ax88179_178a
817<6>[ 0.974253]@1 usbcore: registered new interface driver cdc_ether
818<6>[ 0.974280]@1 usbcore: registered new interface driver net1080
819<6>[ 0.974307]@1 usbcore: registered new interface driver cdc_subset
820<6>[ 0.974332]@1 usbcore: registered new interface driver zaurus
821<6>[ 0.974643]@0 usbcore: registered new interface driver cdc_ncm
822<6>[ 0.975275]@0 msm_sharedmem: sharedmem_register_qmi: qmi init successful
823<6>[ 0.978657]@0 msm_sharedmem: msm_sharedmem_probe: Device created for client 'rmtfs'
824<3>[ 0.986972]@3 msm-dwc3 6a00000.ssusb: unable to get dbm device
825<6>[ 0.990242]@3 ehci_hcd: USB 2.0 'Enhanced' Host Controller (EHCI) Driver
826<6>[ 0.990268]@3 ehci-pci: EHCI PCI platform driver
827<6>[ 0.990374]@3 usbcore: registered new interface driver usb-storage
828<6>[ 0.990404]@3 usbcore: registered new interface driver ums-alauda
829<6>[ 0.990425]@3 usbcore: registered new interface driver ums-cypress
830<6>[ 0.990444]@3 usbcore: registered new interface driver ums-datafab
831<6>[ 0.990464]@3 usbcore: registered new interface driver ums-freecom
832<6>[ 0.990482]@3 usbcore: registered new interface driver ums-isd200
833<6>[ 0.990501]@3 usbcore: registered new interface driver ums-jumpshot
834<6>[ 0.990519]@3 usbcore: registered new interface driver ums-karma
835<6>[ 0.990538]@3 usbcore: registered new interface driver ums-sddr09
836<6>[ 0.990556]@3 usbcore: registered new interface driver ums-sddr55
837<6>[ 0.990577]@3 usbcore: registered new interface driver ums-usbat
838<6>[ 0.990653]@3 usbcore: registered new interface driver usbserial
839<6>[ 0.990673]@3 usbcore: registered new interface driver usb_ehset_test
840<6>[ 0.991339]@3 gbridge_init: gbridge_init successs.
841<6>[ 0.991454]@3 mousedev: PS/2 mouse device common for all mice
842<6>[ 0.991588]@3 usbcore: registered new interface driver xpad
843<3>[ 0.991597]@3 synaptics,s3320: tpd_driver_init enter
844<3>[ 0.992281]@3 synaptics,s3320: before on cpu [3]
845<3>[ 0.992290]@3 synaptics,s3320: check CPU[0] is [online]
846<3>[ 0.992642]@3 touchkey,s1302: boot_time: before optimize [synaptics_ts_probe] on cpu 3
847<3>[ 0.992652]@3 touchkey,s1302: boot_time: [synaptics_ts_probe] CPU0 is online
848<6>[ 0.994603]@3 input: tri-state-key as /devices/soc/soc:tri_state_key/input/input1
849<3>[ 0.994786]@3 switch_data->key3_gpio=1013
850<3>[ 0.994799]@3 switch_data->key2_gpio=1012
851<3>[ 0.994811]@3 switch_data->key1_gpio=1014
852<6>[ 0.996185]@3 fpc1020_probe
853<6>[ 0.996386]@3 fpc1020 soc:fpc_fpc1020: fpc,irq-gpio - gpio: 95
854<6>[ 0.996424]@3 fpc1020 soc:fpc_fpc1020: fpc,reset-gpio - gpio: 86
855<6>[ 0.996445]@3 fpc1020 soc:fpc_fpc1020: fpc,gpio_id0 - gpio: 25
856<3>[ 0.996451]@3 fpc1020 soc:fpc_fpc1020: fpc1020_probe: gpio_is_valid(fpc1020->id0_gpio=25)
857<6>[ 0.996481]@3 fpc1020 soc:fpc_fpc1020: fpc,gpio_id1 - gpio: 143
858<3>[ 0.996487]@3 fpc1020 soc:fpc_fpc1020: fpc1020_probe: gpio_is_valid(fpc1020->id1_gpio=143)
859<6>[ 0.996513]@3 fpc1020 soc:fpc_fpc1020: fpc,gpio_1V8_EN - gpio: 14
860<6>[ 0.996628]@3 input: fpc1020 as /devices/virtual/input/input2
861<6>[ 1.003010]@3 fpc1020 soc:fpc_fpc1020: fpc1020_probe: ok
862<6>[ 1.004443]@3 qcom,qpnp-rtc qpnp-rtc-ffffffc175d46400: rtc core: registered qpnp_rtc as rtc0
863<6>[ 1.004626]@3 i2c /dev entries driver
864<6>[ 1.036585]@3 vmem: Up and running with 4 banks of memory from [dma size 268604614345 disabled]
865<3>[ 1.050173]@3 msm_camera_pinctrl_init:1201 Getting pinctrl handle failed
866<3>[ 1.050200]@3 msm_camera_power_up:1242 Initialization of pinctrl failed
867<3>[ 1.050208]@3 msm_camera_request_gpio_table:732 invalid gpio_tbl (null) / size 0
868<6>[ 1.055797]@3 msm_cci_init:1363: hw_version = 0x10040000
869<3>[ 1.056048]@3 msm_eeprom_imx298_read_vendorInfo read 0x0700=1
870<3>[ 1.056055]@3 msm_eeprom_imx298_read_vendorInfo pdaf calibration is valid
871<3>[ 1.056090]@3 qcom,slave-addr = 0xA0
872<3>[ 1.058198]@0 ufshcd 624000.ufshc: ufshcd_print_pwr_info:[RX, TX]: gear=[3, 3], lane[1, 1], pwr[FAST MODE, FAST MODE], rate = 2
873<5>[ 1.058768]@0 scsi 0:0:0:49488: Well-known LUN SAMSUNG KLUCG4J1CB-B0B1 0800 PQ: 0 ANSI: 6
874<5>[ 1.059659]@0 scsi 0:0:0:49456: Well-known LUN SAMSUNG KLUCG4J1CB-B0B1 0800 PQ: 0 ANSI: 6
875<5>[ 1.060481]@0 scsi 0:0:0:49476: Well-known LUN SAMSUNG KLUCG4J1CB-B0B1 0800 PQ: 0 ANSI: 6
876<4>[ 1.061102]@0 ufs_get_capacity_info size = 0x7734000
877<5>scsi 0:0:0:0: Direct-Access SAMSUNG KLUCG4J1CB-B0B1 0800 PQ: 0 ANSI: 6
878<5>[ 1.062073]@0 scsi 0:0:0:1: Direct-Access SAMSUNG KLUCG4J1CB-B0B1 0800 PQ: 0 ANSI: 6
879<5>[ 1.062509]@0 scsi 0:0:0:2: Direct-Access SAMSUNG KLUCG4J1CB-B0B1 0800 PQ: 0 ANSI: 6
880<5>[ 1.062911]@0 scsi 0:0:0:3: Direct-Access SAMSUNG KLUCG4J1CB-B0B1 0800 PQ: 0 ANSI: 6
881<5>[ 1.063331]@0 scsi 0:0:0:4: Direct-Access SAMSUNG KLUCG4J1CB-B0B1 0800 PQ: 0 ANSI: 6
882<5>[ 1.063797]@0 scsi 0:0:0:5: Direct-Access SAMSUNG KLUCG4J1CB-B0B1 0800 PQ: 0 ANSI: 6
883<5>[ 1.064738]@0 sd 0:0:0:0: [sda] 16384-byte physical blocks
884<3>[ 1.065192]@3 qcom,slave-addr = 0xA0
885<5>[ 1.065384]@2 sd 0:0:0:1: [sdb] 16384-byte physical blocks
886<5>[ 1.065950]@2 sd 0:0:0:2: [sdc] 16384-byte physical blocks
887<5>[ 1.067468]@3 sd 0:0:0:4: [sde] 16384-byte physical blocks
888<5>[ 1.067489]@1 sd 0:0:0:3: [sdd] 16384-byte physical blocks
889<5>[ 1.067489]@0 sd 0:0:0:0: [sda] 16384-byte physical blocks
890<5>[ 1.067960]@3 sd 0:0:0:5: [sdf] 16384-byte physical blocks
891<5>[ 1.068344]@1 sd 0:0:0:1: [sdb] 16384-byte physical blocks
892<5>[ 1.069099]@1 sd 0:0:0:2: [sdc] 16384-byte physical blocks
893<5>[ 1.071017]@1 sd 0:0:0:4: [sde] 16384-byte physical blocks
894<6>[ 1.072565]@3 sdb: sdb1
895<6>[ 1.072574]@0 sda: sda1 sda2 sda3 sda4 sda5 sda6 sda7 sda8 sda9 sda10 sda11 sda12 sda13 sda14 sda15
896<6>[ 1.072653]@1 sdc: sdc1
897<5>[ 1.072776]@2 sd 0:0:0:5: [sdf] 16384-byte physical blocks
898<5>[ 1.073269]@3 sd 0:0:0:1: [sdb] 16384-byte physical blocks
899<5>[ 1.073440]@1 sd 0:0:0:3: [sdd] 16384-byte physical blocks
900<5>[ 1.073655]@1 sd 0:0:0:2: [sdc] 16384-byte physical blocks
901<3>[ 1.074477]@2 qcom,slave-addr = 0xA0
902<5>[ 1.075793]@0 sd 0:0:0:0: [sda] 16384-byte physical blocks
903<6>[ 1.076545]@2 sdf: sdf1 sdf2 sdf3 sdf4
904<6>[ 1.076737]@0 sde: sde1 sde2 sde3 sde4 sde5 sde6 sde7 sde8 sde9 sde10 sde11 sde12 sde13 sde14 sde15 sde16 sde17 sde18 sde19 sde20 sde21 sde22 sde23 sde24 sde25 sde26 sde27 sde28 sde29 sde30 sde31 sde32 sde33 sde34
905<5>[ 1.077462]@2 sd 0:0:0:5: [sdf] 16384-byte physical blocks
906<6>[ 1.078736]@1 sdd: sdd1 sdd2 sdd3
907<5>[ 1.079535]@1 sd 0:0:0:3: [sdd] 16384-byte physical blocks
908<5>[ 1.080514]@2 sd 0:0:0:4: [sde] 16384-byte physical blocks
909<3>[ 1.083678]@2 qcom,slave-addr = 0xA0
910<3>[ 1.092636]@2 qcom,slave-addr = 0xA0
911<3>[ 1.101606]@2 qcom,slave-addr = 0xA0
912<3>[ 1.110572]@2 qcom,slave-addr = 0xA0
913<3>[ 1.119532]@2 qcom,slave-addr = 0xA0
914<3>[ 1.128493]@2 qcom,slave-addr = 0xA0
915<3>[ 1.139967]@0 msm_camera_request_gpio_table:732 invalid gpio_tbl (null) / size 0
916<6>[ 1.145821]@0 msm_cci_init:1363: hw_version = 0x10040000
917<3>[ 1.145897]@0 qcom,slave-addr = 0x20
918<3>[ 1.153375]@0 qcom,slave-addr = 0x20
919<3>[ 1.163369]@0 qcom,slave-addr = 0x20
920<3>[ 1.173367]@0 qcom,slave-addr = 0x20
921<3>[ 1.183367]@0 qcom,slave-addr = 0x20
922<3>[ 1.193368]@0 qcom,slave-addr = 0x20
923<3>[ 1.203367]@0 qcom,slave-addr = 0x20
924<3>[ 1.213367]@0 qcom,slave-addr = 0x20
925<3>[ 1.223367]@0 qcom,slave-addr = 0x20
926<3>[ 1.225683]@0 qcom,slave-addr = 0x20
927<3>[ 1.233367]@0 qcom,slave-addr = 0x20
928<3>[ 1.235676]@0 qcom,slave-addr = 0x20
929<3>[ 1.243367]@0 qcom,slave-addr = 0x20
930<6>[ 1.261135]@0 MSM-CPP cpp_init_hardware:1148 CPP HW Version: 0x60000000
931<3>[ 1.261174]@0 MSM-CPP cpp_init_hardware:1169 stream_cnt:0
932<3>[ 1.273092]@0 __msm_jpeg_init:1537] Jpeg Device id 0
933<3>__msm_jpeg_init:1537] Jpeg Device id 2__msm_jpeg_init:1537] Jpeg Device id 3
934<3>msm_fd_hw_set_dt_parms_by_name: Error property does not exist
935<3>[ 1.290057]@0 synaptics,s3320: after on cpu [0]
936<3>[ 1.290073]@0 synaptics,s3320: synaptics_ts_probe is called
937<3>[ 1.290401]@0 synaptics,s3320: synaptics_parse_dts ts->support_hw_poweroff =1
938<3>[ 1.290415]@0 synaptics,s3320: synaptics,tx-rx-num is 16 28
939<4>[ 1.290424]@0 synaptics,s3320: synaptic:ts->irq_gpio:125 irq_flags:8200 max_num 10
940<3>[ 1.290899]@0 touchkey,s1302: boot_time: after optimize call [synaptics_ts_probe] on cpu 0
941<3>[ 1.290915]@0 touchkey,s1302: synaptics_ts_probe is called
942<3>[ 1.376720]@2 msm_fd aa4000.qcom,fd: Face detection halt timeout
943<3>[ 1.378841]@3 load_data: chip is NULL !
944<6>[ 1.379174]@3 FG: fg_probe: FG Probe success - FG Revision DIG:3.1 ANA:1.2 PMIC subtype=19
945<3>[ 1.379424]@3 load_data: chip is NULL !
946<6>[ 1.379433]@2 bq27541_battery_probe probe sucdess
947<3>[ 1.379905]@2 i2c-msm-v2 757a000.i2c: msm_bus_scale_register_client(mstr-id:86):0x18 (ok)
948<3>err bq dcap_l value:0xff0b
949<6>[ 1.380934]@2 is_4p4v_bat=0,support_4p4v_bat=0
950<4>[ 1.380972]@2 i2c-core: driver [bq27541-battery] using legacy suspend method
951<4>[ 1.380979]@2 i2c-core: driver [bq27541-battery] using legacy resume method
952<6>[ 1.381512]@2 dash_probe dash_probe
953<6>[ 1.389851]@3 FG: fg_config_esr_extract: ESR extract is disabled
954<6>[ 1.399273]@3 of_batterydata_get_best_profile: itech_3000mah found
955<6>[ 1.406707]@2 dash_probe dash_probe suecess
956<3>[ 1.408785]@2 unable to find DT imem DLOAD mode node
957<3>[ 1.410134]@2 unable to find DT imem EDLOAD mode node
958<6>[ 1.410160]@2 get_param_by_index_and_offset[75] sid_index = 0 offset = 76 buf = ffffffc001614440 length = 28
959<3>[ 1.411894]@2 unable to find DT imem dload-type node
960<6>[ 1.443068]@3 device-mapper: uevent: version 1.0.3
961<6>[ 1.443233]@3 device-mapper: ioctl: 4.28.0-ioctl (2014-09-17) initialised: dm-devel@redhat.com
962<6>[ 1.443330]@3 device-mapper: req-crypt: dm-req-crypt successfully initalized.
963<6>
964<4>[ 1.444758]@3 bt_power bt_qca6174: no qca,bt-vdd-core-voltage-level property
965<4>[ 1.444900]@3 bt_power bt_qca6174: no qca,bt-vdd-pa-voltage-level property
966<6>[ 1.444908]@3 bt_dt_parse_vreg_info: qca,bt-vdd-ldo: is not provided in device tree
967<6>[ 1.444916]@3 bt_dt_parse_vreg_info: qca,bt-chip-pwd: is not provided in device tree
968<6>[ 1.445613]@3 sdhci: Secure Digital Host Controller Interface driver
969<6>[ 1.445623]@3 sdhci: Copyright(c) Pierre Ossman
970<6>[ 1.445631]@3 sdhci-pltfm: SDHCI platform and OF driver helper
971<6>[ 1.450278]@3 hidraw: raw HID events driver (C) Jiri Kosina
972<6>[ 1.450621]@3 usbcore: registered new interface driver usbhid
973<6>[ 1.450630]@3 usbhid: USB HID core driver
974<6>[ 1.451003]@3 ashmem: initialized
975<6>[ 1.451877]@3 qpnp_coincell_charger_show_state: enabled=Y, voltage=3200 mV, resistance=2100 ohm
976<3>[ 1.454334]@0 i2c-msm-v2 75ba000.i2c: msm_bus_scale_register_client(mstr-id:84):0x19 (ok)
977<3>synaptics,s3320: F12_2D_QUERY_BASE = 50
978<3> F12_2D_CMD_BASE = 0
979<3> F12_2D_CTRL_BASE = 15
980<3> F12_2D_DATA_BASE = 8
981<3>
982<3>synaptics,s3320: F34_FLASH_QUERY_BASE = 2b
983<3> F34_FLASH_CMD_BASE = 0
984<3> F34_FLASH_CTRL_BASE = d
985<3> F34_FLASH_DATA_BASE = 0
986<3> synaptics,s3320: F54_QUERY_BASE = 4d
987<3> F54_CMD_BASE = 4c
988<3> F54_CTRL_BASE = e
989<3> F54_DATA_BASE = 0
990<3>
991<3>synaptics,s3320: before fw update bootloader_mode[0x0]
992<3>[ 1.456641]@0 synaptics,s3320: CURRENT_FIRMWARE_ID = 0x15801127
993<3>[ 1.457337]@0 synaptics,s3320: synaptics_mode_change: set TP to mode[0x80]
994<3>[ 1.458932]@0 synaptics,s3320: max_x = 1080,max_y = 1920; max_x_ic = 1079,max_y_ic = 1919
995<3>[ 1.459534]@0 synaptics,s3320: synaptics_soft_reset !!!
996<6>[ 1.459722]@2 bimc-bwmon 408000.qcom,cpu-bwmon: BW HWmon governor registered.
997<6>[ 1.460904]@2 arm-memlat-mon soc:qcom,arm-memlat-mon-0: Memory Latency governor registered.
998<6>[ 1.460957]@2 arm-memlat-mon soc:qcom,arm-memlat-mon-2: Memory Latency governor registered.
999<6>[ 1.462998]@2 m4m-hwmon 6530000.qcom,m4m-hwmon: Cache HWmon governor registered.
1000<3>[ 1.466708]@3 devfreq soc:qcom,cpubw: Couldn't update frequency transition information.
1001<3>[ 1.466824]@3 devfreq soc:qcom,mincpubw: Couldn't update frequency transition information.
1002<3>[ 1.466928]@3 devfreq soc:qcom,memlat-cpu0: Couldn't update frequency transition information.
1003<3>[ 1.467028]@3 devfreq soc:qcom,memlat-cpu2: Couldn't update frequency transition information.
1004<3>[ 1.467910]@3 devfreq soc:qcom,m4m: Couldn't update frequency transition information.
1005<3>[ 1.469150]@3 probe: Failed to create IPC log context
1006<6>[ 1.470642]@3 otracer: initialized
1007<6>[ 1.470780]@3 op_netlink_init
1008<6>[ 1.470884]@3 usbcore: registered new interface driver snd-usb-audio
1009<3>[ 1.473258]@3 tfa98xx_i2c_probe
1010<6>[ 1.481463]@3 msm-dai-tdm soc:qcom,msm-dai-tdm-tert-rx: msm_dai_tdm_q6_probe: dev_name: soc:qcom,msm-dai-tdm-tert-rx group_id: 0x9120
1011<6>[ 1.481717]@3 msm-dai-q6-tdm soc:qcom,msm-dai-tdm-tert-rx:qcom,msm-dai-q6-tdm-tert-rx-0: msm_dai_q6_tdm_dev_probe: dev_name: soc:qcom,msm-dai-tdm-tert-rx:qcom,msm-dai-q6-tdm-tert-rx-0 dev_id: 0x9020
1012<6>[ 1.481728]@3 msm-dai-q6-tdm soc:qcom,msm-dai-tdm-tert-rx:qcom,msm-dai-q6-tdm-tert-rx-0: msm_dai_q6_tdm_dev_probe: Custom tdm header not supported
1013<6>[ 1.481859]@3 msm-dai-q6-tdm soc:qcom,msm-dai-tdm-tert-rx:qcom,msm-dai-q6-tdm-tert-rx-1: msm_dai_q6_tdm_dev_probe: dev_name: soc:qcom,msm-dai-tdm-tert-rx:qcom,msm-dai-q6-tdm-tert-rx-1 dev_id: 0x9022
1014<6>[ 1.481868]@3 msm-dai-q6-tdm soc:qcom,msm-dai-tdm-tert-rx:qcom,msm-dai-q6-tdm-tert-rx-1: msm_dai_q6_tdm_dev_probe: Custom tdm header not supported
1015<6>[ 1.481991]@3 msm-dai-q6-tdm soc:qcom,msm-dai-tdm-tert-rx:qcom,msm-dai-q6-tdm-tert-rx-2: msm_dai_q6_tdm_dev_probe: dev_name: soc:qcom,msm-dai-tdm-tert-rx:qcom,msm-dai-q6-tdm-tert-rx-2 dev_id: 0x9024
1016<6>[ 1.482000]@3 msm-dai-q6-tdm soc:qcom,msm-dai-tdm-tert-rx:qcom,msm-dai-q6-tdm-tert-rx-2: msm_dai_q6_tdm_dev_probe: Custom tdm header not supported
1017<6>[ 1.482124]@3 msm-dai-q6-tdm soc:qcom,msm-dai-tdm-tert-rx:qcom,msm-dai-q6-tdm-tert-rx-3: msm_dai_q6_tdm_dev_probe: dev_name: soc:qcom,msm-dai-tdm-tert-rx:qcom,msm-dai-q6-tdm-tert-rx-3 dev_id: 0x9026
1018<6>[ 1.482132]@3 msm-dai-q6-tdm soc:qcom,msm-dai-tdm-tert-rx:qcom,msm-dai-q6-tdm-tert-rx-3: msm_dai_q6_tdm_dev_probe: Custom tdm header not supported
1019<6>[ 1.482151]@3 msm-dai-tdm soc:qcom,msm-dai-tdm-tert-tx: msm_dai_tdm_q6_probe: dev_name: soc:qcom,msm-dai-tdm-tert-tx group_id: 0x9121
1020<6>[ 1.482276]@3 msm-dai-q6-tdm soc:qcom,msm-dai-tdm-tert-tx:qcom,msm-dai-q6-tdm-tert-tx-0: msm_dai_q6_tdm_dev_probe: dev_name: soc:qcom,msm-dai-tdm-tert-tx:qcom,msm-dai-q6-tdm-tert-tx-0 dev_id: 0x9021
1021<6>[ 1.482285]@3 msm-dai-q6-tdm soc:qcom,msm-dai-tdm-tert-tx:qcom,msm-dai-q6-tdm-tert-tx-0: msm_dai_q6_tdm_dev_probe: Custom tdm header not supported
1022<6>[ 1.482408]@3 msm-dai-q6-tdm soc:qcom,msm-dai-tdm-tert-tx:qcom,msm-dai-q6-tdm-tert-tx-1: msm_dai_q6_tdm_dev_probe: dev_name: soc:qcom,msm-dai-tdm-tert-tx:qcom,msm-dai-q6-tdm-tert-tx-1 dev_id: 0x9023
1023<3>[ 1.482416]@3 msm-dai-q6-tdm soc:qcom,msm-dai-tdm-tert-tx:qcom,msm-dai-q6-tdm-tert-tx-1: msm_dai_q6_tdm_dev_probe: Data Align from DT file qcom,msm-cpudai-tdm-data-align
1024<4>[ 1.482425]@3 msm-dai-q6-tdm: probe of soc:qcom,msm-dai-tdm-tert-tx:qcom,msm-dai-q6-tdm-tert-tx-1 failed with error -22
1025<6>[ 1.482545]@3 msm-dai-q6-tdm soc:qcom,msm-dai-tdm-tert-tx:qcom,msm-dai-q6-tdm-tert-tx-2: msm_dai_q6_tdm_dev_probe: dev_name: soc:qcom,msm-dai-tdm-tert-tx:qcom,msm-dai-q6-tdm-tert-tx-2 dev_id: 0x9025
1026<3>[ 1.482553]@3 msm-dai-q6-tdm soc:qcom,msm-dai-tdm-tert-tx:qcom,msm-dai-q6-tdm-tert-tx-2: msm_dai_q6_tdm_dev_probe: Data Align from DT file qcom,msm-cpudai-tdm-data-align
1027<4>[ 1.482560]@3 msm-dai-q6-tdm: probe of soc:qcom,msm-dai-tdm-tert-tx:qcom,msm-dai-q6-tdm-tert-tx-2 failed with error -22
1028<6>[ 1.482681]@3 msm-dai-q6-tdm soc:qcom,msm-dai-tdm-tert-tx:qcom,msm-dai-q6-tdm-tert-tx-3: msm_dai_q6_tdm_dev_probe: dev_name: soc:qcom,msm-dai-tdm-tert-tx:qcom,msm-dai-q6-tdm-tert-tx-3 dev_id: 0x9027
1029<6>[ 1.482689]@3 msm-dai-q6-tdm soc:qcom,msm-dai-tdm-tert-tx:qcom,msm-dai-q6-tdm-tert-tx-3: msm_dai_q6_tdm_dev_probe: Custom tdm header not supported
1030<6>[ 1.482708]@3 msm-dai-tdm soc:qcom,msm-dai-tdm-quat-rx: msm_dai_tdm_q6_probe: dev_name: soc:qcom,msm-dai-tdm-quat-rx group_id: 0x9130
1031<6>[ 1.482828]@3 msm-dai-q6-tdm soc:qcom,msm-dai-tdm-quat-rx:qcom,msm-dai-q6-tdm-quat-rx-0: msm_dai_q6_tdm_dev_probe: dev_name: soc:qcom,msm-dai-tdm-quat-rx:qcom,msm-dai-q6-tdm-quat-rx-0 dev_id: 0x9030
1032<6>[ 1.482836]@3 msm-dai-q6-tdm soc:qcom,msm-dai-tdm-quat-rx:qcom,msm-dai-q6-tdm-quat-rx-0: msm_dai_q6_tdm_dev_probe: Custom tdm header not supported
1033<6>[ 1.482965]@3 msm-dai-q6-tdm soc:qcom,msm-dai-tdm-quat-rx:qcom,msm-dai-q6-tdm-quat-rx-1: msm_dai_q6_tdm_dev_probe: dev_name: soc:qcom,msm-dai-tdm-quat-rx:qcom,msm-dai-q6-tdm-quat-rx-1 dev_id: 0x9032
1034<6>[ 1.482975]@3 msm-dai-q6-tdm soc:qcom,msm-dai-tdm-quat-rx:qcom,msm-dai-q6-tdm-quat-rx-1: msm_dai_q6_tdm_dev_probe: Custom tdm header not supported
1035<6>[ 1.483096]@3 msm-dai-q6-tdm soc:qcom,msm-dai-tdm-quat-rx:qcom,msm-dai-q6-tdm-quat-rx-2: msm_dai_q6_tdm_dev_probe: dev_name: soc:qcom,msm-dai-tdm-quat-rx:qcom,msm-dai-q6-tdm-quat-rx-2 dev_id: 0x9034
1036<6>[ 1.483104]@3 msm-dai-q6-tdm soc:qcom,msm-dai-tdm-quat-rx:qcom,msm-dai-q6-tdm-quat-rx-2: msm_dai_q6_tdm_dev_probe: Custom tdm header not supported
1037<6>[ 1.483225]@3 msm-dai-q6-tdm soc:qcom,msm-dai-tdm-quat-rx:qcom,msm-dai-q6-tdm-quat-rx-3: msm_dai_q6_tdm_dev_probe: dev_name: soc:qcom,msm-dai-tdm-quat-rx:qcom,msm-dai-q6-tdm-quat-rx-3 dev_id: 0x9036
1038<6>[ 1.483234]@3 msm-dai-q6-tdm soc:qcom,msm-dai-tdm-quat-rx:qcom,msm-dai-q6-tdm-quat-rx-3: msm_dai_q6_tdm_dev_probe: Custom tdm header not supported
1039<6>[ 1.483254]@3 msm-dai-tdm soc:qcom,msm-dai-tdm-quat-tx: msm_dai_tdm_q6_probe: dev_name: soc:qcom,msm-dai-tdm-quat-tx group_id: 0x9131
1040<6>[ 1.483595]@3 msm-dai-q6-tdm soc:qcom,msm-dai-tdm-quat-tx:qcom,msm-dai-q6-tdm-quat-tx-0: msm_dai_q6_tdm_dev_probe: dev_name: soc:qcom,msm-dai-tdm-quat-tx:qcom,msm-dai-q6-tdm-quat-tx-0 dev_id: 0x9031
1041<6>[ 1.483605]@3 msm-dai-q6-tdm soc:qcom,msm-dai-tdm-quat-tx:qcom,msm-dai-q6-tdm-quat-tx-0: msm_dai_q6_tdm_dev_probe: Custom tdm header not supported
1042<6>[ 1.483734]@3 msm-dai-q6-tdm soc:qcom,msm-dai-tdm-quat-tx:qcom,msm-dai-q6-tdm-quat-tx-1: msm_dai_q6_tdm_dev_probe: dev_name: soc:qcom,msm-dai-tdm-quat-tx:qcom,msm-dai-q6-tdm-quat-tx-1 dev_id: 0x9033
1043<6>[ 1.483743]@3 msm-dai-q6-tdm soc:qcom,msm-dai-tdm-quat-tx:qcom,msm-dai-q6-tdm-quat-tx-1: msm_dai_q6_tdm_dev_probe: Custom tdm header not supported
1044<6>[ 1.483866]@3 msm-dai-q6-tdm soc:qcom,msm-dai-tdm-quat-tx:qcom,msm-dai-q6-tdm-quat-tx-2: msm_dai_q6_tdm_dev_probe: dev_name: soc:qcom,msm-dai-tdm-quat-tx:qcom,msm-dai-q6-tdm-quat-tx-2 dev_id: 0x9035
1045<6>[ 1.483875]@3 msm-dai-q6-tdm soc:qcom,msm-dai-tdm-quat-tx:qcom,msm-dai-q6-tdm-quat-tx-2: msm_dai_q6_tdm_dev_probe: Custom tdm header not supported
1046<6>[ 1.483998]@3 msm-dai-q6-tdm soc:qcom,msm-dai-tdm-quat-tx:qcom,msm-dai-q6-tdm-quat-tx-3: msm_dai_q6_tdm_dev_probe: dev_name: soc:qcom,msm-dai-tdm-quat-tx:qcom,msm-dai-q6-tdm-quat-tx-3 dev_id: 0x9037
1047<6>[ 1.484006]@3 msm-dai-q6-tdm soc:qcom,msm-dai-tdm-quat-tx:qcom,msm-dai-q6-tdm-quat-tx-3: msm_dai_q6_tdm_dev_probe: Custom tdm header not supported
1048<6>[ 1.486019]@3 msm-compr-dsp soc:qcom,msm-compr-dsp: msm_compr_probe: dev name soc:qcom,msm-compr-dsp
1049<3>[ 1.493583]@3 msm8996_populate_dai_link_component_of_node codec_name=tfa98xx.3-0036
1050<3>[ 1.493873]@3 msm8996-asoc-snd soc:sound-9335: ASoC: platform (null) not registered
1051<6>[ 1.494912]@3 GACT probability NOT on
1052<6>[ 1.494929]@3 Mirror/redirect action on
1053<6>[ 1.494946]@3 u32 classifier
1054<6>[ 1.494949]@3 Actions configured
1055<6>[ 1.494969]@3 Netfilter messages via NETLINK v0.30.
1056<6>[ 1.494996]@3 nf_conntrack version 0.5.0 (16384 buckets, 65536 max)
1057<6>[ 1.495189]@3 ctnetlink v0.93: registering with nfnetlink.
1058<6>[ 1.495452]@3 xt_time: kernel timezone is -0000
1059<6>[ 1.495586]@3 ip_tables: (C) 2000-2006 Netfilter Core Team
1060<6>[ 1.495657]@3 arp_tables: (C) 2002 David S. Miller
1061<6>[ 1.495680]@3 TCP: cubic registered
1062<6>[ 1.495686]@3 TCP: westwood registered
1063<6>[ 1.495691]@3 TCP: htcp registered
1064<6>[ 1.495696]@3 Initializing XFRM netlink socket
1065<6>[ 1.495882]@3 NET: Registered protocol family 10
1066<6>[ 1.496366]@3 mip6: Mobile IPv6
1067<6>[ 1.496382]@3 ip6_tables: (C) 2000-2006 Netfilter Core Team
1068<6>[ 1.496449]@3 sit: IPv6 over IPv4 tunneling driver
1069<6>[ 1.496657]@3 NET: Registered protocol family 17
1070<6>[ 1.496672]@3 NET: Registered protocol family 15
1071<6>[ 1.496727]@3 bridge: automatic filtering via arp/ip/ip6tables has been deprecated. Update your scripts to load br_netfilter if you need this.
1072<5>[ 1.496743]@3 Bridge firewalling registered
1073<6>[ 1.496750]@3 Ebtables v2.0 registered
1074<6>[ 1.496904]@3 Bluetooth: RFCOMM TTY layer initialized
1075<6>[ 1.496913]@3 Bluetooth: RFCOMM socket layer initialized
1076<6>[ 1.496931]@3 Bluetooth: RFCOMM ver 1.11
1077<6>[ 1.496940]@3 Bluetooth: BNEP (Ethernet Emulation) ver 1.3
1078<6>[ 1.496944]@3 Bluetooth: BNEP filters: protocol multicast
1079<6>[ 1.496950]@3 Bluetooth: BNEP socket layer initialized
1080<6>[ 1.496956]@3 Bluetooth: HIDP (Human Interface Emulation) ver 1.2
1081<6>[ 1.496962]@3 Bluetooth: HIDP socket layer initialized
1082<6>[ 1.496984]@3 l2tp_core: L2TP core driver, V2.0
1083<6>[ 1.496995]@3 l2tp_ppp: PPPoL2TP kernel driver, V2.0
1084<6>[ 1.497000]@3 l2tp_ip: L2TP IP encapsulation support (L2TPv3)
1085<6>[ 1.497017]@3 l2tp_netlink: L2TP netlink interface
1086<6>[ 1.497034]@3 l2tp_eth: L2TP ethernet pseudowire support (L2TPv3)
1087<6>[ 1.497049]@3 l2tp_debugfs: L2TP debugfs support
1088<6>[ 1.497055]@3 l2tp_ip6: L2TP IP encapsulation support for IPv6 (L2TPv3)
1089<6>[ 1.497822]@3 NET: Registered protocol family 27
1090<3>[ 1.497860]@3 IPC_RTR: ipc_router_create_log_ctx: Unable to create IPC logging for [local_IPCRTR]
1091<6>kgsl kgsl-3d0: Initialized kgsl-3d0: mmu=on
1092<3>[ 1.509053]@0 sps_register_bam_device : unable to create IPC Logging 0 for bam 0x0000000006b04000
1093<3>sps_register_bam_device : unable to create IPC Logging 1 for bam 0x0000000006b04000sps_register_bam_device : unable to create IPC Logging 2 for bam 0x0000000006b04000
1094<3>sps_register_bam_device : unable to create IPC Logging 3 for bam 0x0000000006b04000sps_register_bam_device : unable to create IPC Logging 4 for bam 0x0000000006b04000
1095<6>sps:BAM 0x0000000006b04000 is registered.<3>qpnp-smbcharger qpnp-smbcharger-ffffffc175d4c800: node /soc/qcom,spmi@400f000/qcom,pmi8994@2/qcom,qpnp-smbcharger IO resource absent!
1096<6>[ 1.510818]@1 smbcharger_charger_otg: no parameters
1097<6>[ 1.510939]@1 smbcharger_external_otg: no parameters
1098<6>[ 1.510965]@1 smbcharger_external_otg: supplied by pmi8994_boost_5v
1099<6>[ 1.511045]@1 SMBCHG: smbchg_hw_init: enable APSD
1100<6>[ 1.511087]@1 SMBCHG: smbchg_hw_init: disabe HVDCP
1101<3>[ 1.511287]@1 qpnp-smbcharger qpnp-smbcharger-ffffffc175d4c800: smbchg_charging_en:en=1
1102<3>qpnp-smbcharger qpnp-smbcharger-ffffffc175d4c800: smbchg_charging_en:en=0
1103<3>qpnp-smbcharger qpnp-smbcharger-ffffffc175d4c800: smbchg_usb_suspend:0
1104<3>[ 1.512163]@1 SMBCHG: smbchg_set_fastchg_current_raw: fastcharge current requested 500, set to 500
1105<6>[ 1.533603]@1 SMBCHG: src_detect_handler: chip->usb_present = 0 usb_present = 1 src_detect = 1 hvdcp_3_det_ignore_uv=0
1106<3>[ 1.533625]@1 SMBCHG: handle_usb_insertion: inserted type = 4 (SDP)
1107<3>qpnp-smbcharger qpnp-smbcharger-ffffffc175d4c800: smbchg_charging_en:en=1
1108<6>FG: oneplus_set_allow_read_iic: set allow read extern fg iic fail
1109<3>[ 1.533663]@1 qpnp-smbcharger qpnp-smbcharger-ffffffc175d4c800: USB current_ma = 500,typeC_support_current_ma=4000
1110<3>[ 1.557635]@1 msm-usb-ssphy-qmp 7410000.ssphy: Initializing QMP phy
1111<6>[ 1.557758]@1 msm-dwc3 6a00000.ssusb: DWC3-msm runtime suspend
1112<3>[ 1.557769]@1 msm-dwc3 6a00000.ssusb: Not in P3,aborting LPM sequence
1113<4>[ 1.557803]@1 oem_test_id ret:1, otg_switch:1, otg_state:1
1114<6>[ 1.557882]@1 SMBCHG: smbchg_usb_update_online_work: chip->usb_online = -22, online = 1
1115<3>[ 1.557996]@1 SMBCHG: handle_usb_insertion: inserted type = 4 (SDP)
1116<3>qpnp-smbcharger qpnp-smbcharger-ffffffc175d4c800: smbchg_charging_en:en=1
1117<6>FG: oneplus_set_allow_read_iic: set allow read extern fg iic fail
1118<6>[ 1.558167]@1 SMBCHG: smbchg_usb_update_online_work: chip->usb_online = 1, online = 1
1119<3>[ 1.558406]@1 load_data: stored_soc[0x8f], shutdown_soc[71]
1120<4>[ 1.559041]@1 oem_test_id ret:1, otg_switch:1, otg_state:3
1121<3>[ 1.573708]@1 load_data: stored_soc[0x8f], shutdown_soc[71]
1122<3>[ 1.574149]@1 load_data: stored_soc[0x8f], shutdown_soc[71]
1123<3>[ 1.575546]@1 load_data: stored_soc[0x8f], shutdown_soc[71]
1124<3>[ 1.576863]@1 qpnp-smbcharger qpnp-smbcharger-ffffffc175d4c800: node /soc/qcom,spmi@400f000/qcom,pmi8994@2/qcom,qpnp-smbcharger IO resource absent!
1125<3>[ 1.576916]@1 load_data: stored_soc[0x8f], shutdown_soc[71]
1126<3>[ 1.576924]@1 qpnp-smbcharger qpnp-smbcharger-ffffffc175d4c800: current_limit = 0
1127<3>[ 1.577094]@1 load_data: stored_soc[0x8f], shutdown_soc[71]
1128<6>[ 1.577904]@1 qpnp-smbcharger qpnp-smbcharger-ffffffc175d4c800: SMBCHG successfully probe Charger version=SCHG Revision DIG:2.0 ANA:2.1 batt=1 dc=0 usb=1
1129<3>[ 1.578524]@1 load_data: stored_soc[0x8f], shutdown_soc[71]
1130<3>[ 1.579820]@1 msm8996_populate_dai_link_component_of_node codec_name=tfa98xx.3-0036
1131<3>[ 1.580218]@1 msm8996-asoc-snd soc:sound-9335: ASoC: platform (null) not registered
1132<3>[ 1.580642]@1 tusb320 7-0060: tusb320_probe
1133<3>[ 1.581040]@1 i2c-msm-v2 75b5000.i2c: msm_bus_scale_register_client(mstr-id:84):0x21 (ok)
1134<3>i2c-msm-v2 75b5000.i2c: NACK: slave not responding, ensure its powered: msgs(n:2 cur:0 tx) bc(rx:1 tx:1) mode:FIFO slv_addr:0x60 MSTR_STS:0x0d1300c8 OPER:0x00000010
1135<4>[ 1.581198]@1 tusb320_read_reg:reg(0x0), ret(-107)
1136<3>[ 1.581205]@1 tusb320 7-0060: DEV_ID(0x0)!= 0x30
1137<4>[ 1.581218]@1 tusb320: probe of 7-0060 failed with error -22
1138<3>[ 1.581273]@1 fusb301 7-0021: fusb301_probe
1139<3>[ 1.581562]@1 fusb301 7-0021: fusb301_gpio_configure OK!
1140<3>[ 1.582192]@1 fusb301 7-0021: fusb301_probe OK!
1141<3>[ 1.582249]@1 ptn5150 7-001d: ptn5150_probe
1142<3>[ 1.582307]@0 i2c-msm-v2 75b5000.i2c: NACK: slave not responding, ensure its powered: msgs(n:2 cur:0 tx) bc(rx:1 tx:1) mode:FIFO slv_addr:0x1d MSTR_STS:0x0d1343c8 OPER:0x00000010
1143<3>[ 1.582337]@1 ptn5150_read_reg: i2c read error: -5
1144<3>[ 1.582344]@1 ptn5150 7-001d: DEV_ID(0x00)!= 0x0b || 0x09
1145<4>[ 1.582354]@1 ptn5150: probe of 7-001d failed with error -22
1146<3>[ 1.583982]@2 msm8996_populate_dai_link_component_of_node codec_name=tfa98xx.3-0036
1147<3>[ 1.584283]@2 msm8996-asoc-snd soc:sound-9335: ASoC: platform (null) not registered
1148<6>[ 1.586814]@3 project_info_init_sysfs success
1149<3>[ 1.594780]@0 msm8996_populate_dai_link_component_of_node codec_name=tfa98xx.3-0036
1150<3>[ 1.595141]@0 msm8996-asoc-snd soc:sound-9335: ASoC: platform (null) not registered
1151<3>[ 1.595694]@3 ngd_msm_ctrl 91c0000.slim: error creating ipc_logging context
1152<6>[ 1.596549]@3 RNDIS_IPA module is loaded.
1153<6>file system registered
1154<6>[ 1.597282]@3 mbim_init: initialize 1 instances
1155<6>[ 1.597320]@3 mbim_init: Initialized 1 ports
1156<3>[ 1.597757]@0 msm8996_populate_dai_link_component_of_node codec_name=tfa98xx.3-0036
1157<6>[ 1.597986]@3 rndis_qc_init: initialize rndis QC instance
1158<6>[ 1.598090]@3 Number of LUNs=8
1159<6>[ 1.598097]@3 Mass Storage Function, version: 2009/09/11
1160<6>[ 1.598102]@3 LUN: removable file: (no medium)
1161<6>[ 1.598114]@3 Number of LUNs=1
1162<3>[ 1.598117]@0 msm8996-asoc-snd soc:sound-9335: ASoC: platform (null) not registered
1163<6>[ 1.598139]@3 LUN: removable file: (no medium)
1164<6>[ 1.598143]@3 Number of LUNs=1
1165<6>[ 1.598263]@3 android_usb gadget: android_usb ready
1166<6>[ 1.600218]@3 input: gpio-keys as /devices/soc/soc:gpio_keys/input/input3
1167<3>[ 1.600367]@0 msm8996_populate_dai_link_component_of_node codec_name=tfa98xx.3-0036
1168<6>[ 1.600762]@3 qcom,qpnp-rtc qpnp-rtc-ffffffc175d46400: setting system clock to 1970-05-04 14:05:49 UTC (10677949)
1169<3>[ 1.600775]@0 msm8996-asoc-snd soc:sound-9335: ASoC: platform (null) not registered
1170<3>[ 1.602596]@3 load_data: stored_soc[0x8f], shutdown_soc[71]
1171<3>[ 1.603042]@0 msm8996_populate_dai_link_component_of_node codec_name=tfa98xx.3-0036
1172<3>[ 1.603488]@2 msm8996-asoc-snd soc:sound-9335: ASoC: platform (null) not registered
1173<3>[ 1.605029]@2 msm8996_populate_dai_link_component_of_node codec_name=tfa98xx.3-0036
1174<3>[ 1.605345]@2 msm8996-asoc-snd soc:sound-9335: ASoC: platform (null) not registered
1175<3>[ 1.606954]@2 msm8996_populate_dai_link_component_of_node codec_name=tfa98xx.3-0036
1176<3>[ 1.607255]@2 msm8996-asoc-snd soc:sound-9335: ASoC: platform (null) not registered
1177<6>[ 1.607855]@0 msm_thermal:disable_msm_thermal Max frequency reset for CPU0
1178<6>[ 1.607864]@0 msm_thermal:disable_msm_thermal Max frequency reset for CPU1
1179<6>[ 1.607870]@0 msm_thermal:disable_msm_thermal Max frequency reset for CPU2
1180<6>[ 1.607874]@0 msm_thermal:disable_msm_thermal Max frequency reset for CPU3
1181<3>[ 1.608898]@2 msm8996_populate_dai_link_component_of_node codec_name=tfa98xx.3-0036
1182<3>[ 1.609225]@2 msm8996-asoc-snd soc:sound-9335: ASoC: platform (null) not registered
1183<6>[ 1.610413]@2 lmh_lite:lmh_parse_sensor Registering sensor:[DLMt_APC1]
1184<6>[ 1.610634]@3 lmh_lite:lmh_parse_sensor Registering sensor:[LLM_cp00]
1185<6>[ 1.610766]@3 lmh_lite:lmh_parse_sensor Registering sensor:[LLM_cp01]
1186<6>[ 1.610892]@3 lmh_lite:lmh_parse_sensor Registering sensor:[LLM_cp10]
1187<6>[ 1.611014]@3 lmh_lite:lmh_parse_sensor Registering sensor:[LLM_cp11]
1188<6>[ 1.611138]@3 lmh_lite:lmh_parse_sensor Registering sensor:[LLM_m4m0]
1189<6>[ 1.611260]@3 lmh_lite:lmh_parse_sensor Registering sensor:[LLM_l21-]
1190<6>[ 1.611383]@3 lmh_lite:lmh_parse_sensor Registering sensor:[LLM_l20-]
1191<3>[ 1.613786]@2 msm8996_populate_dai_link_component_of_node codec_name=tfa98xx.3-0036
1192<3>[ 1.614113]@2 msm8996-asoc-snd soc:sound-9335: ASoC: platform (null) not registered
1193<3>[ 1.616274]@2 msm8996_populate_dai_link_component_of_node codec_name=tfa98xx.3-0036
1194<3>[ 1.616588]@2 msm8996-asoc-snd soc:sound-9335: ASoC: platform (null) not registered
1195<3>[ 1.616625]@3 qcom,qpnp-flash-led qpnp-flash-led-ffffffc175d5d800: Unable to acquire pinctrl
1196<6>[ 1.617701]@3 rmnet_ipa started initialization
1197<6>[ 1.617711]@3 IPA SSR support = True
1198<6>[ 1.617715]@3 IPA ipa-loaduC = True
1199<6>[ 1.617719]@3 IPA SG support = True
1200<3>[ 1.618669]@2 msm8996_populate_dai_link_component_of_node codec_name=tfa98xx.3-0036
1201<3>[ 1.618929]@3 ipa ipa_sps_irq_control_all:925 EP (5) not allocated.
1202<3>[ 1.618936]@3 ipa ipa_uc_state_check:296 uC is not loaded
1203<3>[ 1.618970]@2 msm8996-asoc-snd soc:sound-9335: ASoC: platform (null) not registered
1204<6>[ 1.619609]@3 rmnet_ipa completed initialization
1205<3>[ 1.621176]@2 msm8996_populate_dai_link_component_of_node codec_name=tfa98xx.3-0036
1206<3>[ 1.621475]@2 msm8996-asoc-snd soc:sound-9335: ASoC: platform (null) not registered
1207<6>[ 1.622647]@3 qcom,cc-debug-8996 362000.qcom,cc-debug: Registered debug mux.
1208<6>[ 1.623426]@3 rome_vreg: disabling
1209<6>[ 1.623437]@3 gdsc_mmagic_bimc: disabling
1210<6>[ 1.623474]@3 kryo1-retention: disabling
1211<6>[ 1.623478]@3 kryo0-retention: disabling
1212<6>[ 1.623482]@3 gfx_mem_acc_corner: disabling
1213<6>[ 1.623486]@3 apcc_l3_mem_acc_corner: disabling
1214<6>[ 1.623490]@3 apc1_perfcl_mem_acc_corner: disabling
1215<6>[ 1.623493]@3 apc0_pwrcl_mem_acc_corner: disabling
1216<6>[ 1.623500]@3 regulator_proxy_consumer_remove_all: removing regulator proxy consumer requests
1217<3>[ 1.623623]@0 synaptics,s3320: synaptics_tpedge_limitfunc limit_enable =1,mode:0x47 !
1218<6>[ 1.623721]@3 clock_late_init: Removing enables held for handed-off clocks
1219<6>[ 1.623953]@0 input: synaptics as /devices/soc/75ba000.i2c/i2c-12/12-0020/input/input4
1220<3>[ 1.624239]@2 msm8996_populate_dai_link_component_of_node codec_name=tfa98xx.3-0036
1221<3>[ 1.624534]@2 msm8996-asoc-snd soc:sound-9335: ASoC: platform (null) not registered
1222<6>[ 1.627051]@3 ALSA device list:
1223<6>[ 1.627056]@3 No soundcards found.
1224<3>[ 1.627103]@3 Warning: unable to open an initial console.
1225<6>[ 1.627258]@3 Freeing unused kernel memory: 284K (ffffffc00127e000 - ffffffc0012c5000)
1226<6>[ 1.627267]@3 Freeing alternatives memory: 28K (ffffffc0012c5000 - ffffffc0012cc000)
1227<13>[ 1.627930]@3 init: init started!
1228<3>[ 1.628245]@3 SELinux: security_load_policy, ss_initialized: 0
1229<7>[ 1.629469]@3 SELinux: 2048 avtab hash slots, 5103 rules.
1230<6>[ 1.629560]@3 SELinux: Android master kernel running Android M policy in compatibility mode.
1231<3>[ 1.629986]@2 load_data: stored_soc[0x8f], shutdown_soc[71]
1232<7>[ 1.630212]@3 SELinux: 2048 avtab hash slots, 5103 rules.
1233<7>[ 1.630221]@3 SELinux: 1 users, 2 roles, 546 types, 0 bools, 1 sens, 1024 cats
1234<7>[ 1.630227]@3 SELinux: 87 classes, 5103 rules
1235<6>[ 1.630676]@3 SELinux: Permission audit_read in class capability2 not defined in policy.
1236<6>[ 1.630691]@3 SELinux: the above unknown classes and permissions will be denied
1237<7>[ 1.630719]@3 SELinux: Completing initialization.
1238<7>[ 1.630722]@3 SELinux: Setting up existing superblocks.
1239<7>[ 1.630730]@3 SELinux: initialized (dev tmpfs, type tmpfs), uses transition SIDs
1240<7>[ 1.630746]@3 SELinux: initialized (dev rootfs, type rootfs), uses genfs_contexts
1241<7>[ 1.631180]@3 SELinux: initialized (dev bdev, type bdev), not configured for labeling
1242<7>[ 1.631190]@3 SELinux: initialized (dev proc, type proc), uses genfs_contexts
1243<7>[ 1.631204]@3 SELinux: initialized (dev debugfs, type debugfs), uses genfs_contexts
1244<3>[ 1.631492]@2 load_data: stored_soc[0x8f], shutdown_soc[71]
1245<7>[ 1.645007]@3 SELinux: initialized (dev sockfs, type sockfs), uses task SIDs
1246<7>[ 1.645023]@3 SELinux: initialized (dev pipefs, type pipefs), uses task SIDs
1247<7>[ 1.645029]@3 SELinux: initialized (dev anon_inodefs, type anon_inodefs), not configured for labeling
1248<7>[ 1.645035]@3 SELinux: initialized (dev aio, type aio), not configured for labeling
1249<7>[ 1.645042]@3 SELinux: initialized (dev devpts, type devpts), uses transition SIDs
1250<7>[ 1.645056]@3 SELinux: initialized (dev selinuxfs, type selinuxfs), uses genfs_contexts
1251<7>[ 1.645113]@3 SELinux: initialized (dev configfs, type configfs), not configured for labeling
1252<7>[ 1.645120]@3 SELinux: initialized (dev tmpfs, type tmpfs), uses transition SIDs
1253<7>[ 1.645134]@3 SELinux: initialized (dev sysfs, type sysfs), uses genfs_contexts
1254<3>[ 1.660109]@2 SELinux: security_load_policy, sidtab.shutdown: 0
1255<5>[ 1.662978]@2 audit: type=1403 audit(10677949.556:2): policy loaded auid=4294967295 ses=4294967295
1256<13>[ 1.663311]@2 init: (Initializing SELinux non-enforcing took 0.04s.)
1257<13>[ 1.666225]@2 init: init second stage started!
1258<11>[ 1.666443]@2 init: property_set("ro.boot.selinux", "permissive") failed
1259<3>[ 1.676706]@0 synaptics,s3320: synaptic:ts->irq is 414
1260<3>[ 1.677472]@1 synaptics,s3320: synaptics_mode_change: set TP to mode[0x80]
1261<11>[ 1.686562]@2 init: waitpid failed: No child processes
1262<13>[ 1.686851]@2 init: (Loading properties from /default.prop took 0.00s.)
1263<11>[ 1.687096]@2 init: /init.rc: 11: invalid command 'setcon'
1264<11>[ 1.687131]@2 init: /init.rc: 57: invalid command 'load_all_props'
1265<11>[ 1.687185]@2 init: could not import file '/init.recovery.logd.rc' from '/init.rc'
1266<13>[ 1.687256]@2 init: (Parsing /init.recovery.usb.rc took 0.00s.)
1267<13>[ 1.687360]@2 init: (Parsing /init.recovery.qcom.rc took 0.00s.)
1268<13>[ 1.687371]@2 init: (Parsing /init.rc took 0.00s.)
1269<4>[ 1.687394]@0 synaptics,s3320: synaptics_ts_probe 3203: normal end
1270<5>[ 1.687435]@2 audit: type=1400 audit(10677949.583:3): avc: denied { setcheckreqprot } for pid=1 comm="init" scontext=u:r:init:s0 tcontext=u:object_r:kernel:s0 tclass=security permissive=1
1271<13>[ 1.687474]@2 init: Starting service 'ueventd'...
1272<13>[ 1.687634]@2 init: Starting service 'healthd'...
1273<13>[ 1.687778]@2 init: write_file: Unable to open '/sys/block/dm-0/queue/nr_requests': No such file or directory
1274<13>[ 1.687934]@2 init: write_file: Unable to open '/sys/block/dm-0/queue/read_ahead_kb': No such file or directory
1275<13>[ 1.688002]@2 init: Waiting for /dev/.coldboot_done...
1276<13>[ 1.688668]@3 ueventd: ueventd started!
1277<3>[ 1.689858]@0 load_data: stored_soc[0x8f], shutdown_soc[71]
1278<3>[ 1.710470]@2 load_data: stored_soc[0x8f], shutdown_soc[71]
1279<3>[ 1.715003]@2 load_data: stored_soc[0x8f], shutdown_soc[71]
1280<3>[ 1.778178]@3 load_data: stored_soc[0x8f], shutdown_soc[71]
1281<3>[ 1.778340]@2 load_data: stored_soc[0x8f], shutdown_soc[71]
1282<3>[ 1.807111]@0 i2c-msm-v2 75b6000.i2c: msm_bus_scale_register_client(mstr-id:84):0x23 (ok)
1283<3>touchkey,s1302: product id is s1302
1284<3>[ 1.808109]@0 touchkey,s1302: F11_2D_QUERY_BASE = 95
1285<3> F11_2D_CMD_BASE = 6e
1286<3> F11_2D_CTRL_BASE = 3d
1287<3> F11_2D_DATA_BASE = 15
1288<3>
1289<3>touchkey,s1302: CURRENT_FIRMWARE_ID = 0x4
1290<3>[ 1.809667]@0 touchkey,s1302: before fw update,bootloader_mode = 0x0
1291<6>[ 1.809821]@0 input: synaptics as /devices/soc/75b6000.i2c/i2c-8/8-0020/input/input5
1292<3>[ 1.826137]@2 load_data: stored_soc[0x8f], shutdown_soc[71]
1293<3>[ 1.837415]@2 load_data: stored_soc[0x8f], shutdown_soc[71]
1294<3>[ 1.837557]@3 load_data: stored_soc[0x8f], shutdown_soc[71]
1295<3>[ 1.839042]@3 load_data: stored_soc[0x8f], shutdown_soc[71]
1296<3>[ 1.839187]@2 load_data: stored_soc[0x8f], shutdown_soc[71]
1297<3>[ 1.883370]@0 touchkey,s1302: synaptic:ts->irq is 421
1298<3>[ 1.883544]@0 touchkey,s1302: touchkey using poll status:0
1299<3>[ 1.883849]@0 touchkey,s1302: synaptics_soft_reset !!!
1300<3>[ 1.883881]@0 touchkey,s1302: create nodes is successe!
1301<4>[ 1.883977]@0 touchkey,s1302: synaptics_ts_probe s1302: normal end
1302<3>[ 1.883982]@0 touchkey,s1302: boot_time: synaptics_ts_probe return 0
1303<13>[ 1.915754]@3 ueventd: Coldboot took 0.23s.
1304<13>[ 1.920042]@0 init: Waiting for /dev/.coldboot_done took 0.23s.
1305<7>[ 1.921135]@0 SELinux: initialized (dev tmpfs, type tmpfs), uses transition SIDs
1306<7>[ 1.922181]@0 SELinux: initialized (dev pstore, type pstore), uses genfs_contexts
1307<7>[ 1.922713]@0 SELinux: initialized (dev functionfs, type functionfs), uses genfs_contexts
1308<3>[ 1.922802]@0 enable_store: android_usb: already disabled
1309<11>[ 1.922985]@0 init: property 'ro.product.model' doesn't exist while expanding '${ro.product.model}'
1310<11>[ 1.922999]@0 init: cannot expand '${ro.product.model}' while writing to '/sys/class/android_usb/android0/iProduct'
1311<13>[ 1.923072]@0 init: (Loading properties from /system/build.prop took 0.00s.)
1312<13>[ 1.923098]@0 init: (Loading properties from /vendor/build.prop took 0.00s.)
1313<13>[ 1.923119]@0 init: (Loading properties from /factory/factory.prop took 0.00s.)
1314<11>[ 1.923152]@0 fs_mgr: Cannot open file /fstab.qcom
1315<11>[ 1.923165]@0 init: unable to read fstab /fstab.qcom: No such file or directory
1316<13>[ 1.923194]@0 init: (Loading properties from /data/local.prop took 0.00s.)
1317<11>[ 1.923215]@0 init: Unable to open persistent property directory "/data/property": No such file or directory
1318<13>[ 1.923707]@0 init: Starting service 'set_permissive'...
1319<11>[ 1.924656]@0 init: Warning! Service recovery needs a SELinux domain defined; please fix!
1320<13>[ 1.924672]@0 init: Starting service 'recovery'...
1321<13>[ 1.924881]@0 init: write_file: Unable to open '/dev/cpuset/foreground/cpus': No such file or directory
1322<13>[ 1.924906]@0 init: write_file: Unable to open '/dev/cpuset/foreground/boost/cpus': No such file or directory
1323<13>[ 1.924926]@0 init: write_file: Unable to open '/dev/cpuset/background/cpus': No such file or directory
1324<5>[ 1.924932]@3 audit: type=1400 audit(10677949.820:4): avc: denied { execute_no_trans } for pid=432 comm="init" path="/sbin/recovery" dev="rootfs" ino=8484 scontext=u:r:init:s0 tcontext=u:object_r:rootfs:s0 tclass=file permissive=1
1325<13>[ 1.924946]@0 init: write_file: Unable to open '/dev/cpuset/system-background/cpus': No such file or directory
1326<3>[ 1.925040]@0 touchkey,s1302: synaptics_s1302_virtual_key_enable_write 0virtual key :1
1327<13>[ 1.925151]@0 init: Starting service 'adbd'...
1328<6>[ 1.927641]@0 read descriptors
1329<6>[ 1.927660]@0 read strings
1330<6>[ 1.927679]@0 mtp_bind_config
1331<6>[ 1.927694]@0 mtp_create_bulk_endpoints: useFixAddr:false
1332<5>[ 1.932173]@2 audit: type=1400 audit(10677949.826:5): avc: denied { write } for pid=435 comm="setenforce" name="enforce" dev="selinuxfs" ino=4 scontext=u:r:recovery:s0 tcontext=u:object_r:selinuxfs:s0 tclass=file permissive=1
1333<13>[ 1.932829]@2 init: Service 'set_permissive' (pid 431) exited with status 0
1334<5>[ 1.939024]@3 audit: type=1400 audit(10677949.833:6): avc: denied { append } for pid=432 comm="recovery" path="/tmp/recovery.log" dev="tmpfs" ino=10213 scontext=u:r:init:s0 tcontext=u:object_r:init_tmpfs:s0 tclass=file permissive=1
1335<5>[ 1.939110]@3 audit: type=1400 audit(10677949.833:7): avc: denied { write } for pid=432 comm="recovery" name="property_service" dev="tmpfs" ino=1470 scontext=u:r:init:s0 tcontext=u:object_r:property_socket:s0 tclass=sock_file permissive=1
1336<5>[ 1.939882]@3 audit: type=1400 audit(10677949.833:8): avc: denied { write } for pid=432 comm="recovery" name="fb0" dev="tmpfs" ino=10184 scontext=u:r:init:s0 tcontext=u:object_r:graphics_device:s0 tclass=chr_file permissive=1
1337<5>[ 1.940052]@2 audit: type=1400 audit(10677949.833:9): avc: denied { ioctl } for pid=432 comm="recovery" path="/dev/graphics/fb0" dev="tmpfs" ino=10184 ioctlcmd=4602 scontext=u:r:init:s0 tcontext=u:object_r:graphics_device:s0 tclass=chr_file permissive=1
1338<4>[ 1.948302]@3 blank off start
1339<4>[ 1.948575]@2 blank off end
1340<4>[ 1.948607]@2 blank on start
1341<6>[ 1.948797]@0 FG: oneplus_set_lcd_off_status: set lcd off status fail
1342<4>[ 1.948803]@0 blank on end
1343<3>[ 1.948950]@3 synaptics,s3320: enter gesture mode
1344<4>[ 1.960482]@3 mdss_dsi_on start
1345<6>[ 1.960487]@3 get_param_by_index_and_offset[75] sid_index = 2 offset = 32 buf = ffffffc1738a2e20 length = 8
1346<3>[ 1.960491]@3 mdss_dsi_on:srgb mode 0
1347<4>[ 1.960497]@3 mdss_dsi_on end
1348<4>[ 1.961654]@3 --------backlight level = 127---------
1349<5>[ 1.986668]@3 audit: type=1400 audit(10677949.880:10): avc: denied { execmem } for pid=432 comm="recovery" scontext=u:r:init:s0 tcontext=u:r:init:s0 tclass=process permissive=1
1350<6>[ 2.024554]@3 EXT4-fs (sda3): mounted filesystem with ordered data mode. Opts:
1351<7>[ 2.024579]@3 SELinux: initialized (dev sda3, type ext4), uses xattr
1352<6>[ 2.024995]@3 SELinux: Context u:object_r:cache_recovery_file:s0 is not valid (left unmapped).
1353<7>[ 2.092987]@3 SELinux: initialized (dev sda15, type f2fs), uses xattr
1354<6>[ 2.117597]@0 android_work: android_work: sent uevent USB_STATE=CONNECTED
1355<3>[ 2.117761]@0 SMBCHG: notify_usb_enumeration_function: notify_usb_enumeration_function:1
1356<7>[ 2.202700]@3 SELinux: initialized (dev sda15, type f2fs), uses xattr
1357<6>[ 2.271856]@0 android_usb gadget: high-speed config #1: 66bf0c8.android_usb
1358<6>[ 2.271941]@0 usb_gadget_vbus_draw USB setting current is 500mA
1359<6>[ 2.271951]@0 msm-dwc3 6a00000.ssusb: Avail curr from USB = 500
1360<3>[ 2.272053]@0 load_data: stored_soc[0x8f], shutdown_soc[71]
1361<3>[ 2.272063]@0 qpnp-smbcharger qpnp-smbcharger-ffffffc175d4c800: current_limit = 500
1362<3>[ 2.272118]@0 SMBCHG: set_chg_parameter_in_different_temp: set_chg_parameter_in_different_temp:inserted type = 4 (SDP),charger_type_value=4
1363<3>[ 2.272173]@0 SMBCHG: smbchg_set_fastchg_current_raw: fastcharge current requested 1910, set to 1900
1364<6>[ 2.272710]@0 SMBCHG: smbchg_external_power_changed: changed chip->usb_target_current_ma = 500
1365<3>[ 2.272839]@0 load_data: stored_soc[0x8f], shutdown_soc[71]
1366<3>[ 2.273071]@0 load_data: stored_soc[0x8f], shutdown_soc[71]
1367<3>[ 2.273156]@2 load_data: stored_soc[0x8f], shutdown_soc[71]
1368<3>[ 2.274554]@0 load_data: stored_soc[0x8f], shutdown_soc[71]
1369<3>[ 2.274796]@2 load_data: stored_soc[0x8f], shutdown_soc[71]
1370<7>[ 2.323032]@3 SELinux: initialized (dev sda15, type f2fs), uses xattr
1371<6>[ 2.323405]@0 android_work: android_work: sent uevent USB_STATE=CONFIGURED
1372<6>[ 2.398316]@2 bq27541-battery 6-0055: DEVICE_TYPE is 0x541, FIRMWARE_VERSION is 0x200
1373<6>[ 2.398331]@2 bq27541-battery 6-0055: Complete bq27541 configuration 0x604B
1374<7>[ 2.463279]@3 SELinux: initialized (dev sda15, type f2fs), uses xattr
1375<6>[ 2.493889]@3 SELinux: Context u:object_r:audioserver_data_file:s0 is not valid (left unmapped).
1376<6>[ 2.495061]@3 SELinux: Context u:object_r:boottrace_data_file:s0 is not valid (left unmapped).
1377<6>[ 2.495498]@3 SELinux: Context u:object_r:update_engine_data_file:s0 is not valid (left unmapped).
1378<6>[ 2.495937]@3 SELinux: Context u:object_r:method_trace_data_file:s0 is not valid (left unmapped).
1379<6>[ 2.496792]@3 SELinux: Context u:object_r:user_profile_data_file:s0 is not valid (left unmapped).
1380<6>[ 2.497604]@3 SELinux: Context u:object_r:user_profile_foreign_dex_data_file:s0 is not valid (left unmapped).
1381<6>[ 2.498509]@3 SELinux: Context u:object_r:profman_dump_data_file:s0 is not valid (left unmapped).
1382<6>[ 2.499373]@3 SELinux: Context u:object_r:qfp-daemon_data_file:s0 is not valid (left unmapped).
1383<6>[ 2.501110]@3 SELinux: Context u:object_r:data_qsee_file:s0 is not valid (left unmapped).
1384<6>[ 2.503554]@3 SELinux: Context u:object_r:ipacm_data_file:s0 is not valid (left unmapped).
1385<6>[ 2.504275]@3 SELinux: Context u:object_r:port_bridge_data_file:s0 is not valid (left unmapped).
1386<6>[ 2.505548]@3 SELinux: Context u:object_r:data_test_data_file:s0 is not valid (left unmapped).
1387<6>[ 2.509748]@3 SELinux: Context u:object_r:display_misc_file:s0 is not valid (left unmapped).
1388<6>[ 2.510194]@3 SELinux: Context u:object_r:location_data_file:s0 is not valid (left unmapped).
1389<6>[ 2.511067]@3 SELinux: Context u:object_r:location_socket:s0 is not valid (left unmapped).
1390<6>[ 2.513068]@3 SELinux: Context u:object_r:fm_data_file:s0 is not valid (left unmapped).
1391<6>[ 2.513499]@3 SELinux: Context u:object_r:RIDL_data_file:s0 is not valid (left unmapped).
1392<6>[ 2.515558]@3 SELinux: Context u:object_r:RIDL_socket:s0 is not valid (left unmapped).
1393<6>[ 2.517912]@3 SELinux: Context u:object_r:iop_data_file:s0 is not valid (left unmapped).
1394<6>[ 2.518337]@3 SELinux: Context u:object_r:qti_logkit_priv_data_file:s0 is not valid (left unmapped).
1395<6>[ 2.519170]@3 SELinux: Context u:object_r:qti_logkit_pub_data_file:s0 is not valid (left unmapped).
1396<6>[ 2.519593]@3 SELinux: Context u:object_r:qti_logkit_priv_socket:s0 is not valid (left unmapped).
1397<6>[ 2.520024]@3 SELinux: Context u:object_r:qti_logkit_pub_socket:s0 is not valid (left unmapped).
1398<6>[ 2.520863]@3 SELinux: Context u:object_r:wapi_data_file:s0 is not valid (left unmapped).
1399<6>[ 2.521284]@3 SELinux: Context u:object_r:dts_data_file:s0 is not valid (left unmapped).
1400<6>[ 2.521719]@3 SELinux: Context u:object_r:seemp_file:s0 is not valid (left unmapped).
1401<6>[ 2.522446]@3 SELinux: Context u:object_r:tlocd_data_file:s0 is not valid (left unmapped).
1402<6>[ 2.522883]@3 SELinux: Context u:object_r:qvop_data_file:s0 is not valid (left unmapped).
1403<6>[ 2.523315]@3 SELinux: Context u:object_r:qvrd_data_file:s0 is not valid (left unmapped).
1404<6>[ 2.523786]@3 SELinux: Context u:object_r:audio_pp_data_file:s0 is not valid (left unmapped).
1405<6>[ 2.524225]@3 SELinux: Context u:object_r:bootstat_data_file:s0 is not valid (left unmapped).
1406<6>[ 2.566977]@3 SELinux: Context u:object_r:ota_data_file:s0 is not valid (left unmapped).
1407<6>[ 2.572945]@3 SELinux: Context u:object_r:mpctl_data_file:s0 is not valid (left unmapped).
1408<6>[ 2.573368]@3 SELinux: Context u:object_r:swap_data_file:s0 is not valid (left unmapped).
1409<6>[ 2.578611]@3 SELinux: Context u:object_r:cnd_data_file:s0 is not valid (left unmapped).
1410<6>[ 2.579578]@3 SELinux: Context u:object_r:dpmd_data_file:s0 is not valid (left unmapped).
1411<6>[ 2.581755]@3 SELinux: Context u:object_r:time_data_file:s0 is not valid (left unmapped).
1412<6>[ 2.584310]@3 SELinux: Context u:object_r:oem_data_file:s0 is not valid (left unmapped).
1413<6>[ 2.585553]@3 SELinux: Context u:object_r:fpc_images_file:s0 is not valid (left unmapped).
1414<6>[ 2.586784]@3 SELinux: Context u:object_r:fpc_data_file:s0 is not valid (left unmapped).
1415<6>[ 2.587193]@3 SELinux: Context u:object_r:coredump_data_file:s0 is not valid (left unmapped).
1416<6>[ 2.588461]@3 SELinux: Context u:object_r:usf_data_file:s0 is not valid (left unmapped).
1417<6>[ 2.594663]@3 EXT4-fs (sde20): mounted filesystem with ordered data mode. Opts:
1418<7>[ 2.594684]@3 SELinux: initialized (dev sde20, type ext4), uses xattr
1419<3>[ 2.775731]@2 bq27541_battery_soc =71
1420<3>[ 2.775764]@2 load_data: stored_soc[0x8f], shutdown_soc[71]
1421<3>[ 2.775769]@2 soc=71,soc_load:71
1422<6>[ 3.216220]@3 EXT4-fs (sde20): mounted filesystem with ordered data mode. Opts:
1423<7>[ 3.216243]@3 SELinux: initialized (dev sde20, type ext4), uses xattr
1424<6>[ 3.406858]@3 of_batterydata_get_best_profile: itech_3000mah found
1425<6>[ 4.009266]@3 mtp_open
1426<6>[ 5.413536]@3 of_batterydata_get_best_profile: itech_3000mah found
1427<6>[ 5.423336]@3 FG: fg_batt_profile_init: Battery SOC: 73, V: 4055915uV
1428<3>[ 5.425726]@3 qpnp-smbcharger qpnp-smbcharger-ffffffc175d4c800: current_limit = 500
1429<5>[ 6.000147]@3 random: nonblocking pool is initialized
1430<4>[ 6.000156]@3 switch_dev_work ,tristate set to state(1)
1431<3>[ 7.366518]@1 SMBCHG: update_heartbeat: charger_type:4,bat_voltage:4021000,charger_voltage:4963,current:-235000,temp:285,capacity:71
1432<4>[ 9.706707]@0 synap rmidev_create_attr
1433<4>[ 9.893375]@0 synap rmidev_create_attr
1434<4>[ 67.663143]@0 --------backlight level = 0---------
1435<4>[ 67.665551]@0 blank off start
1436<3>[ 67.666494]@0 synaptics,s3320: enter gesture mode
1437<4>[ 67.898103]@1 mdss_dsi_off start
1438<4>[ 67.923523]@1 mdss_dsi_off end
1439<6>[ 67.924296]@1 bq27541_set_lcd_off_status:1
1440<6>[ 67.925460]@1 bq27541_set_lcd_off_status:lcd_off_delt_soc:0,soc=71,soc_pre=71
1441<4>[ 67.925506]@1 blank off end
1442<3>[ 265.348561]@1 bq27541_battery_soc =72
1443<3>[ 265.351402]@1 soc:72, soc_calib:72,VOLT:4034000,current:-309000
1444<3>[ 386.014513]@0 qpnp-smbcharger qpnp-smbcharger-ffffffc175d4c800: current_limit = 500