· 9 years ago · Jan 01, 2017, 06:30 AM
1[ 0.000000]@0 Initializing cgroup subsys cpu
2[ 0.000000]@0 Initializing cgroup subsys cpuacct
3[ 0.000000]@0 Linux version 3.18.20-twrp-3T-1.3 (jc@westerley) (gcc version 5.3.1 20160412 (Linaro GCC 5.3-2016.05) ) #1 SMP PREEMPT Thu Dec 1 13:55:14 EST 2016
4[ 0.000000]@0 CPU: AArch64 Processor [512f2011] revision 1
5[ 0.000000]@0 Machine: Qualcomm Technologies, Inc. MSM 8996pro + PMI8996 MTP
6[ 0.000000]@0 efi: Getting EFI parameters from FDT:
7[ 0.000000]@0 efi: UEFI not found.
8[ 0.000000]@0 Reserved memory: reserved region for node 'removed_regions@85800000': base 0x0000000085800000, size 48 MiB
9[ 0.000000]@0 Reserved memory: reserved region for node 'peripheral_region@8ea00000': base 0x000000008ea00000, size 43 MiB
10[ 0.000000]@0 Reserved memory: reserved region for node 'modem_region@88800000': base 0x0000000088800000, size 98 MiB
11[ 0.000000]@0 Reserved memory: reserved region for node 'dfps_data_mem@83400000': base 0x0000000083400000, size 0 MiB
12[ 0.000000]@0 Reserved memory: reserved region for node 'cont_splash_mem@83401000': base 0x0000000083401000, size 35 MiB
13[ 0.000000]@0 Reserved memory: reserved region for node 'ramoops_mem@ac000000': base 0x00000000ac000000, size 2 MiB
14[ 0.000000]@0 Reserved memory: reserved region for node 'param_mem@ac200000': base 0x00000000ac200000, size 1 MiB
15[ 0.000000]@0 Reserved memory: reserved region for node 'bootloader_log_mem@ac300000': base 0x00000000ac300000, size 1 MiB
16[ 0.000000]@0 Reserved memory: reserved region for node 'mtp_mem@ac400000': base 0x00000000ac400000, size 1 MiB
17[ 0.000000]@0 Reserved memory: reserved region for node 'cont_splash_mem_hdmi@b1c00000': base 0x00000000b1c00000, size 35 MiB
18[ 0.000000]@0 Removed memory: created DMA memory pool at 0x0000000085800000, size 48 MiB
19[ 0.000000]@0 Reserved memory: initialized node removed_regions@85800000, compatible id removed-dma-pool
20[ 0.000000]@0 Removed memory: created DMA memory pool at 0x000000008ea00000, size 43 MiB
21[ 0.000000]@0 Reserved memory: initialized node peripheral_region@8ea00000, compatible id removed-dma-pool
22[ 0.000000]@0 Reserved memory: allocated memory for 'adsp_region' node: base 0x00000000ff800000, size 4 MiB
23[ 0.000000]@0 Reserved memory: created CMA memory pool at 0x00000000ff800000, size 4 MiB
24[ 0.000000]@0 Reserved memory: initialized node adsp_region, compatible id shared-dma-pool
25[ 0.000000]@0 Reserved memory: allocated memory for 'qseecom_region' node: base 0x00000000fe400000, size 20 MiB
26[ 0.000000]@0 Reserved memory: created CMA memory pool at 0x00000000fe400000, size 20 MiB
27[ 0.000000]@0 Reserved memory: initialized node qseecom_region, compatible id shared-dma-pool
28[ 0.000000]@0 Reserved memory: allocated memory for 'secure_region' node: base 0x00000000f8800000, size 92 MiB
29[ 0.000000]@0 Reserved memory: created CMA memory pool at 0x00000000f8800000, size 92 MiB
30[ 0.000000]@0 Reserved memory: initialized node secure_region, compatible id shared-dma-pool
31[ 0.000000]@0 Removed memory: created DMA memory pool at 0x0000000088800000, size 98 MiB
32[ 0.000000]@0 Reserved memory: initialized node modem_region@88800000, compatible id removed-dma-pool
33[ 0.000000]@0 Reserved memory: created DMA memory pool at 0x0000000083400000, size 0 MiB
34[ 0.000000]@0 Reserved memory: initialized node dfps_data_mem@83400000, compatible id shared-dma-pool
35[ 0.000000]@0 cma: Reserved 32 MiB at 0x00000000f6800000
36[ 0.000000]@0 psci: probing for conduit method from DT.
37[ 0.000000]@0 psci: PSCIv1.0 detected in firmware.
38[ 0.000000]@0 psci: Using standard PSCI v0.2 function IDs
39[ 0.000000]@0 psci: Initializing psco_cpu_init
40[ 0.000000]@0 psci: Initializing psco_cpu_init
41[ 0.000000]@0 psci: Initializing psco_cpu_init
42[ 0.000000]@0 PERCPU: Embedded 13 pages/cpu @ffffffc17d713000 s23168 r0 d30080 u53248
43[ 0.000000]@0 Built 1 zonelists in Zone order, mobility grouping on. Total pages: 1490909
44[ 0.000000]@0 Kernel command line: sched_enable_hmp=1 sched_enable_power_aware=1 console=ttyHSL0,115200,n8 androidboot.console=ttyHSL0 androidboot.hardware=qcom androidboot.bootdevice=624000.ufshc androidboot.selinux=permissive user_debug=31 msm_rtb.filter=0x237 ehci-hcd.park=3 lpm_levels.sleep_disabled=1 cma=32M@0-0xffffffff enforcing=0 androidboot.bootdevice=624000.ufshc androidboot.verifiedbootstate=orange androidboot.veritymode=enforcing androidboot.keymaster=1 androidboot.serialno=257cd874 gpt androidboot.baseband=msm mdss_mdp.panel=1:dsi:0:qcom,mdss_dsi_samsung_s6e3fa5_1080p_cmd:1:none:cfg:single_dsi fpsimd.fpsimd_settings=0 app_setting.use_app_setting=0 androidboot.mode=reboot androidboot.project_name=15811 androidboot.rf_version=22 androidboot.hw_version=28 ddr_manufacture_info=Samsung ddr_row0_info=16 androidboot.pcba_number=001581206B23032000008616 androidboot.enable_dm_verity=1 androidboot.secboot=enabled androidboot.angela=disabled androidboot.nobatt=0 androidboPID hash table entries: 4096 (order: 3, 32768 bytes)
45[ 0.000000]@0 Dentry cache hash table entries: 1048576 (order: 11, 8388608 bytes)
46[ 0.000000]@0 Inode-cache hash table entries: 524288 (order: 10, 4194304 bytes)
47[ 0.000000]@0 Memory: 5684960K/6058300K available (10931K kernel code, 1449K rwdata, 4640K rodata, 452K init, 3172K bss, 373340K reserved)
48[ 0.000000]@0 Virtual kernel memory layout:
49 vmalloc : 0xffffff8000000000 - 0xffffffbdbfff0000 ( 246 GB)
50 vmemmap : 0xffffffbdc0000000 - 0xffffffbfc0000000 ( 8 GB maximum)
51 0xffffffbdc1000000 - 0xffffffbdc6f65400 ( 95 MB actual)
52 PCI I/O : 0xffffffbffa000000 - 0xffffffbffb000000 ( 16 MB)
53 fixed : 0xffffffbffbdfe000 - 0xffffffbffbdff000 ( 4 KB)
54 modules : 0xffffffbffc000000 - 0xffffffc000000000 ( 64 MB)
55 memory : 0xffffffc000000000 - 0xffffffc17d950000 ( 6105 MB)
56 .init : 0xffffffc000fb6000 - 0xffffffc001027000 ( 452 KB)
57 .text : 0xffffffc000080000 - 0xffffffc000fb5ec4 ( 15576 KB)
58 .data : 0xffffffc001031000 - 0xffffffc00119b5d8 ( 1450 KB)
59[ 0.000000]@0 SLUB: HWalign=128, Order=0-3, MinObjects=0, CPUs=4, Nodes=1
60[ 0.000000]@0 HMP scheduling enabled.
61[ 0.000000]@0 Preemptible hierarchical RCU implementation.
62[ 0.000000]@0 RCU dyntick-idle grace-period acceleration is enabled.
63[ 0.000000]@0 Dump stacks of tasks blocking RCU-preempt GP.
64[ 0.000000]@0 NR_IRQS:64 nr_irqs:64 0
65[ 0.000000]@0 CPU0: found redistributor 0 region 0:0x0000000009c00000
66[ 0.000000]@0 mpm_init_irq_domain(): Cannot find irq controller for qcom,gpio-parent
67[ 0.000000]@0 MPM 1 irq mapping errored -517
68[ 0.000000]@0 Offload RCU callbacks from all CPUs
69[ 0.000000]@0 Offload RCU callbacks from CPUs: 0-3.
70[ 0.000000]@0 Architected cp15 and mmio timer(s) running at 19.20MHz (virt/virt).
71[ 0.000000]@0 sched_clock: 56 bits at 19MHz, resolution 52ns, wraps every 3579139424256ns
72[ 0.000017]@0 Switched to clocksource arch_sys_counter
73[ 0.000664]@0 Calibrating delay loop (skipped), value calculated using timer frequency.. 38.40 BogoMIPS (lpj=192000)
74[ 0.000682]@0 pid_max: default: 32768 minimum: 301
75[ 0.000746]@0 Security Framework initialized
76[ 0.000762]@0 SELinux: Initializing.
77[ 0.000821]@0 Mount-cache hash table entries: 16384 (order: 5, 131072 bytes)
78[ 0.000830]@0 Mountpoint-cache hash table entries: 16384 (order: 5, 131072 bytes)
79[ 0.001331]@0 Initializing cgroup subsys freezer
80[ 0.001629]@0 /cpus/cpu@0: Unknown CPU type
81[ 0.001640]@0 /cpus/cpu@1: Unknown CPU type
82[ 0.001651]@0 /cpus/cpu@100: Unknown CPU type
83[ 0.001662]@0 /cpus/cpu@101: Unknown CPU type
84[ 0.001692]@0 hw perfevents: enabled with arm/armv8-pmuv3 PMU driver, 9 counters available
85[ 0.001717]@0 EFI services will not be available.
86[ 0.010968]@0
87**********************************************************
88[ 0.010981]@0 ** NOTICE NOTICE NOTICE NOTICE NOTICE NOTICE NOTICE **
89[ 0.010987]@0 ** **
90[ 0.010991]@0 ** trace_printk() being used. Allocating extra memory. **
91[ 0.010996]@0 ** **
92[ 0.011001]@0 ** This means that this is a DEBUG kernel and it is **
93[ 0.011005]@0 ** unsafe for produciton use. **
94[ 0.011010]@0 ** **
95[ 0.011015]@0 ** If you see this message and you are not debugging **
96[ 0.011019]@0 ** the kernel, report this immediately to your vendor! **
97[ 0.011024]@0 ** **
98[ 0.011028]@0 ** NOTICE NOTICE NOTICE NOTICE NOTICE NOTICE NOTICE **
99[ 0.011032]@0 **********************************************************
100[ 0.011792]@0 MSM Memory Dump base table set up
101[ 0.011817]@0 MSM Memory Dump apps data table set up
102[ 0.011837]@0 hyp_assign_table is not functional as qcom_secure_mem is not allocated.
103[ 0.012239]@0 clock-cpu-8996: configuring clocks for the perf cluster
104[ 0.012386]@0 cpu_clock_8996_early_init: finished CPU clock configuration
105[ 0.015166]@1 CPU1: found redistributor 1 region 0:0x0000000009c40000
106[ 0.017941]@2 CPU2: found redistributor 100 region 0:0x0000000009c80000
107[ 0.020592]@3 CPU3: found redistributor 101 region 0:0x0000000009cc0000
108[ 0.020721]@0 Brought up 4 CPUs
109[ 0.020738]@0 SMP: Total of 4 processors activated.
110[ 0.029095]@1 pinctrl core: initialized pinctrl subsystem
111[ 0.029550]@1 regulator-dummy: no parameters
112[ 0.098871]@1 NET: Registered protocol family 16
113[ 0.120099]@1 cpuidle: using governor ladder
114[ 0.140125]@0 cpuidle: using governor menu
115[ 0.160103]@1 cpuidle: using governor qcom
116[ 0.161018]@1 vdso: 2 pages (1 code @ ffffffc001039000, 1 data @ ffffffc001038000)
117[ 0.161565]@1 software IO TLB [mem 0xffc00000-0x100000000] (4MB) mapped at [ffffffc0bfc00000-ffffffc0bfffffff]
118[ 0.162419]@1 DMA: preallocated 256 KiB pool for atomic allocations
119[ 0.162783]@1 msm_smem_init: unable to create logging context
120[ 0.162828]@1 msm_smd_init: unable to create SMD logging context
121[ 0.162836]@1 msm_smd_init: unable to create SMSM logging context
122[ 0.163161]@2 <CORE> glink_init: unable to create log context
123[ 0.163449]@2 <CORE> glink_core_register_transport: unable to create log context for [dsps:smd_trans]
124[ 0.163601]@2 <CORE> glink_core_register_transport: unable to create log context for [lpass:smd_trans]
125[ 0.163761]@2 <CORE> glink_core_register_transport: unable to create log context for [mpss:smd_trans]
126[ 0.163906]@2 <CORE> glink_core_register_transport: unable to create log context for [wcnss:smd_trans]
127[ 0.164064]@2 <CORE> glink_core_register_transport: unable to create log context for [rpm:smd_trans]
128[ 0.164948]@2 Failed to create IPC log0
129[ 0.164956]@2 Failed to create IPC log1
130[ 0.164962]@2 Failed to create IPC log2
131[ 0.164968]@2 Failed to create IPC log3
132[ 0.164973]@2 Failed to create IPC log4
133[ 0.166864]@2 platform 994400.qcom,mdss_dsi_pll: assigned reserved memory node dfps_data_mem@83400000
134[ 0.179743]@2 sps:sps is ready.
135[ 0.180419]@2 i2c-msm-v2 75ba000.i2c: could not find pctldev for node /soc/pinctrl@01010000/i2c_12/i2c_12_active, deferring probe
136[ 0.181200]@2 i2c-msm-v2 757a000.i2c: could not find pctldev for node /soc/pinctrl@01010000/i2c_6/i2c_6_active, deferring probe
137[ 0.181502]@2 i2c-msm-v2 75b5000.i2c: could not find pctldev for node /soc/pinctrl@01010000/i2c_7/i2c_7_active, deferring probe
138[ 0.181801]@2 i2c-msm-v2 7577000.i2c: could not find pctldev for node /soc/pinctrl@01010000/i2c_3/i2c_3_active, deferring probe
139[ 0.182102]@2 i2c-msm-v2 75b6000.i2c: could not find pctldev for node /soc/pinctrl@01010000/i2c_8/i2c_8_active, deferring probe
140[ 0.182472]@2 irq: no irq domain found for /soc/pinctrl@01010000 !
141[ 0.184431]@2 cpu-clock-8996 6400000.qcom,cpu-clock-8996: resources init failed
142[ 0.208038]@2 smd_channel_probe_now: allocation table not initialized
143[ 0.208358]@2 smd_channel_probe_now: allocation table not initialized
144[ 0.208675]@2 smd_channel_probe_now: allocation table not initialized
145[ 0.208983]@2 smd_channel_probe_now: allocation table not initialized
146[ 0.209260]@2 msm_watchdog 9830000.qcom,wdt: wdog absent resource not present
147[ 0.209515]@2 msm_watchdog 9830000.qcom,wdt: MSM Watchdog Initialized
148[ 0.210415]@2 msm_rpm_dev_probe: APSS-RPM communication over GLINK
149[ 0.220417]@2 spmi_pmic_arb 400f000.qcom,spmi: PMIC Arb Version-2 0x20010000
150[ 0.221819]@2 spmi_pmic_arb 400f000.qcom,spmi: missing property: qcom,pmic-arb-max-periph-interrupts
151[ 0.227668]@2 pmi8994_s2: 400 <--> 1065 mV at 1000 mV normal idle
152[ 0.228298]@2 platform 9300000.qcom,lpass: assigned reserved memory node peripheral_region@8ea00000
153[ 0.228588]@2 platform ce0000.qcom,venus: assigned reserved memory node peripheral_region@8ea00000
154[ 0.229078]@2 platform 1c00000.qcom,ssc: assigned reserved memory node peripheral_region@8ea00000
155[ 0.229477]@2 platform 2080000.qcom,mss: assigned reserved memory node modem_region@88800000
156[ 0.232512]@2 msm-thermal 70000.qcom,msm-thermal: msm_thermal:Failed reading node=/soc/qcom,msm-thermal, key=qcom,rpm-phase-resource-type err=-22. KTM continues
157[ 0.232537]@2 msm-thermal 70000.qcom,msm-thermal: msm_thermal:Failed reading node=/soc/qcom,msm-thermal, key=qcom,gfx-sensor-id. err=-22. KTM continues
158[ 0.232557]@2 msm-thermal 70000.qcom,msm-thermal: probe_vdd_mx:Failed reading node=/soc/qcom,msm-thermal, key=qcom,mx-restriction-temp. KTM continues
159[ 0.232571]@2 msm-thermal 70000.qcom,msm-thermal: probe_psm:Failed reading node=/soc/qcom,msm-thermal, key=qcom,pmic-sw-mode-temp. err=-22. KTM continues
160[ 0.232638]@2 msm_thermal:vdd_restriction_reg_init Defer regulator vdd-dig probe
161[ 0.232646]@2 msm_thermal:probe_vdd_rstr Err regulator init. err:-517. KTM continues.
162[ 0.232656]@2 msm-thermal 70000.qcom,msm-thermal: probe_vdd_rstr:Failed reading node=/soc/qcom,msm-thermal, key=qcom,max-freq-level. err=-517. KTM continues
163[ 0.232666]@2 msm_thermal:msm_thermal_dev_probe Failed reading node=/soc/qcom,msm-thermal, key=qcom,online-hotplug-core. err:-517
164[ 0.238035]@2 platform soc:qcom,msm-adsprpc-mem: assigned reserved memory node adsp_region
165[ 0.239202]@2 <CORE> glink_core_register_transport: unable to create log context for [mpss:smem]
166[ 0.239896]@2 <CORE> glink_core_register_transport: unable to create log context for [lpass:smem]
167[ 0.240733]@2 <CORE> glink_core_register_transport: unable to create log context for [dsps:smem]
168[ 0.241352]@2 <CORE> glink_core_register_transport: unable to create log context for [rpm:smem]
169[ 0.241655]@0 smd_channel_probe_now: allocation table not initialized
170[ 0.241749]@1 msm_rpm_trans_notify_state: glink config params: transport=(null), edge=rpm, name=rpm_requests
171[ 0.242644]@2 msm_cache_erp64 6500000.qcom,cache_erp64: Registering for L1 error interrupts
172[ 0.242753]@2 msm_cache_erp64 6500000.qcom,cache_erp64: Registering for L2 error interrupts
173[ 0.242959]@2 msm_cache_erp64 6500000.qcom,cache_erp64: Registering for L3 error interrupts
174[ 0.243256]@2 msm_m4m_erp 9a40000.qcom,m4m_erp64: Registering for M4M error interrupts
175[ 0.247883]@2 console [pstore-1] enabled
176[ 0.248028]@2 pstore: Registered ramoops as persistent store backend
177[ 0.248039]@2 ramoops: attached 0x200000@0xac000000, ecc: 0/0
178[ 0.248198]@2 XCB bootloader_log_probe
179[ 0.248388]@2 bootloader_log!
180[ 0.249722]@2 apc0_pwrcl_mem_acc_corner: 0 <--> 0 mV
181[ 0.250212]@2 apc1_perfcl_mem_acc_corner: 0 <--> 0 mV
182[ 0.250654]@2 apcc_l3_mem_acc_corner: 0 <--> 0 mV
183[ 0.251077]@2 gfx_mem_acc_corner: 0 <--> 0 mV
184[ 0.251598]@2 kryo0-retention: 468 <--> 892 mV at 520 mV
185[ 0.251848]@2 kryo0: 468 <--> 892 mV at 754 mV
186[ 0.252027]@2 kryo_regulator_probe: kryo0: default LDO functional volt=754021 uV, LDO retention volt=521789 uV, Vref func=325285 + 4466*(val), cluster-num=0
187[ 0.252418]@2 kryo1-retention: 468 <--> 892 mV at 520 mV
188[ 0.252679]@2 kryo1: 468 <--> 892 mV at 754 mV
189[ 0.252853]@2 kryo_regulator_probe: kryo1: default LDO functional volt=754021 uV, LDO retention volt=521789 uV, Vref func=325285 + 4466*(val), cluster-num=1
190[ 0.257946]@2 platform soc:qcom,kgsl-hyp: assigned reserved memory node peripheral_region@8ea00000
191[ 0.259583]@2 msm_mpm_dev_probe(): Cannot get clk resource for XO: -517
192[ 0.282826]@2 __of_mpm_init(): MPM driver mapping exists
193[ 0.285218]@0 i2c-msm-v2 75ba000.i2c: probing driver i2c-msm-v2
194[ 0.285406]@0 i2c-msm-v2 75ba000.i2c: error on clk_get(core_clk):-517
195[ 0.285423]@0 i2c-msm-v2 75ba000.i2c: error probe() failed with err:-517
196[ 0.285953]@0 i2c-msm-v2 757a000.i2c: probing driver i2c-msm-v2
197[ 0.286049]@0 i2c-msm-v2 757a000.i2c: error on clk_get(core_clk):-517
198[ 0.286065]@0 i2c-msm-v2 757a000.i2c: error probe() failed with err:-517
199[ 0.286549]@0 i2c-msm-v2 75b5000.i2c: probing driver i2c-msm-v2
200[ 0.286643]@0 i2c-msm-v2 75b5000.i2c: error on clk_get(core_clk):-517
201[ 0.286657]@0 i2c-msm-v2 75b5000.i2c: error probe() failed with err:-517
202[ 0.287133]@0 i2c-msm-v2 7577000.i2c: probing driver i2c-msm-v2
203[ 0.287228]@0 i2c-msm-v2 7577000.i2c: error on clk_get(core_clk):-517
204[ 0.287242]@0 i2c-msm-v2 7577000.i2c: error probe() failed with err:-517
205[ 0.287665]@0 i2c-msm-v2 75b6000.i2c: probing driver i2c-msm-v2
206[ 0.287755]@0 i2c-msm-v2 75b6000.i2c: error on clk_get(core_clk):-517
207[ 0.287770]@0 i2c-msm-v2 75b6000.i2c: error probe() failed with err:-517
208[ 0.287999]@0 cpu-clock-8996 6400000.qcom,cpu-clock-8996: resources init failed
209[ 0.289058]@0 pm8994_s1_corner: 0 <--> 0 mV at 0 mV normal idle
210[ 0.289685]@0 pm8994_s1_floor_corner: 0 <--> 0 mV at 0 mV normal idle
211[ 0.290269]@0 pm8994_s1_corner_ao: 0 <--> 0 mV at 0 mV normal idle
212[ 0.290885]@0 pm8994_s2_corner: 0 <--> 0 mV at 0 mV normal idle
213[ 0.291390]@0 pm8994_s2_corner_ao: 0 <--> 0 mV at 0 mV normal idle
214[ 0.291988]@0 pm8994_s3: 1300 mV normal idle
215[ 0.292571]@0 pm8994_s4: 1800 mV normal idle
216[ 0.293158]@0 pm8994_s5: 2150 mV normal idle
217[ 0.293726]@0 pm8994_s7: 800 mV normal idle
218[ 0.294309]@0 pm8994_l1: 1000 mV normal idle
219[ 0.294881]@0 pm8994_l2: 1250 mV normal idle
220[ 0.295831]@1 pm8994_l3: 1100 mV normal idle
221[ 0.296418]@1 pm8994_l4: 1225 mV normal idle
222[ 0.296977]@1 pm8994_l6: 1200 mV normal idle
223[ 0.297540]@1 pm8994_l8: 1800 mV normal idle
224[ 0.298073]@1 pm8994_l9: 1800 mV normal idle
225[ 0.298627]@1 pm8994_l10: 1800 mV normal idle
226[ 0.299171]@1 pm8994_l11: 1150 mV normal idle
227[ 0.299731]@1 pm8994_l12: 1800 mV normal idle
228[ 0.300806]@1 pm8994_l13: 29500 <--> 2950 mV at 2950 mV normal idle
229[ 0.301370]@1 pm8994_l15: 1800 mV normal idle
230[ 0.301926]@1 pm8994_l16: 2700 mV normal idle
231[ 0.302497]@1 pm8994_l17: 2600 mV normal idle
232[ 0.303039]@1 pm8994_l18: 3300 mV normal idle
233[ 0.303590]@1 pm8994_l19: 3000 mV normal idle
234[ 0.304132]@1 pm8994_l20: 2950 mV normal idle
235[ 0.304690]@1 pm8994_l21: 2950 mV normal idle
236[ 0.305237]@1 pm8994_l22: 3000 <--> 3300 mV at 3000 mV normal idle
237[ 0.305793]@1 pm8994_l23: 2800 mV normal idle
238[ 0.306343]@1 pm8994_l24: 3075 mV normal idle
239[ 0.306911]@1 pm8994_l25: 1200 mV normal idle
240[ 0.307819]@1 pm8994_l26_corner: 0 <--> 0 mV at 0 mV normal idle
241[ 0.308324]@1 pm8994_l26_floor_corner: 0 <--> 0 mV at 0 mV normal idle
242[ 0.308875]@1 pm8994_l27: 1000 <--> 1200 mV at 1030 mV normal idle
243[ 0.309457]@1 pm8994_l28: 925 mV normal idle
244[ 0.310391]@1 pm8994_l29: 2800 mV normal idle
245[ 0.310971]@1 pm8994_l30: 1800 mV normal idle
246[ 0.311525]@1 pm8994_l32: 1800 mV normal idle
247[ 0.312099]@1 pm8994_lvs1: no parameters
248[ 0.312595]@1 pm8994_lvs2: no parameters
249[ 0.313114]@1 pmi8994_s1: 1025 mV normal idle
250[ 0.313652]@1 pmi8994_boost_5v: no parameters
251[ 0.313808]@1 qcom,rpm-smd-regulator soc:qcom,rpm-smd:rpm-regulator-bstb:regulator-bst: Failed to find supply parent
252[ 0.313928]@1 rpm_vreg_device_probe: regulator_register failed: pmi8994_boost_5v, rc=-517
253[ 0.314337]@1 pmi8994_boost_pin_ctrl: no parameters
254[ 0.314430]@1 qcom,rpm-smd-regulator soc:qcom,rpm-smd:rpm-regulator-bstb:regulator-bst-pin-ctrl: Failed to find supply parent
255[ 0.314542]@1 rpm_vreg_device_probe: regulator_register failed: pmi8994_boost_pin_ctrl, rc=-517
256[ 0.315016]@1 pmi8994_boostbypass: 3150 <--> 3600 mV at 3150 mV normal idle
257[ 0.315443]@1 pm8994_s11: 470 <--> 1140 mV at 905 mV normal idle
258[ 0.315727]@1 pm8994_s11_avs_limit: 470 <--> 1140 mV
259[ 0.315869]@1 spm_regulator_probe: name=pm8994_s11, range=LV, voltage=905000 uV, mode=AUTO, step rate=2400 uV/us
260[ 0.316764]@1 msm-thermal 70000.qcom,msm-thermal: msm_thermal:Failed reading node=/soc/qcom,msm-thermal, key=qcom,rpm-phase-resource-type err=-22. KTM continues
261[ 0.316797]@1 msm-thermal 70000.qcom,msm-thermal: msm_thermal:Failed reading node=/soc/qcom,msm-thermal, key=qcom,gfx-sensor-id. err=-22. KTM continues
262[ 0.316812]@1 msm_thermal:sensor_mgr_init_threshold threshold id already initialized
263[ 0.316829]@1 msm-thermal 70000.qcom,msm-thermal: probe_vdd_mx:Failed reading node=/soc/qcom,msm-thermal, key=qcom,mx-restriction-temp. KTM continues
264[ 0.316846]@1 msm-thermal 70000.qcom,msm-thermal: probe_psm:Failed reading node=/soc/qcom,msm-thermal, key=qcom,pmic-sw-mode-temp. err=-22. KTM continues
265[ 0.317294]@1 msm_thermal:vdd_restriction_reg_init Defer regulator vdd-gfx probe
266[ 0.317317]@1 msm_thermal:probe_vdd_rstr Err regulator init. err:-517. KTM continues.
267[ 0.317331]@1 msm-thermal 70000.qcom,msm-thermal: probe_vdd_rstr:Failed reading node=/soc/qcom,msm-thermal, key=qcom,max-freq-level. err=-517. KTM continues
268[ 0.317346]@1 msm_thermal:msm_thermal_dev_probe Failed reading node=/soc/qcom,msm-thermal, key=qcom,online-hotplug-core. err:-517
269[ 0.318317]@1 msm_mpm_dev_probe(): Cannot get clk resource for XO: -517
270[ 0.318878]@1 i2c-msm-v2 75ba000.i2c: probing driver i2c-msm-v2
271[ 0.318989]@1 i2c-msm-v2 75ba000.i2c: error on clk_get(core_clk):-517
272[ 0.319006]@1 i2c-msm-v2 75ba000.i2c: error probe() failed with err:-517
273[ 0.319499]@1 i2c-msm-v2 757a000.i2c: probing driver i2c-msm-v2
274[ 0.319597]@1 i2c-msm-v2 757a000.i2c: error on clk_get(core_clk):-517
275[ 0.319612]@1 i2c-msm-v2 757a000.i2c: error probe() failed with err:-517
276[ 0.320165]@1 i2c-msm-v2 75b5000.i2c: probing driver i2c-msm-v2
277[ 0.320280]@1 i2c-msm-v2 75b5000.i2c: error on clk_get(core_clk):-517
278[ 0.320294]@1 i2c-msm-v2 75b5000.i2c: error probe() failed with err:-517
279[ 0.320818]@1 i2c-msm-v2 7577000.i2c: probing driver i2c-msm-v2
280[ 0.320917]@1 i2c-msm-v2 7577000.i2c: error on clk_get(core_clk):-517
281[ 0.320931]@1 i2c-msm-v2 7577000.i2c: error probe() failed with err:-517
282[ 0.321388]@1 i2c-msm-v2 75b6000.i2c: probing driver i2c-msm-v2
283[ 0.321485]@1 i2c-msm-v2 75b6000.i2c: error on clk_get(core_clk):-517
284[ 0.321500]@1 i2c-msm-v2 75b6000.i2c: error probe() failed with err:-517
285[ 0.321894]@1 cpu-clock-8996 6400000.qcom,cpu-clock-8996: resources init failed
286[ 0.345949]@1 qcom,gcc-8996 300000.qcom,gcc: Registered GCC clocks.
287[ 0.347027]@1 vfe0_clk_src: set OPP pair(75000000 Hz: 3 uV) on a10000.qcom,vfe0
288[ 0.347056]@1 vfe0_clk_src: set OPP pair(320000000 Hz: 5 uV) on a10000.qcom,vfe0
289[ 0.347071]@1 vfe0_clk_src: set OPP pair(600000000 Hz: 7 uV) on a10000.qcom,vfe0
290[ 0.347420]@1 vfe1_clk_src: set OPP pair(75000000 Hz: 3 uV) on a14000.qcom,vfe1
291[ 0.347441]@1 vfe1_clk_src: set OPP pair(320000000 Hz: 5 uV) on a14000.qcom,vfe1
292[ 0.347455]@1 vfe1_clk_src: set OPP pair(600000000 Hz: 7 uV) on a14000.qcom,vfe1
293[ 0.347814]@1 cpp_clk_src: set OPP pair(100000000 Hz: 3 uV) on a04000.qcom,cpp
294[ 0.347835]@1 cpp_clk_src: set OPP pair(480000000 Hz: 5 uV) on a04000.qcom,cpp
295[ 0.347846]@1 cpp_clk_src: set OPP pair(640000000 Hz: 7 uV) on a04000.qcom,cpp
296[ 0.359790]@1 qcom,mmsscc-8996 8c0000.qcom,mmsscc: Registered MMSS clocks.
297[ 0.361760]@1 pmi8994_boost_5v: no parameters
298[ 0.361906]@1 qcom,rpm-smd-regulator soc:qcom,rpm-smd:rpm-regulator-bstb:regulator-bst: Failed to find supply parent
299[ 0.362025]@1 rpm_vreg_device_probe: regulator_register failed: pmi8994_boost_5v, rc=-517
300[ 0.362306]@1 pmi8994_boost_pin_ctrl: no parameters
301[ 0.362386]@1 qcom,rpm-smd-regulator soc:qcom,rpm-smd:rpm-regulator-bstb:regulator-bst-pin-ctrl: Failed to find supply parent
302[ 0.362493]@1 rpm_vreg_device_probe: regulator_register failed: pmi8994_boost_pin_ctrl, rc=-517
303[ 0.363389]@1 msm-thermal 70000.qcom,msm-thermal: msm_thermal:Failed reading node=/soc/qcom,msm-thermal, key=qcom,rpm-phase-resource-type err=-22. KTM continues
304[ 0.363417]@1 msm-thermal 70000.qcom,msm-thermal: msm_thermal:Failed reading node=/soc/qcom,msm-thermal, key=qcom,gfx-sensor-id. err=-22. KTM continues
305[ 0.363431]@1 msm_thermal:sensor_mgr_init_threshold threshold id already initialized
306[ 0.363447]@1 msm-thermal 70000.qcom,msm-thermal: probe_vdd_mx:Failed reading node=/soc/qcom,msm-thermal, key=qcom,mx-restriction-temp. KTM continues
307[ 0.363463]@1 msm-thermal 70000.qcom,msm-thermal: probe_psm:Failed reading node=/soc/qcom,msm-thermal, key=qcom,pmic-sw-mode-temp. err=-22. KTM continues
308[ 0.363736]@1 msm_thermal:vdd_restriction_reg_init Defer regulator vdd-gfx probe
309[ 0.363752]@1 msm_thermal:probe_vdd_rstr Err regulator init. err:-517. KTM continues.
310[ 0.363765]@1 msm-thermal 70000.qcom,msm-thermal: probe_vdd_rstr:Failed reading node=/soc/qcom,msm-thermal, key=qcom,max-freq-level. err=-517. KTM continues
311[ 0.363778]@1 msm_thermal:msm_thermal_dev_probe Failed reading node=/soc/qcom,msm-thermal, key=qcom,online-hotplug-core. err:-517
312[ 0.364523]@1 cpr3_msm8996_hmss_read_fuse_data: apc0_pwrcl_corner: speed bin = 0
313[ 0.364545]@1 cpr3_msm8996_hmss_read_fuse_data: apc0_pwrcl_corner: CPR fusing revision = 2
314[ 0.364556]@1 cpr3_msm8996_hmss_read_fuse_data: apc0_pwrcl_corner: using redundant fuses = N
315[ 0.364566]@1 cpr3_msm8996_hmss_read_fuse_data: apc0_pwrcl_corner: CPR limitation = none
316[ 0.364577]@1 cpr3_msm8996_hmss_read_fuse_data: apc0_pwrcl_corner: CPR partial binning limitation = none
317[ 0.364589]@1 cpr3_msm8996_hmss_read_fuse_data: apc0_pwrcl_corner: Retention voltage fuses: VDD_MX = 4, VDD_APCC = 4
318[ 0.364833]@1 cpr3_hmss_kvreg_init: apc0_pwrcl_corner: LDO min headroom=80000 uV, LDO max headroom=470000 uV, LDO adj=0 uV, LDO mode=allowed, LDO retention=490000 uV
319[ 0.365100]@1 cpr3_msm8996_hmss_calculate_open_loop_voltages: apc0_pwrcl_corner: fused MinSVS: open-loop= 565000 uV
320[ 0.365116]@1 cpr3_msm8996_hmss_calculate_open_loop_voltages: apc0_pwrcl_corner: fused SVS: open-loop= 645000 uV
321[ 0.365127]@1 cpr3_msm8996_hmss_calculate_open_loop_voltages: apc0_pwrcl_corner: fused NOM: open-loop= 745000 uV
322[ 0.365137]@1 cpr3_msm8996_hmss_calculate_open_loop_voltages: apc0_pwrcl_corner: fused TURBO: open-loop= 910000 uV
323[ 0.365251]@1 cpr3_msm8996_hmss_calculate_target_quotients: apc0_pwrcl_corner: fused MinSVS: quot[ 7]= 257
324[ 0.365262]@1 cpr3_msm8996_hmss_calculate_target_quotients: apc0_pwrcl_corner: fused SVS: quot[ 7]= 394, quot_offset[ 7]= 95
325[ 0.365273]@1 cpr3_msm8996_hmss_calculate_target_quotients: apc0_pwrcl_corner: fused NOM: quot[ 7]= 599, quot_offset[ 7]= 205
326[ 0.365283]@1 cpr3_msm8996_hmss_calculate_target_quotients: apc0_pwrcl_corner: fused TURBO: quot[ 7]= 931, quot_offset[ 7]= 330
327[ 0.365434]@1 cpr3_msm8996_hmss_read_fuse_data: apc0_cbf_corner: speed bin = 0
328[ 0.365445]@1 cpr3_msm8996_hmss_read_fuse_data: apc0_cbf_corner: CPR fusing revision = 2
329[ 0.365455]@1 cpr3_msm8996_hmss_read_fuse_data: apc0_cbf_corner: using redundant fuses = N
330[ 0.365465]@1 cpr3_msm8996_hmss_read_fuse_data: apc0_cbf_corner: CPR limitation = none
331[ 0.365475]@1 cpr3_msm8996_hmss_read_fuse_data: apc0_cbf_corner: CPR partial binning limitation = none
332[ 0.365487]@1 cpr3_msm8996_hmss_read_fuse_data: apc0_cbf_corner: Retention voltage fuses: VDD_MX = 4, VDD_APCC = 4
333[ 0.365650]@1 cpr3_msm8996_hmss_calculate_open_loop_voltages: apc0_cbf_corner: fused MinSVS: open-loop= 565000 uV
334[ 0.365661]@1 cpr3_msm8996_hmss_calculate_open_loop_voltages: apc0_cbf_corner: fused SVS: open-loop= 645000 uV
335[ 0.365670]@1 cpr3_msm8996_hmss_calculate_open_loop_voltages: apc0_cbf_corner: fused NOM: open-loop= 745000 uV
336[ 0.365680]@1 cpr3_msm8996_hmss_calculate_open_loop_voltages: apc0_cbf_corner: fused TURBO: open-loop= 910000 uV
337[ 0.365693]@1 cpr3_msm8996_hmss_calculate_open_loop_voltages: apc0_cbf_corner: fused MinSVS: CBF offset open-loop= 535000 uV
338[ 0.365703]@1 cpr3_msm8996_hmss_calculate_open_loop_voltages: apc0_cbf_corner: fused LowSVS: CBF offset open-loop= 645000 uV
339[ 0.365713]@1 cpr3_msm8996_hmss_calculate_open_loop_voltages: apc0_cbf_corner: fused SVS: CBF offset open-loop= 655000 uV
340[ 0.365722]@1 cpr3_msm8996_hmss_calculate_open_loop_voltages: apc0_cbf_corner: fused NOM: CBF offset open-loop= 775000 uV
341[ 0.365732]@1 cpr3_msm8996_hmss_calculate_open_loop_voltages: apc0_cbf_corner: fused TURBO: CBF offset open-loop= 920000 uV
342[ 0.365781]@1 cpr3_msm8996_hmss_calculate_target_quotients: apc0_cbf_corner: fused MinSVS: quot[ 7]= 257
343[ 0.365791]@1 cpr3_msm8996_hmss_calculate_target_quotients: apc0_cbf_corner: fused SVS: quot[ 7]= 394, quot_offset[ 7]= 95
344[ 0.365801]@1 cpr3_msm8996_hmss_calculate_target_quotients: apc0_cbf_corner: fused NOM: quot[ 7]= 599, quot_offset[ 7]= 205
345[ 0.365811]@1 cpr3_msm8996_hmss_calculate_target_quotients: apc0_cbf_corner: fused TURBO: quot[ 7]= 931, quot_offset[ 7]= 330
346[ 0.365935]@1 cpr3_msm8996_hmss_read_fuse_data: apc1_corner: speed bin = 0
347[ 0.365945]@1 cpr3_msm8996_hmss_read_fuse_data: apc1_corner: CPR fusing revision = 2
348[ 0.365955]@1 cpr3_msm8996_hmss_read_fuse_data: apc1_corner: using redundant fuses = N
349[ 0.365966]@1 cpr3_msm8996_hmss_read_fuse_data: apc1_corner: CPR limitation = none
350[ 0.365976]@1 cpr3_msm8996_hmss_read_fuse_data: apc1_corner: CPR partial binning limitation = none
351[ 0.365988]@1 cpr3_msm8996_hmss_read_fuse_data: apc1_corner: Retention voltage fuses: VDD_MX = 4, VDD_APCC = 4
352[ 0.366273]@1 cpr3_hmss_kvreg_init: apc1_corner: LDO min headroom=130000 uV, LDO max headroom=470000 uV, LDO adj=0 uV, LDO mode=allowed, LDO retention=490000 uV
353[ 0.366547]@1 cpr3_msm8996_hmss_calculate_open_loop_voltages: apc1_corner: fused MinSVS: open-loop= 575000 uV
354[ 0.366563]@1 cpr3_msm8996_hmss_calculate_open_loop_voltages: apc1_corner: fused SVS: open-loop= 655000 uV
355[ 0.366573]@1 cpr3_msm8996_hmss_calculate_open_loop_voltages: apc1_corner: fused NOM: open-loop= 765000 uV
356[ 0.366583]@1 cpr3_msm8996_hmss_calculate_open_loop_voltages: apc1_corner: fused TURBO: open-loop=1060000 uV
357[ 0.366718]@1 cpr3_msm8996_hmss_calculate_target_quotients: apc1_corner: fused MinSVS: quot[ 7]= 279
358[ 0.366729]@1 cpr3_msm8996_hmss_calculate_target_quotients: apc1_corner: fused SVS: quot[ 7]= 416, quot_offset[ 7]= 100
359[ 0.366740]@1 cpr3_msm8996_hmss_calculate_target_quotients: apc1_corner: fused NOM: quot[ 7]= 641, quot_offset[ 7]= 225
360[ 0.366751]@1 cpr3_msm8996_hmss_calculate_target_quotients: apc1_corner: fused TURBO: quot[ 7]=1176, quot_offset[ 7]= 535
361[ 0.367282]@1 cpr3_regulator_init_ctrl: apcc: Default CPR mode = SW closed-loop
362apc0_pwrcl_corner: 0 <--> 0 mV at 0 mV
363[ 0.367735]@1 apc0_cbf_corner: 0 <--> 0 mV at 0 mV
364[ 0.370472]@1 cpr3_regulator_measure_aging: apcc: average quotient delta=12 (count=10)
365[ 0.370508]@1 cpr3_regulator_aging_adjust: apcc: aging measurement successful; aging reference adjustment voltage=2500 uV
366[ 0.370715]@1 apc1_corner: 0 <--> 0 mV at 0 mV
367[ 0.372665]@1 cpr3_msm8996_mmss_read_fuse_data: gfx_corner: speed bin = 0
368[ 0.372689]@1 cpr3_msm8996_mmss_read_fuse_data: gfx_corner: CPR fusing revision = 1
369[ 0.372701]@1 cpr3_msm8996_mmss_read_fuse_data: gfx_corner: CPR limitation = none
370[ 0.373064]@1 cpr3_msm8996_mmss_calculate_open_loop_voltages: gfx_corner: fuse_corner[0] open-loop= 640000 uV
371[ 0.373076]@1 cpr3_msm8996_mmss_calculate_open_loop_voltages: gfx_corner: fuse_corner[1] open-loop= 695000 uV
372[ 0.373086]@1 cpr3_msm8996_mmss_calculate_open_loop_voltages: gfx_corner: fuse_corner[2] open-loop= 825000 uV
373[ 0.373096]@1 cpr3_msm8996_mmss_calculate_open_loop_voltages: gfx_corner: fuse_corner[3] open-loop= 955000 uV
374[ 0.373284]@1 cpr3_regulator_init_ctrl: gfx: Default CPR mode = closed-loop
375gfx_corner: 0 <--> 0 mV at 0 mV
376[ 0.375177]@1 i2c-msm-v2 75ba000.i2c: probing driver i2c-msm-v2
377[ 0.375300]@1 AXI: msm_bus_scale_register_client(): msm_bus_scale_register_client: Bus driver not ready.
378i2c-msm-v2 75ba000.i2c: msm_bus_scale_register_client(mstr-id:84):0 (not a problem)
379i2c-msm-v2 757a000.i2c: probing driver i2c-msm-v2
380[ 0.376648]@1 AXI: msm_bus_scale_register_client(): msm_bus_scale_register_client: Bus driver not ready.
381i2c-msm-v2 757a000.i2c: msm_bus_scale_register_client(mstr-id:86):0 (not a problem)
382i2c-msm-v2 75b5000.i2c: probing driver i2c-msm-v2
383[ 0.378014]@1 AXI: msm_bus_scale_register_client(): msm_bus_scale_register_client: Bus driver not ready.
384i2c-msm-v2 75b5000.i2c: msm_bus_scale_register_client(mstr-id:84):0 (not a problem)
385i2c-msm-v2 7577000.i2c: probing driver i2c-msm-v2
386[ 0.379420]@1 AXI: msm_bus_scale_register_client(): msm_bus_scale_register_client: Bus driver not ready.
387i2c-msm-v2 7577000.i2c: msm_bus_scale_register_client(mstr-id:86):0 (not a problem)
388i2c-msm-v2 75b6000.i2c: probing driver i2c-msm-v2
389[ 0.380711]@1 AXI: msm_bus_scale_register_client(): msm_bus_scale_register_client: Bus driver not ready.
390i2c-msm-v2 75b6000.i2c: msm_bus_scale_register_client(mstr-id:84):0 (not a problem)
391cpu-clock-8996 6400000.qcom,cpu-clock-8996: using perf/pwr/cbf speed bin 0 and pvs_ver 0
392[ 0.384373]@1 clock-cpu-8996: set OPP pair (307200000 Hz, 575000 uv) on cpu0
393[ 0.384447]@1 clock-cpu-8996: set OPP pair (2188800000 Hz, 1055000 uv) on cpu0
394[ 0.384473]@1 clock-cpu-8996: set OPP pair (307200000 Hz, 575000 uv) on cpu1
395[ 0.384523]@1 clock-cpu-8996: set OPP pair (2188800000 Hz, 1055000 uv) on cpu1
396[ 0.384545]@1 clock-cpu-8996: set OPP pair (307200000 Hz, 585000 uv) on cpu2
397[ 0.384618]@1 clock-cpu-8996: set OPP pair (2342400000 Hz, 1055000 uv) on cpu2
398[ 0.384640]@1 clock-cpu-8996: set OPP pair (307200000 Hz, 585000 uv) on cpu3
399[ 0.384711]@1 clock-cpu-8996: set OPP pair (2342400000 Hz, 1055000 uv) on cpu3
400[ 0.384849]@1 clock-cpu-8996: set OPP pair (192000000 Hz, 560000 uv) on soc:qcom,m4m
401[ 0.384902]@1 clock-cpu-8996: set OPP pair (1593600000 Hz, 945000 uv) on soc:qcom,m4m
402[ 0.385415]@1 qcom,gpucc-8996 8c0000.qcom,gpucc: using speed bin 0
403[ 0.385842]@1 gfx3d_clk_src_v2: set OPP pair(133000000 Hz: 570000 uV) on b00000.qcom,kgsl-3d0
404[ 0.385899]@1 gfx3d_clk_src_v2: set OPP pair(652800000 Hz: 930000 uV) on b00000.qcom,kgsl-3d0
405[ 0.387458]@1 qcom,gpucc-8996 8c0000.qcom,gpucc: Registered GPU clocks.
406[ 0.387747]@1 pmi8994_boost_5v: no parameters
407[ 0.387845]@1 qcom,rpm-smd-regulator soc:qcom,rpm-smd:rpm-regulator-bstb:regulator-bst: Failed to find supply parent
408[ 0.387962]@1 rpm_vreg_device_probe: regulator_register failed: pmi8994_boost_5v, rc=-517
409[ 0.388240]@1 pmi8994_boost_pin_ctrl: no parameters
410[ 0.388320]@1 qcom,rpm-smd-regulator soc:qcom,rpm-smd:rpm-regulator-bstb:regulator-bst-pin-ctrl: Failed to find supply parent
411[ 0.388428]@1 rpm_vreg_device_probe: regulator_register failed: pmi8994_boost_pin_ctrl, rc=-517
412[ 0.389319]@1 msm-thermal 70000.qcom,msm-thermal: msm_thermal:Failed reading node=/soc/qcom,msm-thermal, key=qcom,rpm-phase-resource-type err=-22. KTM continues
413[ 0.389350]@1 msm-thermal 70000.qcom,msm-thermal: msm_thermal:Failed reading node=/soc/qcom,msm-thermal, key=qcom,gfx-sensor-id. err=-22. KTM continues
414[ 0.389364]@1 msm_thermal:sensor_mgr_init_threshold threshold id already initialized
415[ 0.389380]@1 msm-thermal 70000.qcom,msm-thermal: probe_vdd_mx:Failed reading node=/soc/qcom,msm-thermal, key=qcom,mx-restriction-temp. KTM continues
416[ 0.389396]@1 msm-thermal 70000.qcom,msm-thermal: probe_psm:Failed reading node=/soc/qcom,msm-thermal, key=qcom,pmic-sw-mode-temp. err=-22. KTM continues
417[ 0.389746]@1 msm_thermal:update_cpu_freq Unable to update policy for cpu:0. err:-19
418[ 0.389766]@1 msm_thermal:update_cpu_freq Unable to update policy for cpu:2. err:-19
419[ 0.389779]@1 msm_thermal:update_cpu_freq Unable to update policy for cpu:2. err:-19
420[ 0.389800]@1 msm-thermal 70000.qcom,msm-thermal: probe_ocr:Failed reading node=/soc/qcom,msm-thermal, key=qcom,pmic-opt-curr-temp err:-22. KTM continues
421[ 0.390787]@2 pmi8994_boost_5v: no parameters
422[ 0.390887]@2 qcom,rpm-smd-regulator soc:qcom,rpm-smd:rpm-regulator-bstb:regulator-bst: Failed to find supply parent
423[ 0.390952]@1 msm_thermal:update_cpu_freq Unable to update policy for cpu:0. err:-19
424[ 0.390973]@1 msm_thermal:update_cpu_freq Unable to update policy for cpu:2. err:-19
425[ 0.390987]@1 msm_thermal:update_cpu_freq Unable to update policy for cpu:2. err:-19
426[ 0.391057]@2 rpm_vreg_device_probe: regulator_register failed: pmi8994_boost_5v, rc=-517
427[ 0.391313]@2 pmi8994_boost_pin_ctrl: no parameters
428[ 0.391367]@2 qcom,rpm-smd-regulator soc:qcom,rpm-smd:rpm-regulator-bstb:regulator-bst-pin-ctrl: Failed to find supply parent
429[ 0.391467]@2 rpm_vreg_device_probe: regulator_register failed: pmi8994_boost_pin_ctrl, rc=-517
430[ 0.444662]@3 KPI: Bootloader start count = 35259
431[ 0.444681]@3 KPI: Bootloader end count = 265118
432[ 0.444691]@3 KPI: Bootloader display count = 247729
433[ 0.444700]@3 KPI: Bootloader load kernel count = 2330
434[ 0.444711]@3 KPI: Kernel MPM timestamp = 289691
435[ 0.444720]@3 KPI: Kernel MPM Clock frequency = 32768
436[ 0.444736]@3 socinfo_print: v0.11, id=305, ver=1.1, raw_id=95, raw_ver=1, hw_plat=8, hw_plat_ver=65536
437 accessory_chip=0, hw_plat_subtype=0, pmic_model=65545, pmic_die_revision=131072 foundry_id=3 serial_number=591362483 num_pmics=2
438[ 0.444770]@3 init_project_info: project_name: 15811 hw_version: 28 rf_v1: 22 rf_v2: 1: rf_v3: 0 paltform_id:305
439[ 0.444785]@3 init_project_info: aboard_version: 1
440[ 0.445952]@3 op_rf_cable soc:oneplus_rf_cable: rf,cable-gpio - gpio: 131
441[ 0.446217]@3 requested irq 420
442[ 0.446245]@3 modify_rf_cable_smem_info: rf_cable: 0
443[ 0.446263]@3 op_rf_cable_probe: probe ok!
444[ 0.446728]@3 gdsc_mmagic_bimc: no parameters
445[ 0.447540]@3 rome_vreg: no parameters
446[ 0.448200]@3 vgaarb: loaded
447[ 0.449761]@3 SCSI subsystem initialized
448[ 0.451009]@3 usbcore: registered new interface driver usbfs
449[ 0.451068]@3 usbcore: registered new interface driver hub
450[ 0.451221]@3 usbcore: registered new device driver usb
451[ 0.451658]@3 soc:usb_nop_phy supply vcc not found, using dummy regulator
452[ 0.452402]@3 media: Linux media interface: v0.10
453[ 0.452461]@3 Linux video capture interface: v2.00
454[ 0.490361]@3 cpufreq: driver msm up and running
455[ 0.490921]@3 platform soc:qcom,ion:qcom,ion-heap@22: assigned reserved memory node adsp_region
456[ 0.491050]@3 platform soc:qcom,ion:qcom,ion-heap@27: assigned reserved memory node qseecom_region
457[ 0.491171]@3 platform soc:qcom,ion:qcom,ion-heap@10: assigned reserved memory node secure_region
458[ 0.491415]@3 ION heap system created
459[ 0.491543]@3 ion_heap_create: Heap type is disabled: 1
460[ 0.491549]@3 msm_ion_heap_create: error creating heap kmalloc type 1 base 0x0000000000000000 size 0
461[ 0.491555]@3 ION heap adsp created at 0x00000000ff800000 with size 400000
462[ 0.491564]@3 ION heap qsecom created at 0x00000000fe400000 with size 1400000
463[ 0.491573]@3 ION heap secure_display created at 0x00000000f8800000 with size 5c00000
464[ 0.491583]@3 ION heap secure_heap created
465[ 0.492298]@3 msm_bus_fabric_init_driver
466[ 0.495293]@3 msm-bus-type fab-a0noc: Error: Failed to get regulator bus-gdsc:-517
467[ 0.495306]@3 msm-bus-type fab-a0noc: Error: Failed to get regulator bus-a-gdsc:-517
468[ 0.498562]@3 msm-bus-type slv-vmem-cfg: Error: Failed to get regulator node-gdsc:-517
469[ 0.499087]@3 msm-bus-type slv-vmem: Error: Failed to get regulator node-gdsc:-517
470[ 0.505166]@3 msm-bus-type fab-a0noc: Error: Failed to get regulator aggre0-snoc-axi-no-rate:-517
471[ 0.505179]@3 msm-bus-type fab-a0noc: Error: Failed to get regulator aggre0-snoc-axi-no-rate:-517
472[ 0.505189]@3 msm-bus-type fab-a0noc: Error: Failed to get regulator aggre0-snoc-axi-no-rate:-517
473[ 0.505308]@3 msm-bus-type fab-mnoc: Error: Failed to get regulator mmagic-mdss-axi-no-rate:-517
474[ 0.505330]@3 msm-bus-type fab-mnoc: Error: Failed to get regulator mmagic-mdss-axi-no-rate:-517
475[ 0.505350]@3 msm-bus-type fab-mnoc: Error: Failed to get regulator mmagic-mdss-axi-no-rate:-517
476[ 0.505369]@3 msm-bus-type fab-mnoc: Error: Failed to get regulator mmagic-mdss-axi-no-rate:-517
477[ 0.505388]@3 msm-bus-type fab-mnoc: Error: Failed to get regulator mmagic-mdss-axi-no-rate:-517
478[ 0.505407]@3 msm-bus-type fab-mnoc: Error: Failed to get regulator mmagic-mdss-axi-no-rate:-517
479[ 0.505425]@3 msm-bus-type fab-mnoc: Error: Failed to get regulator mmagic-mdss-axi-no-rate:-517
480[ 0.506801]@3 qcom,qpnp-power-on qpnp-power-on-2: PMIC@SID0 Power-on reason: Triggered from Hard Reset[0x21] and 'cold' boot
481[ 0.506812]@3 qcom,qpnp-power-on qpnp-power-on-2: PMIC@SID0 Power-on reason: Triggered from PON1 (secondary PMIC)[0x21] and 'cold' boot
482[ 0.506828]@3 qcom,qpnp-power-on qpnp-power-on-2: PMIC@SID0: Power-off reason: Triggered from PS_HOLD (PS_HOLD/MSM controlled shutdown)[0x2]
483[ 0.506951]@3 input: qpnp_pon as /devices/virtual/input/input0
484[ 0.507456]@3 pon_spare_reg: no parameters
485[ 0.507523]@3 qcom,qpnp-power-on qpnp-power-on-11: No PON config. specified
486[ 0.507578]@3 qcom,qpnp-power-on qpnp-power-on-11: PMIC@SID2 Power-on reason: Triggered from Hard Reset[0x31] and 'cold' boot
487[ 0.507584]@3 qcom,qpnp-power-on qpnp-power-on-11: PMIC@SID2 Power-on reason: Triggered from USB (USB charger insertion)[0x31] and 'cold' boot
488[ 0.507590]@3 qcom,qpnp-power-on qpnp-power-on-11: PMIC@SID2 Power-on reason: Triggered from PON1 (secondary PMIC)[0x31] and 'cold' boot
489[ 0.507605]@3 qcom,qpnp-power-on qpnp-power-on-11: PMIC@SID2: Power-off reason: Triggered from PS_HOLD (PS_HOLD/MSM controlled shutdown)[0x2]
490[ 0.507771]@3 PMIC@SID0: PM8994 v2.0 options: 0, 0, 2, 2
491[ 0.507861]@3 PMIC@SID2: PMI8996 v1.1 options: 0, 0, 0, 0
492[ 0.508946]@3 ipa ipa_uc_state_check:291 uC interface not initialized
493[ 0.508959]@3 ipa ipa_sps_irq_control_all:932 EP (2) not allocated.
494[ 0.508964]@3 ipa ipa_sps_irq_control_all:932 EP (5) not allocated.
495[ 0.510685]@3 sps_register_bam_device : unable to create IPC Logging 0 for bam 0x0000000000684000
496sps_register_bam_device : unable to create IPC Logging 1 for bam 0x0000000000684000sps_register_bam_device : unable to create IPC Logging 2 for bam 0x0000000000684000
497sps_register_bam_device : unable to create IPC Logging 3 for bam 0x0000000000684000sps_register_bam_device : unable to create IPC Logging 4 for bam 0x0000000000684000
498sps:BAM 0x0000000000684000 is registered.ipa ipa_uc_state_check:291 uC interface not initialized
499[ 0.511572]@3 sps:BAM 0x0000000000684000 (va:0xffffff80020c0000) enabled: ver:0x27, number of pipes:20
500[ 0.512916]@3 ipa ipa_uc_state_check:291 uC interface not initialized
501[ 0.521081]@3 ipa ipa_uc_state_check:291 uC interface not initialized
502[ 0.522835]@3 IPA driver initialization was successful.
503[ 0.524101]@3 gdsc_mmagic_video: no parameters
504[ 0.524323]@3 gdsc_mmagic_mdss: no parameters
505[ 0.524483]@3 gdsc_mmagic_camss: no parameters
506[ 0.524715]@3 gdsc_venus: no parameters
507[ 0.524738]@3 gdsc_venus: supplied by gdsc_mmagic_video
508[ 0.524918]@3 gdsc_venus_core0: fast normal
509[ 0.525086]@3 gdsc_venus_core1: fast normal
510[ 0.525266]@3 gdsc_camss_top: no parameters
511[ 0.525285]@3 gdsc_camss_top: supplied by gdsc_mmagic_camss
512[ 0.525480]@3 gdsc_vfe0: no parameters
513[ 0.525499]@3 gdsc_vfe0: supplied by gdsc_camss_top
514[ 0.525686]@3 gdsc_vfe1: no parameters
515[ 0.525706]@3 gdsc_vfe1: supplied by gdsc_camss_top
516[ 0.525881]@3 gdsc_mdss: no parameters
517[ 0.525902]@3 gdsc_mdss: supplied by gdsc_mmagic_mdss
518[ 0.526179]@3 gdsc_jpeg: no parameters
519[ 0.526199]@3 gdsc_jpeg: supplied by gdsc_camss_top
520[ 0.526375]@3 gdsc_cpp: no parameters
521[ 0.526395]@3 gdsc_cpp: supplied by gdsc_camss_top
522[ 0.526571]@3 gdsc_pcie_0: no parameters
523[ 0.526715]@3 gdsc_pcie_1: no parameters
524[ 0.526868]@3 gdsc_pcie_2: no parameters
525[ 0.527014]@3 gdsc_usb30: no parameters
526[ 0.527188]@3 gdsc_ufs: no parameters
527[ 0.527371]@3 gdsc_fd: no parameters
528[ 0.527391]@3 gdsc_fd: supplied by gdsc_camss_top
529[ 0.527570]@3 gdsc_gpu: no parameters
530[ 0.527762]@3 gdsc_gpu_gx: no parameters
531[ 0.528116]@3 gdsc_gpu_gx: supplied by gfx_corner
532[ 0.528320]@3 gdsc_hlos1_vote_aggre0_noc: no parameters
533[ 0.528476]@3 gdsc_hlos1_vote_lpass_adsp: no parameters
534[ 0.528637]@3 gdsc_hlos1_vote_lpass_core: no parameters
535[ 0.528788]@3 gdsc_aggre0_noc: no parameters
536[ 0.531117]@3 mdss_pll_probe: MDSS pll label = MDSS DSI 0 PLL
537[ 0.531139]@3 mdss_pll_probe: mdss_pll_probe: label=MDSS DSI 0 PLL PLL SSC enabled
538[ 0.533066]@3 dsi_pll_clock_register_8996: Registered DSI PLL ndx=0 clocks successfully
539[ 0.533136]@3 mdss_pll_probe: MDSS pll label = MDSS DSI 1 PLL
540[ 0.533148]@3 mdss_pll_probe: mdss_pll_probe: label=MDSS DSI 1 PLL PLL SSC enabled
541[ 0.534254]@3 pll_is_pll_locked_8996: DSI PLL ndx=1 status=0 failed to Lock
542[ 0.534761]@3 dsi_pll_clock_register_8996: Registered DSI PLL ndx=1 clocks successfully
543[ 0.547848]@3 arm-smmu d80000.arm,smmu-jpeg: found 4 context interrupt(s) but have 3 context banks. assuming 3 context interrupts.
544[ 0.555408]@3 arm-smmu b40000.arm,smmu-kgsl: found 4 context interrupt(s) but have 2 context banks. assuming 2 context interrupts.
545[ 0.563725]@3 arm-smmu da0000.arm,smmu-vfe: found 4 context interrupt(s) but have 2 context banks. assuming 2 context interrupts.
546[ 0.572368]@3 arm-smmu d40000.arm,smmu-venus: found 11 context interrupt(s) but have 7 context banks. assuming 7 context interrupts.
547[ 0.580978]@3 arm-smmu d00000.arm,smmu-mdp: found 4 context interrupt(s) but have 2 context banks. assuming 2 context interrupts.
548[ 0.589190]@3 arm-smmu d20000.arm,smmu-rot: found 4 context interrupt(s) but have 2 context banks. assuming 2 context interrupts.
549[ 0.597579]@3 arm-smmu d60000.arm,smmu-cpp_fd: found 4 context interrupt(s) but have 3 context banks. assuming 3 context interrupts.
550[ 0.605194]@3 arm-smmu 1600000.arm,smmu-lpass_q6: found 16 context interrupt(s) but have 12 context banks. assuming 12 context interrupts.
551[ 0.612903]@3 arm-smmu 1640000.arm,smmu-anoc0: found 6 context interrupt(s) but have 7 context banks. assuming 7 context interrupts.
552[ 0.619801]@3 arm-smmu 1660000.arm,smmu-anoc1: found 8 context interrupt(s) but have 4 context banks. assuming 4 context interrupts.
553[ 0.626851]@3 arm-smmu 1680000.arm,smmu-anoc2: found 12 context interrupt(s) but have 8 context banks. assuming 8 context interrupts.
554[ 0.629666]@3 get_param_by_index_and_offset[75] sid_index = 12 offset = 0 buf = ffffffc00144efd8 length = 420
555[ 0.629770]@3 Advanced Linux Sound Architecture Driver Initialized.
556[ 0.630487]@3 Bluetooth: ffffffc1764bbd30
557NET: Registered protocol family 31
558[ 0.630596]@3 Bluetooth: ffffffc1764bbd30
559Bluetooth: ffffffc1764bbd10Bluetooth: ffffffc1764bbce0
560Bluetooth: ffffffc1764bbcf0cfg80211: Calling CRDA to update world regulatory domain
561[ 0.631187]@3 cfg80211: World regulatory domain updated:
562[ 0.631198]@3 cfg80211: DFS Master region: unset
563cfg80211: (start_freq - end_freq @ bandwidth), (max_antenna_gain, max_eirp), (dfs_cac_time)
564[ 0.631223]@3 cfg80211: (2402000 KHz - 2472000 KHz @ 40000 KHz), (N/A, 2000 mBm), (N/A)
565[ 0.631233]@3 cfg80211: (2457000 KHz - 2482000 KHz @ 40000 KHz), (N/A, 2000 mBm), (N/A)
566[ 0.631242]@3 cfg80211: (2474000 KHz - 2494000 KHz @ 20000 KHz), (N/A, 2000 mBm), (N/A)
567[ 0.631252]@3 cfg80211: (5170000 KHz - 5250000 KHz @ 80000 KHz), (N/A, 2000 mBm), (N/A)
568[ 0.631260]@3 cfg80211: (5250000 KHz - 5330000 KHz @ 80000 KHz), (N/A, 2000 mBm), (N/A)
569[ 0.631269]@3 cfg80211: (5490000 KHz - 5710000 KHz @ 80000 KHz), (N/A, 2000 mBm), (N/A)
570[ 0.631278]@3 cfg80211: (5735000 KHz - 5835000 KHz @ 80000 KHz), (N/A, 2000 mBm), (N/A)
571[ 0.631286]@3 cfg80211: (57240000 KHz - 63720000 KHz @ 2160000 KHz), (N/A, 0 mBm), (N/A)
572[ 0.631449]@2 pcie:pcie_init.
573[ 0.631459]@2 pcie_init: unable to create IPC log context for pcie0-short
574[ 0.631468]@2 pcie_init: unable to create IPC log context for pcie0-long
575[ 0.631476]@2 pcie_init: unable to create IPC log context for pcie0-dump
576[ 0.631483]@2 pcie_init: unable to create IPC log context for pcie1-short
577[ 0.631491]@2 pcie_init: unable to create IPC log context for pcie1-long
578[ 0.631499]@2 pcie_init: unable to create IPC log context for pcie1-dump
579[ 0.631507]@2 pcie_init: unable to create IPC log context for pcie2-short
580[ 0.631514]@2 pcie_init: unable to create IPC log context for pcie2-long
581[ 0.631522]@2 pcie_init: unable to create IPC log context for pcie2-dump
582[ 0.633317]@2 600000.qcom,pcie supply vreg-3.3 not found, using dummy regulator
583[ 0.635778]@2 msm_pcie_get_resources: PCIe: RC0 can't get tcsr resource.
584[ 0.638370]@1 pmi8994_boost_5v: no parameters
585[ 0.638623]@1 pmi8994_boost_5v: supplied by pon_spare_reg
586[ 0.639119]@1 pmi8994_boost_pin_ctrl: no parameters
587[ 0.639319]@1 pmi8994_boost_pin_ctrl: supplied by pon_spare_reg
588[ 0.639988]@2 Switched to clocksource arch_sys_counter
589[ 0.641230]@2 bcl_peripheral:bcl_perph_init BCL Initialized
590[ 0.643339]@3 NET: Registered protocol family 2
591[ 0.643939]@3 TCP established hash table entries: 65536 (order: 7, 524288 bytes)
592[ 0.644091]@3 TCP bind hash table entries: 65536 (order: 8, 1048576 bytes)
593[ 0.645042]@3 TCP: Hash tables configured (established 65536 bind 65536)
594[ 0.645236]@3 TCP: reno registered
595[ 0.645276]@3 UDP hash table entries: 4096 (order: 5, 131072 bytes)
596[ 0.645368]@3 UDP-Lite hash table entries: 4096 (order: 5, 131072 bytes)
597[ 0.645807]@3 NET: Registered protocol family 1
598[ 0.646440]@3 Trying to unpack rootfs image as initramfs...
599[ 0.821676]@3 Freeing initrd memory: 8980K (ffffffc002200000 - ffffffc002ac5000)
600[ 0.823640]@3 kryo perfevents: CPU pmu for kryo-pmuv3 detected
601[ 0.828859]@3 futex hash table entries: 1024 (order: 5, 131072 bytes)
602[ 0.829006]@3 audit: initializing netlink subsys (disabled)
603[ 0.829123]@3 audit: type=2000 audit(0.819:1): initialized
604[ 0.829695]@3 vmscan: error setting kswapd cpu affinity mask
605[ 0.833607]@3 fuse init (API version 7.23)
606[ 0.833964]@3 exfat: init_exfat_fs: exFAT Filesystem version 1.2.23
607[ 0.834021]@3 Registering sdcardfs 3.1.0
608[ 0.836247]@3 Block layer SCSI generic (bsg) driver version 0.4 loaded (major 246)
609[ 0.836276]@3 io scheduler noop registered (default)
610[ 0.847847]@3 mdss_mdp_parse_dt_hw_settings: MDSS VBIF settings not found
611[ 0.847904]@3 mdss_mdp_parse_dt_prop_len: prop qcom,mdss-smp-data : doesn't exist in device tree
612[ 0.847964]@3 mdss_mdp_pipe_addr_setup: type:1 ftchid:0 xinid:0 num:0 ndx:0x1 prio:0
613[ 0.847976]@3 mdss_mdp_pipe_addr_setup: type:1 ftchid:0 xinid:4 num:1 ndx:0x2 prio:1
614[ 0.847985]@3 mdss_mdp_pipe_addr_setup: type:1 ftchid:0 xinid:8 num:2 ndx:0x4 prio:2
615[ 0.847996]@3 mdss_mdp_pipe_addr_setup: type:2 ftchid:0 xinid:1 num:3 ndx:0x8 prio:4
616[ 0.848004]@3 mdss_mdp_pipe_addr_setup: type:2 ftchid:0 xinid:5 num:4 ndx:0x10 prio:5
617[ 0.848013]@3 mdss_mdp_pipe_addr_setup: type:2 ftchid:0 xinid:9 num:5 ndx:0x20 prio:6
618[ 0.848025]@3 mdss_mdp_pipe_addr_setup: type:3 ftchid:0 xinid:2 num:6 ndx:0x40 prio:8
619[ 0.848033]@3 mdss_mdp_pipe_addr_setup: type:3 ftchid:0 xinid:10 num:7 ndx:0x80 prio:9
620[ 0.848042]@3 mdss_mdp_pipe_addr_setup: type:1 ftchid:0 xinid:12 num:8 ndx:0x100 prio:3
621[ 0.848051]@3 mdss_mdp_pipe_addr_setup: type:2 ftchid:0 xinid:13 num:9 ndx:0x200 prio:7
622[ 0.848068]@3 mdss_mdp_parse_dt_handler: Error from prop qcom,mdss-pipe-sw-reset-off : u32 array read
623[ 0.848097]@3 mdss_mdp_pipe_addr_setup: type:4 ftchid:-1 xinid:7 num:10 ndx:0x400 prio:0
624[ 0.848105]@3 mdss_mdp_pipe_addr_setup: type:4 ftchid:-1 xinid:7 num:11 ndx:0x800 prio:1
625[ 0.848114]@3 mdss_mdp_parse_dt_pipe: dedicated vp cursors detected, num=2
626[ 0.848176]@3 mdss_mdp_parse_dt_handler: Error from prop qcom,mdss-ib-factor-overlap : u32 array read
627[ 0.848193]@3 mdss_mdp_parse_dt_prop_len: prop qcom,mdss-clk-levels : doesn't exist in device tree
628[ 0.848235]@3 mdss_mdp_parse_dt_prop_len: prop qcom,mdss-smp-data : doesn't exist in device tree
629[ 0.849203]@3 mdss_mdp_irq_clk_register: unable to get clk: lut_clk
630[ 0.850937]@3 xlog_status: enable:0, panic:0, dump:2
631[ 0.852283]@3 mdss_smmu_attach_v2: iommu device not attached for domain[0]
632[ 0.852296]@3 mdss_mdp_clk_ctrl: IOMMU attach failed
633[ 0.852307]@3 No change in context(0==0), skip
634[ 0.853927]@3 mdss_mdp_probe: mdss version = 0x10070002, bootloader display is on
635[ 0.858741]@3 mdss_smmu_probe: iommu v2 domain[0] mapping and clk register successful!
636[ 0.858899]@3 mdss_smmu_probe: iommu v2 domain[1] mapping and clk register successful!
637[ 0.858995]@3 mdss_smmu_probe: iommu v2 domain[2] mapping and clk register successful!
638[ 0.859090]@3 mdss_smmu_probe: iommu v2 domain[3] mapping and clk register successful!
639[ 0.861965]@3 mdss_dsi_ctrl_probe: DSI Ctrl name = MDSS DSI CTRL->0
640[ 0.862300]@3 mdss_dsi_find_panel_of_node: cmdline:0:qcom,mdss_dsi_samsung_s6e3fa5_1080p_cmd:1:none:cfg:single_dsi panel_name:qcom,mdss_dsi_samsung_s6e3fa5_1080p_cmd
641[ 0.862316]@3 mdss_dsi_panel_init: Panel Name = samsung s6e3fa5 1080p cmd mode dsi panel
642[ 0.862417]@3 mdss_dsi_panel_timing_from_dt: found new timing "qcom,mdss_dsi_samsung_s6e3fa5_1080p_cmd" (ffffffc1764bb378)
643[ 0.862430]@3 mdss_dsi_parse_dcs_cmds: dcs_cmd=5 len=123, cmd_cnt=13 link_state=0
644[ 0.862439]@3 mdss_dsi_parse_dcs_cmds: dcs_cmd=5 len=9, cmd_cnt=1 link_state=0
645[ 0.862448]@3 mdss_dsi_parse_dcs_cmds: failed, key=qcom,mdss-dsi-timing-switch-command
646[ 0.862492]@3 mdss_dsi_parse_dcs_cmds: dcs_cmd=15 len=9, cmd_cnt=1 link_state=1
647[ 0.862508]@3 mdss_dsi_parse_dcs_cmds: dcs_cmd=39 len=47, cmd_cnt=5 link_state=1
648[ 0.862520]@3 mdss_dsi_parse_dcs_cmds: dcs_cmd=39 len=47, cmd_cnt=5 link_state=1
649[ 0.862533]@3 mdss_dsi_parse_dcs_cmds: dcs_cmd=39 len=47, cmd_cnt=5 link_state=1
650[ 0.862544]@3 mdss_dsi_parse_dcs_cmds: dcs_cmd=39 len=47, cmd_cnt=5 link_state=1
651[ 0.862556]@3 mdss_dsi_parse_dcs_cmds: dcs_cmd=39 len=47, cmd_cnt=5 link_state=1
652[ 0.862567]@3 mdss_dsi_parse_dcs_cmds: dcs_cmd=39 len=47, cmd_cnt=5 link_state=1
653[ 0.862577]@3 mdss_dsi_parse_dcs_cmds: dcs_cmd=15 len=9, cmd_cnt=1 link_state=1
654[ 0.862592]@3 mdss_dsi_parse_dcs_cmds: dcs_cmd=15 len=9, cmd_cnt=1 link_state=1
655[ 0.862600]@3 mdss_dsi_parse_dcs_cmds address : 0xc3 size : 0xa offset : 0x19
656[ 0.862609]@3 mdss_dsi_parse_dcs_cmds: dcs_cmd=6 len=10, cmd_cnt=1 link_state=0
657[ 0.862620]@3 mdss_dsi_parse_dcs_cmds: dcs_cmd=39 len=10, cmd_cnt=1 link_state=0
658[ 0.862630]@3 mdss_dsi_parse_dcs_cmds: dcs_cmd=29 len=10, cmd_cnt=1 link_state=0
659[ 0.862641]@3 mdss_dsi_parse_dcs_cmds: dcs_cmd=37 len=9, cmd_cnt=1 link_state=0
660[ 0.862651]@3 mdss_dsi_parse_dcs_cmds: dcs_cmd=15 len=9, cmd_cnt=1 link_state=0
661[ 0.862683]@3 mdss_dsi_parse_dcs_cmds: dcs_cmd=5 len=18, cmd_cnt=2 link_state=1
662[ 0.862697]@3 mdss_dsi_parse_panel_features: partial_update_enabled=0
663[ 0.862707]@3 mdss_dsi_parse_panel_features: ulps feature disabled
664[ 0.862715]@3 mdss_dsi_parse_panel_features: ulps during suspend feature disabled
665mdss_dsi_parse_dms_config: dynamic switch feature enabled: 0
666[ 0.862740]@3 mdss_dsi_parse_dcs_cmds: failed, key=qcom,mdss-dsi-panel-status-command
667[ 0.862769]@3 mdss_dsi_panel_init: Panel Manufacture = SAMSUNG
668[ 0.862775]@3 mdss_dsi_panel_init: Panel Version = S6E3FA5
669[ 0.862784]@3 high brightness panel: 1
670[ 0.863180]@3 mdss_dsi_parse_ctrl_params:3879 Unable to read qcom,display-id, data= (null),len=20
671[ 0.863227]@3 mdss_dsi_parse_gpio_params: bklt_en gpio not specified
672[ 0.863452]@3 msm_dss_get_res_byname: 'dsi_phy_regulator' resource not found
673[ 0.863460]@3 mdss_dsi_retrieve_ctrl_resources+0x158/0x1c8->msm_dss_ioremap_byname: 'dsi_phy_regulator' msm_dss_get_res_byname failed
674[ 0.863481]@3 mdss_dsi_retrieve_ctrl_resources: ctrl_base=ffffff80021d6000 ctrl_size=400 phy_base=ffffff80021f2400 phy_size=588
675[ 0.863656]@3 dsi_panel_device_register: Continuous splash enabled
676[ 0.864247]@3 mdss_register_panel: adding framebuffer device 994000.qcom,mdss_dsi_ctrl0
677[ 0.867494]@3 mdss_dsi_ctrl_probe: Dsi Ctrl->0 initialized, DSI rev:0x10040001, PHY rev:0x2
678[ 0.868895]@3 mdss_dsi_status_init: DSI status check interval:5000
679[ 0.869960]@3 mdss_register_panel: adding framebuffer device soc:qcom,mdss_wb_panel
680[ 0.871880]@3 mdss_fb_probe: fb0: split_mode:0 left:0 right:0
681[ 0.872419]@3 mdss_fb_register: FrameBuffer[0] 1080x1920 registered successfully!
682[ 0.873248]@3 mdss_fb_probe: fb1: split_mode:0 left:0 right:0
683[ 0.873337]@3 mdss_fb_register: FrameBuffer[1] 640x480 registered successfully!
684[ 0.873410]@3 mdss_mdp_splash_parse_dt: splash mem child node is not present
685[ 0.876246]@3 glink_loopback_server_init: unable to create log context
686[ 0.876569]@3 msm_smp2p_init: unable to create log context
687[ 0.878939]@3 qmi_log_init: Unable to create QMI IPC logging for Req/Resp
688logging for Indications: Unable to create QMI IPC qmi_log_initl2cache-pmu soc:l2-pmu: Registered L2 cache PMU using 2 HW PMUs
689[ 0.890857]@3 msm_rpm_log_probe: OK
690[ 0.896571]@0 smd_channel_probe_now: allocation table not initialized
691[ 0.901042]@3 uart_tx_gpio is not available
692[ 0.901059]@3 uart_rx_gpio is not available
693[ 0.901066]@3 uart_cts_gpio is not available
694[ 0.901072]@3 uart_rfr_gpio is not available
695[ 0.901204]@3 msm_serial_hs 7570000.uart: msm_hs_probe: error creating logging context
696sps: BAM device 0x0000000007544000 is not registered yet.
697[ 0.901927]@3 sps_register_bam_device : unable to create IPC Logging 0 for bam 0x0000000007544000
698sps_register_bam_device : unable to create IPC Logging 1 for bam 0x0000000007544000sps_register_bam_device : unable to create IPC Logging 2 for bam 0x0000000007544000
699sps_register_bam_device : unable to create IPC Logging 3 for bam 0x0000000007544000sps_register_bam_device : unable to create IPC Logging 4 for bam 0x0000000007544000
700sps:BAM 0x0000000007544000 is registered.msm_serial_hs 7570000.uart: msm_hs_probe: error creating tx logging context
701msm_serial_hs 7570000.uart: msm_hs_probe: error creating rx logging context
702msm_serial_hs 7570000.uart: msm_hs_probe: error creating usr logging context
7037570000.uart: ttyHS0 at MMIO 0x7570000 (irq = 20, base_baud = 460800) is a MSM HS UART
704[ 0.905717]@3 msm_serial_hs module loaded
705[ 0.906529]@3 msm_serial_hsl_probe: detected port #0 (ttyHSL0)
706[ 0.906667]@3 AXI: get_pdata(): Error: Client name not found
707[ 0.906675]@3 AXI: msm_bus_cl_get_pdata(): client has to provide missing entry for successful registration
708[ 0.906682]@3 msm_serial_hsl_probe: Bus scaling is disabled
709[ 0.906799]@3 75b0000.serial: ttyHSL0 at MMIO 0x75b0000 (irq = 12, base_baud = 460800) is a MSM
710[ 0.906879]@3 msm_hsl_console_setup: console setup on port #0
711[ 6.166289]@3 console [ttyHSL0] enabled
712[ 6.171259]@3 msm_serial_hsl_init: driver initialized
713[ 6.175290]@3 smd_tty_log_init: Unable to create IPC log
714diag: Failed to create IPC logging context
715[ 6.199473]@3 brd: module loaded
716[ 6.203161]@3 loop: module loaded
717[ 6.205553]@3 at24 6-0051: 4096 byte 24c32 EEPROM, writable, 1 bytes/write
718[ 6.213291]@3 QSEECOM: qseecom_probe: qseecom.qsee_version = 0x1000000
719[ 6.218839]@3 QSEECOM: qseecom_retrieve_ce_data: Device does not support PFE
720QSEECOM: qseecom_probe: no-clock-support=0x1QSEECOM: qseecom_probe: qseecom.qsee_reentrancy_support = 2
721[ 6.237035]@3 i2c-core: driver [tusb320] using legacy suspend method
722[ 6.242407]@3 i2c-core: driver [tusb320] using legacy resume method
723[ 6.248651]@3 i2c-core: driver [fusb301] using legacy suspend method
724[ 6.254950]@3 i2c-core: driver [fusb301] using legacy resume method
725[ 6.261247]@3 i2c-core: driver [ptn5150] using legacy suspend method
726[ 6.267527]@3 i2c-core: driver [ptn5150] using legacy resume method
727[ 6.275527]@3 gpio_dev_probe
728[ 6.277413]@3 i= 1 gpio=: 97
729[ 6.280342]@3 i= 2 gpio=: 98
730[ 6.283137]@3 i= 3 gpio=: 100
731[ 6.286096]@3 i= 4 gpio=: 115
732[ 6.289058]@3 i= 5 gpio=: 127
733[ 6.292030]@3 i= 6 gpio=: 133
734[ 6.294980]@3 i= 7 gpio=: 136
735[ 6.297893]@3 gpio_pinctrl_init
736[ 6.301495]@3 gpio_dev_probe ok!
737[ 6.304689]@3 i2c-core: driver [tabla-i2c-core] using legacy suspend method
738[ 6.311355]@3 i2c-core: driver [tabla-i2c-core] using legacy resume method
739[ 6.318241]@3 i2c-core: driver [wcd9xxx-i2c-core] using legacy suspend method
740[ 6.325305]@3 i2c-core: driver [wcd9xxx-i2c-core] using legacy resume method
741[ 6.332389]@3 i2c-core: driver [tasha-i2c-core] using legacy suspend method
742[ 6.339270]@3 i2c-core: driver [tasha-i2c-core] using legacy resume method
743[ 6.347698]@3 Loading pn544 driver
744[ 6.350225]@3 Enter pn544_probe !!!
745[ 6.353734]@3 pn544_parse_dt: 9, 94, 12, 1015 ,1018, 0
746[ 6.358776]@3 successfully got regulator_s4
747[ 6.363029]@3 successfully set regulator voltage_s4
748[ 6.367690]@3 get BBCLK2!!!
749[ 6.370510]@3 clk_prepare_enable. ret = 0
750[ 6.374615]@3 pn544_probe : requesting IRQ 298
751[ 6.379019]@3 [NXP-P61] : Entry : p61_dev_init
752[ 6.384681]@3 qce 660000.qcedev: Qualcomm Crypto 5.3.1 device found @0x660000
753[ 6.390848]@3 qce 660000.qcedev: CE device = 0x0
754, IO base, CE = 0xffffff8002740000
755, Consumer (IN) PIPE 2, Producer (OUT) PIPE 3
756IO base BAM = 0x (null)
757BAM IRQ 156
758Engines Availability = 0x2011053
759[ 6.409935]@3 sps_register_bam_device : unable to create IPC Logging 0 for bam 0x0000000000644000
760sps_register_bam_device : unable to create IPC Logging 1 for bam 0x0000000000644000sps_register_bam_device : unable to create IPC Logging 2 for bam 0x0000000000644000
761sps_register_bam_device : unable to create IPC Logging 3 for bam 0x0000000000644000sps_register_bam_device : unable to create IPC Logging 4 for bam 0x0000000000644000
762sps:BAM 0x0000000000644000 is registered.sps:BAM 0x0000000000644000 (va:0xffffff8003640000) enabled: ver:0x27, number of pipes:16
763[ 6.459464]@3 QCE50: qce_sps_init: Qualcomm MSM CE-BAM at 0x0000000000644000 irq 156
764[ 6.474975]@3 qcrypto 660000.qcrypto: Qualcomm Crypto 5.3.1 device found @0x660000
765[ 6.481619]@3 qcrypto 660000.qcrypto: CE device = 0x0
766, IO base, CE = 0xffffff8003740000
767, Consumer (IN) PIPE 4, Producer (OUT) PIPE 5
768IO base BAM = 0x (null)
769BAM IRQ 156
770Engines Availability = 0x2011053
771[ 6.501385]@3 QCE50: qce_sps_init: Qualcomm MSM CE-BAM at 0x0000000000644000 irq 156
772[ 6.514181]@3 qcrypto 660000.qcrypto: qcrypto-ecb-aes
773[ 6.518268]@3 qcrypto 660000.qcrypto: qcrypto-cbc-aes
774[ 6.523325]@3 qcrypto 660000.qcrypto: qcrypto-ctr-aes
775[ 6.528338]@3 qcrypto 660000.qcrypto: qcrypto-ecb-des
776[ 6.533378]@3 qcrypto 660000.qcrypto: qcrypto-cbc-des
777[ 6.538404]@3 qcrypto 660000.qcrypto: qcrypto-ecb-3des
778[ 6.543540]@3 qcrypto 660000.qcrypto: qcrypto-cbc-3des
779[ 6.548653]@3 qcrypto 660000.qcrypto: qcrypto-xts-aes
780[ 6.553691]@3 qcrypto 660000.qcrypto: qcrypto-sha1
781[ 6.558451]@3 qcrypto 660000.qcrypto: qcrypto-sha256
782[ 6.563419]@3 qcrypto 660000.qcrypto: qcrypto-aead-hmac-sha1-cbc-aes
783[ 6.569743]@3 qcrypto 660000.qcrypto: qcrypto-aead-hmac-sha1-cbc-des
784[ 6.576087]@3 qcrypto 660000.qcrypto: qcrypto-aead-hmac-sha1-cbc-3des
785[ 6.582512]@3 qcrypto 660000.qcrypto: qcrypto-aead-hmac-sha256-cbc-aes
786[ 6.589005]@3 qcrypto 660000.qcrypto: qcrypto-aead-hmac-sha256-cbc-des
787[ 6.595536]@3 qcrypto 660000.qcrypto: qcrypto-aead-hmac-sha256-cbc-3des
788[ 6.602127]@3 qcrypto 660000.qcrypto: qcrypto-hmac-sha1
789[ 6.607323]@3 qcrypto 660000.qcrypto: qcrypto-hmac-sha256
790[ 6.612721]@3 qcrypto 660000.qcrypto: qcrypto-aes-ccm
791[ 6.617739]@3 qcrypto 660000.qcrypto: qcrypto-rfc4309-aes-ccm
792[ 6.626069]@3 ICE IRQ = 28
793[ 6.632137]@3 qcom_ice_get_pdevice: found ice device ffffffc0b5997800
794[ 6.637557]@3 qcom_ice_get_pdevice: matching platform device ffffffc175b99400
795[ 6.645215]@3 scm_call failed: func id 0x42000c02, arginfo: 0x2, args: 0x13, 0x0, 0x0, 0x0, ret: -2, syscall returns: 0xfffffffffffffffc, 0x0, 0x0
796[ 6.658427]@3 ufs_qcom_phy_qmp_14nm 627000.ufsphy: failed to get tx_iface_clk err -517
797ufs_qcom_phy_qmp_14nm 627000.ufsphy: failed to get rx_iface_clk err -517
798scsi host0: ufshcd
799[ 6.677445]@3 qcom_ice 630000.ufsice: QC ICE 2.1.44 device found @0xffffff8002450000
800[ 6.701752]@3 SCSI Media Changer driver v0.25
801[ 6.709004]@3 sps:BAM 0x0000000007544000 (va:0xffffff80025c0000) enabled: ver:0x19, number of pipes:24
802[ 6.717571]@3 [NXP-P61] : p61_probe chip select : 1 , bus number = 0
803[ 6.719375]@1 ufshcd 624000.ufshc: ufshcd_print_pwr_info:[RX, TX]: gear=[1, 1], lane[1, 1], pwr[SLOWAUTO_MODE, SLOWAUTO_MODE], rate = 0
804[ 6.736143]@3 p61_parse_dt: 34, 21 0
805[ 6.739507]@3 [NXP-P61] : Entry : p61_hw_setup
806[ 6.744063]@3 [NXP-P61] : Exit : p61_hw_setup
807[ 6.748566]@3 [NXP-P61] : Entry : p61_disable_irq
808[ 6.753234]@3 [NXP-P61] : Exit : p61_disable_irq
809[ 6.757910]@3 [NXP-P61] : Exit : p61_probe
810[ 6.763009]@3 Ethernet Channel Bonding Driver: v3.7.1 (April 27, 2011)
811[ 6.769838]@3 tun: Universal TUN/TAP device driver, 1.6
812[ 6.774063]@3 tun: (C) 1999-2004 Max Krasnyansky <maxk@qualcomm.com>
813[ 6.780459]@3 PPP generic driver version 2.4.2
814[ 6.784851]@3 PPP BSD Compression module registered
815[ 6.789649]@3 PPP Deflate Compression module registered
816[ 6.794897]@3 PPP MPPE Compression module registered
817[ 6.799808]@3 NET: Registered protocol family 24
818[ 6.905932]@0 PCI host bridge /soc/qcom,pcie@00600000 ranges:
819[ 6.910685]@0 No bus range found for /soc/qcom,pcie@00600000, using [bus 00-ff]
820[ 6.918134]@0 IO 0x0c200000..0x0c2fffff -> 0x0c200000
821[ 6.923473]@2 MEM 0x0c300000..0x0cffffff -> 0x0c300000
822[ 6.928830]@2 pci-msm 600000.qcom,pcie: PCI host bridge to bus 0000:00
823[ 6.935258]@2 pci_bus 0000:00: root bus resource [bus 00-ff]
824[ 6.940872]@2 pci_bus 0000:00: root bus resource [io 0x0000-0xfffff] (bus address [0xc200000-0xc2fffff])
825[ 6.950418]@2 pci_bus 0000:00: root bus resource [mem 0x0c300000-0x0cffffff]
826[ 6.957497]@2 msm_pcie_oper_conf: Read of RC0 0:0x00 + 0x0014[4] is all FFs
827[ 6.964487]@2 pci 0000:00:00.0: of_irq_parse_pci() failed with rc=-19
828[ 6.970974]@2 pci 0000:00:00.0: bridge configuration invalid ([bus 00-00]), reconfiguring
829[ 6.979136]@2 msm_pcie_oper_conf: Read of RC0 1:0x00 + 0x0014[4] is all FFs
830[ 6.979789]@1 ufshcd 624000.ufshc: ufshcd_print_pwr_info:[RX, TX]: gear=[3, 3], lane[1, 1], pwr[FAST MODE, FAST MODE], rate = 2
831[ 6.980395]@1 scsi 0:0:0:49488: Well-known LUN SAMSUNG KLUCG4J1CB-B0B1 0800 PQ: 0 ANSI: 6
832[ 6.981235]@1 scsi 0:0:0:49456: Well-known LUN SAMSUNG KLUCG4J1CB-B0B1 0800 PQ: 0 ANSI: 6
833[ 6.981960]@1 scsi 0:0:0:49476: Well-known LUN SAMSUNG KLUCG4J1CB-B0B1 0800 PQ: 0 ANSI: 6
834[ 6.982524]@1 ufs_get_capacity_info size = 0x7734000
835scsi 0:0:0:0: Direct-Access SAMSUNG KLUCG4J1CB-B0B1 0800 PQ: 0 ANSI: 6
836[ 6.983440]@1 scsi 0:0:0:1: Direct-Access SAMSUNG KLUCG4J1CB-B0B1 0800 PQ: 0 ANSI: 6
837[ 6.983841]@1 scsi 0:0:0:2: Direct-Access SAMSUNG KLUCG4J1CB-B0B1 0800 PQ: 0 ANSI: 6
838[ 6.984235]@1 scsi 0:0:0:3: Direct-Access SAMSUNG KLUCG4J1CB-B0B1 0800 PQ: 0 ANSI: 6
839[ 6.984622]@1 scsi 0:0:0:4: Direct-Access SAMSUNG KLUCG4J1CB-B0B1 0800 PQ: 0 ANSI: 6
840[ 6.985000]@1 scsi 0:0:0:5: Direct-Access SAMSUNG KLUCG4J1CB-B0B1 0800 PQ: 0 ANSI: 6
841[ 6.985906]@0 sd 0:0:0:0: [sda] 16384-byte physical blocks
842[ 6.986743]@3 sd 0:0:0:1: [sdb] 16384-byte physical blocks
843[ 6.987837]@1 sd 0:0:0:2: [sdc] 16384-byte physical blocks
844[ 6.988327]@1 sd 0:0:0:0: [sda] 16384-byte physical blocks
845[ 6.989319]@3 sd 0:0:0:1: [sdb] 16384-byte physical blocks
846[ 6.989973]@1 sd 0:0:0:3: [sdd] 16384-byte physical blocks
847[ 6.990100]@0 sd 0:0:0:5: [sdf] 16384-byte physical blocks
848[ 6.990315]@3 sd 0:0:0:2: [sdc] 16384-byte physical blocks
849[ 6.990344]@3 sd 0:0:0:4: [sde] 16384-byte physical blocks
850[ 6.990911]@1 sda: sda1 sda2 sda3 sda4 sda5 sda6 sda7 sda8 sda9 sda10 sda11 sda12 sda13 sda14 sda15
851[ 6.992619]@1 sd 0:0:0:0: [sda] 16384-byte physical blocks
852[ 6.993564]@3 sdb: sdb1
853[ 6.993660]@1 sd 0:0:0:5: [sdf] 16384-byte physical blocks
854[ 6.993660]@0 sd 0:0:0:4: [sde] 16384-byte physical blocks
855[ 6.993816]@3 sd 0:0:0:3: [sdd] 16384-byte physical blocks
856[ 6.994146]@3 sdc: sdc1
857[ 6.994475]@0 sd 0:0:0:1: [sdb] 16384-byte physical blocks
858[ 6.994824]@0 sd 0:0:0:2: [sdc] 16384-byte physical blocks
859[ 6.997807]@0 sdf: sdf1 sdf2 sdf3 sdf4
860[ 6.998029]@3 sdd: sdd1 sdd2 sdd3
861[ 6.998125]@1 sde: sde1 sde2 sde3 sde4 sde5 sde6 sde7 sde8 sde9 sde10 sde11 sde12 sde13 sde14 sde15 sde16 sde17 sde18 sde19 sde20 sde21 sde22 sde23 sde24 sde25 sde26 sde27 sde28 sde29 sde30 sde31 sde32 sde33 sde34
862[ 6.998821]@3 sd 0:0:0:3: [sdd] 16384-byte physical blocks
863[ 6.998884]@3 sd 0:0:0:5: [sdf] 16384-byte physical blocks
864[ 7.000559]@1 sd 0:0:0:4: [sde] 16384-byte physical blocks
865[ 7.215864]@2 msm_pcie_oper_conf: Read of RC0 0:0x00 + 0x0028[4] is all FFs
866[ 7.221889]@2 pci 0000:00:00.0: BAR 8: assigned [mem 0x0c400000-0x0c5fffff]
867[ 7.228795]@2 pci 0000:00:00.0: BAR 0: assigned [mem 0x0c300000-0x0c300fff 64bit]
868[ 7.236345]@2 pci 0000:01:00.0: BAR 0: assigned [mem 0x0c400000-0x0c5fffff 64bit]
869[ 7.244005]@2 pci 0000:00:00.0: PCI bridge to [bus 01]
870[ 7.248911]@2 pci 0000:00:00.0: bridge window [mem 0x0c400000-0x0c5fffff]
871[ 7.270757]@2 cnss: Platform driver probed successfully.
872[ 7.276152]@2 usbcore: registered new interface driver asix
873[ 7.280763]@2 usbcore: registered new interface driver ax88179_178a
874[ 7.286950]@2 usbcore: registered new interface driver cdc_ether
875[ 7.292956]@2 usbcore: registered new interface driver net1080
876[ 7.298757]@2 usbcore: registered new interface driver cdc_subset
877[ 7.304850]@2 usbcore: registered new interface driver zaurus
878[ 7.310833]@3 usbcore: registered new interface driver cdc_ncm
879[ 7.316950]@3 msm_sharedmem: sharedmem_register_qmi: qmi init successful
880[ 7.319817]@2 msm_sharedmem: msm_sharedmem_probe: Device created for client 'rmtfs'
881[ 7.327218]@0 msm-dwc3 6a00000.ssusb: unable to get dbm device
882[ 7.330345]@2 ehci_hcd: USB 2.0 'Enhanced' Host Controller (EHCI) Driver
883[ 7.330355]@2 ehci-pci: EHCI PCI platform driver
884[ 7.330427]@2 usbcore: registered new interface driver usb-storage
885[ 7.330447]@2 usbcore: registered new interface driver ums-alauda
886[ 7.330463]@2 usbcore: registered new interface driver ums-cypress
887[ 7.330480]@2 usbcore: registered new interface driver ums-datafab
888[ 7.330495]@2 usbcore: registered new interface driver ums_eneub6250
889[ 7.330511]@2 usbcore: registered new interface driver ums-freecom
890[ 7.330525]@2 usbcore: registered new interface driver ums-isd200
891[ 7.330540]@2 usbcore: registered new interface driver ums-jumpshot
892[ 7.330555]@2 usbcore: registered new interface driver ums-karma
893[ 7.330571]@2 usbcore: registered new interface driver ums-onetouch
894[ 7.330588]@2 usbcore: registered new interface driver ums-realtek
895[ 7.330602]@2 usbcore: registered new interface driver ums-sddr09
896[ 7.330617]@2 usbcore: registered new interface driver ums-sddr55
897[ 7.330632]@2 usbcore: registered new interface driver ums-usbat
898[ 7.330698]@2 usbcore: registered new interface driver usbserial
899[ 7.330722]@2 usbcore: registered new interface driver usb_ehset_test
900[ 7.331512]@0 gbridge_init: gbridge_init successs.
901[ 7.331636]@0 mousedev: PS/2 mouse device common for all mice
902[ 7.331782]@0 usbcore: registered new interface driver xpad
903[ 7.331787]@0 synaptics,s3320: tpd_driver_init enter
904[ 7.332683]@0 synaptics,s3320: before on cpu [0]
905[ 7.332694]@0 synaptics,s3320: check CPU[0] is [online]
906[ 7.332697]@0 synaptics,s3320: check CPU[1] is [online]
907[ 7.333652]@0 touchkey,s1302: boot_time: before optimize [synaptics_ts_probe] on cpu 0
908[ 7.333664]@0 touchkey,s1302: boot_time: [synaptics_ts_probe] CPU0 is online
909[ 7.333666]@0 touchkey,s1302: boot_time: [synaptics_ts_probe] CPU1 is online
910[ 7.335762]@0 switch_data->key3_gpio=1013
911[ 7.335781]@0 switch_data->key2_gpio=1012
912[ 7.335789]@0 switch_data->key1_gpio=1014
913[ 7.337857]@0 fpc1020_probe
914[ 7.338205]@0 fpc1020 soc:fpc_fpc1020: fpc,irq-gpio - gpio: 95
915[ 7.338258]@0 fpc1020 soc:fpc_fpc1020: fpc,reset-gpio - gpio: 86
916[ 7.338305]@0 fpc1020 soc:fpc_fpc1020: fpc,gpio_id0 - gpio: 25
917[ 7.338308]@0 fpc1020 soc:fpc_fpc1020: fpc1020_probe: gpio_is_valid(fpc1020->id0_gpio=25)
918[ 7.338358]@0 fpc1020 soc:fpc_fpc1020: fpc,gpio_id1 - gpio: 143
919[ 7.338361]@0 fpc1020 soc:fpc_fpc1020: fpc1020_probe: gpio_is_valid(fpc1020->id1_gpio=143)
920[ 7.338400]@0 fpc1020 soc:fpc_fpc1020: fpc,gpio_1V8_EN - gpio: 14
921[ 7.338581]@0 input: fpc1020 as /devices/virtual/input/input1
922[ 7.338989]@0 fpc1020 soc:fpc_fpc1020: requested irq 384
923[ 7.339054]@0 fpc1020 soc:fpc_fpc1020: fpc1020_probe: ok
924[ 7.340983]@2 qcom,qpnp-rtc qpnp-rtc-8: rtc core: registered qpnp_rtc as rtc0
925[ 7.341210]@2 i2c /dev entries driver
926[ 7.376207]@2 vmem: Up and running with 4 banks of memory from [irq size 268614340041 pref disabled]
927[ 7.392423]@2 msm_camera_pinctrl_init:1201 Getting pinctrl handle failed
928[ 7.392434]@2 msm_camera_power_up:1242 Initialization of pinctrl failed
929[ 7.392437]@2 msm_camera_request_gpio_table:732 invalid gpio_tbl 0000000000000000 / size 0
930[ 7.397860]@2 msm_cci_init:1366: hw_version = 0x10040000
931[ 7.398095]@2 msm_eeprom_imx298_read_vendorInfo read 0x0700=1
932[ 7.398098]@2 msm_eeprom_imx298_read_vendorInfo pdaf calibration is valid
933[ 7.398134]@2 qcom,slave-addr = 0xA0
934[ 7.407215]@2 qcom,slave-addr = 0xA0
935[ 7.416279]@2 qcom,slave-addr = 0xA0
936[ 7.425341]@2 qcom,slave-addr = 0xA0
937[ 7.434417]@2 qcom,slave-addr = 0xA0
938[ 7.443483]@2 qcom,slave-addr = 0xA0
939[ 7.452546]@2 qcom,slave-addr = 0xA0
940[ 7.461617]@2 qcom,slave-addr = 0xA0
941[ 7.470702]@2 qcom,slave-addr = 0xA0
942[ 7.482324]@0 msm_camera_request_gpio_table:732 invalid gpio_tbl 0000000000000000 / size 0
943[ 7.482826]@0 msm_camera_pinctrl_init:1201 Getting pinctrl handle failed
944[ 7.482829]@0 msm_camera_power_up:1242 Initialization of pinctrl failed
945[ 7.482832]@0 msm_camera_request_gpio_table:732 invalid gpio_tbl 0000000000000000 / size 0
946[ 7.487446]@0 msm_cci_init:1366: hw_version = 0x10040000
947[ 7.487691]@0 msm_eeprom_s5k3p8sp_read_sensorInfo read eeprom.sensor_id = 0x3b
948[ 7.487696]@0 qcom,slave-addr = 0xA2
949[ 7.496687]@0 qcom,slave-addr = 0xA2
950[ 7.505689]@0 qcom,slave-addr = 0xA2
951[ 7.514656]@0 qcom,slave-addr = 0xA2
952[ 7.523604]@0 qcom,slave-addr = 0xA2
953[ 7.532570]@0 qcom,slave-addr = 0xA2
954[ 7.541538]@0 qcom,slave-addr = 0xA2
955[ 7.550516]@0 qcom,slave-addr = 0xA2
956[ 7.559473]@0 qcom,slave-addr = 0xA2
957[ 7.568448]@0 qcom,slave-addr = 0xA2
958[ 7.577425]@0 qcom,slave-addr = 0xA2
959[ 7.586395]@0 qcom,slave-addr = 0xA2
960[ 7.595359]@0 qcom,slave-addr = 0xA2
961[ 7.604332]@0 qcom,slave-addr = 0xA2
962[ 7.613301]@0 qcom,slave-addr = 0xA2
963[ 7.622269]@0 qcom,slave-addr = 0xA2
964[ 7.630037]@1 synaptics,s3320: after on cpu [1]
965[ 7.630041]@1 synaptics,s3320: synaptics_ts_probe is called
966[ 7.630312]@1 synaptics,s3320: synaptics_parse_dts ts->support_hw_poweroff =1
967[ 7.630317]@1 synaptics,s3320: ts->enable2v8_gpio not specified
968[ 7.630320]@1 synaptics,s3320: ts->max_num not specified
969[ 7.630324]@1 synaptics,s3320: button-map not specified
970[ 7.630325]@1 synaptics,s3320: synaptics:button map readed is 0 0 0
971[ 7.630329]@1 synaptics,s3320: synaptics,tx-rx-num is 16 28
972[ 7.630333]@1 synaptics,s3320: synaptic:ts->irq_gpio:125 irq_flags:8200 max_num 10
973[ 7.630823]@1 touchkey,s1302: boot_time: after optimize call [synaptics_ts_probe] on cpu 1
974[ 7.630834]@1 touchkey,s1302: synaptics_ts_probe is called
975[ 7.631356]@0 qcom,slave-addr = 0xA2
976[ 7.631885]@1 synaptics,s3320: synaptics:enable the v1p8_gpio
977[ 7.640445]@0 qcom,slave-addr = 0xA2
978[ 7.649398]@0 qcom,slave-addr = 0xA2
979[ 7.658364]@0 qcom,slave-addr = 0xA2
980[ 7.667326]@0 qcom,slave-addr = 0xA2
981[ 7.676283]@0 qcom,slave-addr = 0xA2
982[ 7.685277]@0 qcom,slave-addr = 0xA2
983[ 7.694242]@0 qcom,slave-addr = 0xA2
984[ 7.697191]@0 msm_camera_request_gpio_table:732 invalid gpio_tbl 0000000000000000 / size 0
985[ 7.711466]@2 MSM-CPP cpp_init_hardware:844 CPP HW Version: 0x60000000
986[ 7.711475]@2 MSM-CPP cpp_init_hardware:862 stream_cnt:0
987[ 7.719667]@2 __msm_jpeg_init:1537] Jpeg Device id 0
988synaptics,s3320: synaptics:enable the reset_gpio
989[ 7.721206]@2 __msm_jpeg_init:1537] Jpeg Device id 2
990__msm_jpeg_init:1537] Jpeg Device id 3
991msm_fd_hw_set_dt_parms_by_name: Error property does not exist
992[ 7.820055]@2 msm_fd aa4000.qcom,fd: Face detection halt timeout
993[ 7.822377]@0 SMBCHG: load_data: chip is NULL !
994[ 7.822773]@0 SMBCHG: load_data: chip is NULL !
995[ 7.822889]@0 FG: fg_probe: FG Probe success - FG Revision DIG:3.1 ANA:1.2 PMIC subtype=19
996[ 7.824760]@0 BQ: bq27541_battery_probe: probe sucdess
997[ 7.827694]@0 i2c-msm-v2 757a000.i2c: msm_bus_scale_register_client(mstr-id:86):0x19 (ok)
998BQ: check_bat_type: is_4p4v_bat=1,support_4p4v_bat=1
999[ 7.829579]@0 i2c-core: driver [bq27541-battery] using legacy suspend method
1000[ 7.829583]@0 i2c-core: driver [bq27541-battery] using legacy resume method
1001[ 7.830612]@0 FASTCHG: dash_probe: dash_probe
1002[ 7.840592]@1 i2c-msm-v2 75ba000.i2c: msm_bus_scale_register_client(mstr-id:84):0x1a (ok)
1003synaptics,s3320: F12_2D_QUERY_BASE = 47
1004 F12_2D_CMD_BASE = 0
1005 F12_2D_CTRL_BASE = 15
1006 F12_2D_DATA_BASE = 6
1007
1008synaptics,s3320: F01_RMI_QUERY_BASE = 2a
1009 F01_RMI_CMD_BASE = 25
1010 F01_RMI_CTRL_BASE = e
1011 F01_RMI_DATA_BASE = 4
1012
1013synaptics,s3320: F34_FLASH_QUERY_BASE = 26
1014 F34_FLASH_CMD_BASE = 0
1015 F34_FLASH_CTRL_BASE = a
1016 F34_FLASH_DATA_BASE = 0
1017
1018synaptics,s3320: F51_CUSTOM_QUERY_BASE = 3a
1019 F51_CUSTOM_CMD_BASE = 0
1020 F51_CUSTOM_CTRL_BASE = 1a
1021 F51_CUSTOM_DATA_BASE = 0
1022
1023synaptics,s3320: F54_QUERY_BASE = 47
1024 F54_CMD_BASE = 46
1025 F54_CTRL_BASE = e
1026 F54_DATA_BASE = 0
1027
1028synaptics,s3320: before fw update bootloader_mode[0x0]
1029[ 7.842769]@1 synaptics,s3320: CURRENT_FIRMWARE_ID = 0x15811001
1030[ 7.843182]@1 synaptics,s3320: 0synatpitcs_fw: fw_name = tp/fw_synaptics_15811.img,ts->manu_name:S350815811
1031[ 7.843477]@1 synaptics,s3320: synaptics_init_panel is called!
1032[ 7.843741]@1 synaptics,s3320: synaptics_mode_change: set TP to mode[0x80]
1033[ 7.845376]@1 synaptics,s3320: max_x = 1080,max_y = 1920; max_x_ic = 1079,max_y_ic = 1919
1034[ 7.845524]@1 synaptics,s3320: afte fw update,program memory self-check bootloader_mode = 0x0
1035[ 7.845979]@1 synaptics,s3320: synaptics_soft_reset !!!
1036[ 7.870039]@0 FASTCHG: dash_probe: dash_probe success
1037[ 7.872401]@0 unable to find DT imem DLOAD mode node
1038[ 7.874300]@0 unable to find DT imem EDLOAD mode node
1039[ 7.876275]@0 unable to find DT imem dload-type node
1040[ 7.877021]@0 set_dload_mode ON
1041[ 7.888730]@0 FG: fg_config_esr_extract: ESR extract is disabled
1042[ 7.916588]@0 device-mapper: uevent: version 1.0.3
1043[ 7.916780]@0 device-mapper: ioctl: 4.28.0-ioctl (2014-09-17) initialised: dm-devel@redhat.com
1044[ 7.916794]@0 device-mapper: req-crypt: dm-req-crypt successfully initalized.
1045
1046[ 7.917054]@0 sdhci: Secure Digital Host Controller Interface driver
1047[ 7.917058]@0 sdhci: Copyright(c) Pierre Ossman
1048[ 7.917062]@0 sdhci-pltfm: SDHCI platform and OF driver helper
1049[ 7.923150]@0 hidraw: raw HID events driver (C) Jiri Kosina
1050[ 7.923443]@0 usbcore: registered new interface driver usbhid
1051[ 7.923447]@0 usbhid: USB HID core driver
1052[ 7.923979]@0 ashmem: initialized
1053[ 7.924090]@0 logger: created 256K log 'log_main'
1054[ 7.924165]@0 logger: created 256K log 'log_events'
1055[ 7.924238]@0 logger: created 256K log 'log_radio'
1056[ 7.924310]@0 logger: created 256K log 'log_system'
1057[ 7.926968]@0 [mhi_init] Failed to create IPC logging context
1058[ 7.927530]@0 qpnp_coincell_charger_show_state: enabled=Y, voltage=3200 mV, resistance=2100 ohm
1059[ 7.935398]@2 bimc-bwmon 408000.qcom,cpu-bwmon: BW HWmon governor registered.
1060[ 7.936513]@2 arm-memlat-mon soc:qcom,arm-memlat-mon-0: Memory Latency governor registered.
1061[ 7.936558]@2 arm-memlat-mon soc:qcom,arm-memlat-mon-2: Memory Latency governor registered.
1062[ 7.938711]@2 m4m-hwmon 6530000.qcom,m4m-hwmon: Cache HWmon governor registered.
1063[ 7.942443]@2 devfreq soc:qcom,cpubw: Couldn't update frequency transition information.
1064[ 7.942568]@2 devfreq soc:qcom,mincpubw: Couldn't update frequency transition information.
1065[ 7.942684]@2 devfreq soc:qcom,memlat-cpu0: Couldn't update frequency transition information.
1066[ 7.942791]@2 devfreq soc:qcom,memlat-cpu2: Couldn't update frequency transition information.
1067[ 7.945042]@2 probe: Failed to create IPC log context
1068[ 7.946705]@2 otracer: initialized
1069[ 7.946812]@0 op_netlink_init
1070[ 7.946921]@0 usbcore: registered new interface driver snd-usb-audio
1071[ 7.950668]@2 tfa98xx_i2c_probe
1072[ 7.960794]@2 msm-dai-tdm soc:qcom,msm-dai-tdm-tert-rx: msm_dai_tdm_q6_probe: dev_name: soc:qcom,msm-dai-tdm-tert-rx group_id: 0x9120
1073[ 7.961083]@2 msm-dai-q6-tdm soc:qcom,msm-dai-tdm-tert-rx:qcom,msm-dai-q6-tdm-tert-rx-0: msm_dai_q6_tdm_dev_probe: dev_name: soc:qcom,msm-dai-tdm-tert-rx:qcom,msm-dai-q6-tdm-tert-rx-0 dev_id: 0x9020
1074[ 7.961091]@2 msm-dai-q6-tdm soc:qcom,msm-dai-tdm-tert-rx:qcom,msm-dai-q6-tdm-tert-rx-0: msm_dai_q6_tdm_dev_probe: Custom tdm header not supported
1075[ 7.961252]@2 msm-dai-q6-tdm soc:qcom,msm-dai-tdm-tert-rx:qcom,msm-dai-q6-tdm-tert-rx-1: msm_dai_q6_tdm_dev_probe: dev_name: soc:qcom,msm-dai-tdm-tert-rx:qcom,msm-dai-q6-tdm-tert-rx-1 dev_id: 0x9022
1076[ 7.961258]@2 msm-dai-q6-tdm soc:qcom,msm-dai-tdm-tert-rx:qcom,msm-dai-q6-tdm-tert-rx-1: msm_dai_q6_tdm_dev_probe: Custom tdm header not supported
1077[ 7.961413]@2 msm-dai-q6-tdm soc:qcom,msm-dai-tdm-tert-rx:qcom,msm-dai-q6-tdm-tert-rx-2: msm_dai_q6_tdm_dev_probe: dev_name: soc:qcom,msm-dai-tdm-tert-rx:qcom,msm-dai-q6-tdm-tert-rx-2 dev_id: 0x9024
1078[ 7.961420]@2 msm-dai-q6-tdm soc:qcom,msm-dai-tdm-tert-rx:qcom,msm-dai-q6-tdm-tert-rx-2: msm_dai_q6_tdm_dev_probe: Custom tdm header not supported
1079[ 7.961570]@2 msm-dai-q6-tdm soc:qcom,msm-dai-tdm-tert-rx:qcom,msm-dai-q6-tdm-tert-rx-3: msm_dai_q6_tdm_dev_probe: dev_name: soc:qcom,msm-dai-tdm-tert-rx:qcom,msm-dai-q6-tdm-tert-rx-3 dev_id: 0x9026
1080[ 7.961579]@2 msm-dai-q6-tdm soc:qcom,msm-dai-tdm-tert-rx:qcom,msm-dai-q6-tdm-tert-rx-3: msm_dai_q6_tdm_dev_probe: Custom tdm header not supported
1081[ 7.961601]@2 msm-dai-tdm soc:qcom,msm-dai-tdm-tert-tx: msm_dai_tdm_q6_probe: dev_name: soc:qcom,msm-dai-tdm-tert-tx group_id: 0x9121
1082[ 7.961751]@2 msm-dai-q6-tdm soc:qcom,msm-dai-tdm-tert-tx:qcom,msm-dai-q6-tdm-tert-tx-0: msm_dai_q6_tdm_dev_probe: dev_name: soc:qcom,msm-dai-tdm-tert-tx:qcom,msm-dai-q6-tdm-tert-tx-0 dev_id: 0x9021
1083[ 7.961757]@2 msm-dai-q6-tdm soc:qcom,msm-dai-tdm-tert-tx:qcom,msm-dai-q6-tdm-tert-tx-0: msm_dai_q6_tdm_dev_probe: Custom tdm header not supported
1084[ 7.961913]@2 msm-dai-q6-tdm soc:qcom,msm-dai-tdm-tert-tx:qcom,msm-dai-q6-tdm-tert-tx-1: msm_dai_q6_tdm_dev_probe: dev_name: soc:qcom,msm-dai-tdm-tert-tx:qcom,msm-dai-q6-tdm-tert-tx-1 dev_id: 0x9023
1085[ 7.961919]@2 msm-dai-q6-tdm soc:qcom,msm-dai-tdm-tert-tx:qcom,msm-dai-q6-tdm-tert-tx-1: msm_dai_q6_tdm_dev_probe: Data Align from DT file qcom,msm-cpudai-tdm-data-align
1086[ 7.961927]@2 msm-dai-q6-tdm: probe of soc:qcom,msm-dai-tdm-tert-tx:qcom,msm-dai-q6-tdm-tert-tx-1 failed with error -22
1087[ 7.962077]@2 msm-dai-q6-tdm soc:qcom,msm-dai-tdm-tert-tx:qcom,msm-dai-q6-tdm-tert-tx-2: msm_dai_q6_tdm_dev_probe: dev_name: soc:qcom,msm-dai-tdm-tert-tx:qcom,msm-dai-q6-tdm-tert-tx-2 dev_id: 0x9025
1088[ 7.962083]@2 msm-dai-q6-tdm soc:qcom,msm-dai-tdm-tert-tx:qcom,msm-dai-q6-tdm-tert-tx-2: msm_dai_q6_tdm_dev_probe: Data Align from DT file qcom,msm-cpudai-tdm-data-align
1089[ 7.962089]@2 msm-dai-q6-tdm: probe of soc:qcom,msm-dai-tdm-tert-tx:qcom,msm-dai-q6-tdm-tert-tx-2 failed with error -22
1090[ 7.962241]@2 msm-dai-q6-tdm soc:qcom,msm-dai-tdm-tert-tx:qcom,msm-dai-q6-tdm-tert-tx-3: msm_dai_q6_tdm_dev_probe: dev_name: soc:qcom,msm-dai-tdm-tert-tx:qcom,msm-dai-q6-tdm-tert-tx-3 dev_id: 0x9027
1091[ 7.962248]@2 msm-dai-q6-tdm soc:qcom,msm-dai-tdm-tert-tx:qcom,msm-dai-q6-tdm-tert-tx-3: msm_dai_q6_tdm_dev_probe: Custom tdm header not supported
1092[ 7.962272]@2 msm-dai-tdm soc:qcom,msm-dai-tdm-quat-rx: msm_dai_tdm_q6_probe: dev_name: soc:qcom,msm-dai-tdm-quat-rx group_id: 0x9130
1093[ 7.962423]@2 msm-dai-q6-tdm soc:qcom,msm-dai-tdm-quat-rx:qcom,msm-dai-q6-tdm-quat-rx-0: msm_dai_q6_tdm_dev_probe: dev_name: soc:qcom,msm-dai-tdm-quat-rx:qcom,msm-dai-q6-tdm-quat-rx-0 dev_id: 0x9030
1094[ 7.962429]@2 msm-dai-q6-tdm soc:qcom,msm-dai-tdm-quat-rx:qcom,msm-dai-q6-tdm-quat-rx-0: msm_dai_q6_tdm_dev_probe: Custom tdm header not supported
1095[ 7.962585]@2 msm-dai-q6-tdm soc:qcom,msm-dai-tdm-quat-rx:qcom,msm-dai-q6-tdm-quat-rx-1: msm_dai_q6_tdm_dev_probe: dev_name: soc:qcom,msm-dai-tdm-quat-rx:qcom,msm-dai-q6-tdm-quat-rx-1 dev_id: 0x9032
1096[ 7.962592]@2 msm-dai-q6-tdm soc:qcom,msm-dai-tdm-quat-rx:qcom,msm-dai-q6-tdm-quat-rx-1: msm_dai_q6_tdm_dev_probe: Custom tdm header not supported
1097[ 7.962746]@2 msm-dai-q6-tdm soc:qcom,msm-dai-tdm-quat-rx:qcom,msm-dai-q6-tdm-quat-rx-2: msm_dai_q6_tdm_dev_probe: dev_name: soc:qcom,msm-dai-tdm-quat-rx:qcom,msm-dai-q6-tdm-quat-rx-2 dev_id: 0x9034
1098[ 7.962752]@2 msm-dai-q6-tdm soc:qcom,msm-dai-tdm-quat-rx:qcom,msm-dai-q6-tdm-quat-rx-2: msm_dai_q6_tdm_dev_probe: Custom tdm header not supported
1099[ 7.962906]@2 msm-dai-q6-tdm soc:qcom,msm-dai-tdm-quat-rx:qcom,msm-dai-q6-tdm-quat-rx-3: msm_dai_q6_tdm_dev_probe: dev_name: soc:qcom,msm-dai-tdm-quat-rx:qcom,msm-dai-q6-tdm-quat-rx-3 dev_id: 0x9036
1100[ 7.962912]@2 msm-dai-q6-tdm soc:qcom,msm-dai-tdm-quat-rx:qcom,msm-dai-q6-tdm-quat-rx-3: msm_dai_q6_tdm_dev_probe: Custom tdm header not supported
1101[ 7.962932]@2 msm-dai-tdm soc:qcom,msm-dai-tdm-quat-tx: msm_dai_tdm_q6_probe: dev_name: soc:qcom,msm-dai-tdm-quat-tx group_id: 0x9131
1102[ 7.963083]@2 msm-dai-q6-tdm soc:qcom,msm-dai-tdm-quat-tx:qcom,msm-dai-q6-tdm-quat-tx-0: msm_dai_q6_tdm_dev_probe: dev_name: soc:qcom,msm-dai-tdm-quat-tx:qcom,msm-dai-q6-tdm-quat-tx-0 dev_id: 0x9031
1103[ 7.963089]@2 msm-dai-q6-tdm soc:qcom,msm-dai-tdm-quat-tx:qcom,msm-dai-q6-tdm-quat-tx-0: msm_dai_q6_tdm_dev_probe: Custom tdm header not supported
1104[ 7.963240]@2 msm-dai-q6-tdm soc:qcom,msm-dai-tdm-quat-tx:qcom,msm-dai-q6-tdm-quat-tx-1: msm_dai_q6_tdm_dev_probe: dev_name: soc:qcom,msm-dai-tdm-quat-tx:qcom,msm-dai-q6-tdm-quat-tx-1 dev_id: 0x9033
1105[ 7.963247]@2 msm-dai-q6-tdm soc:qcom,msm-dai-tdm-quat-tx:qcom,msm-dai-q6-tdm-quat-tx-1: msm_dai_q6_tdm_dev_probe: Custom tdm header not supported
1106[ 7.963399]@2 msm-dai-q6-tdm soc:qcom,msm-dai-tdm-quat-tx:qcom,msm-dai-q6-tdm-quat-tx-2: msm_dai_q6_tdm_dev_probe: dev_name: soc:qcom,msm-dai-tdm-quat-tx:qcom,msm-dai-q6-tdm-quat-tx-2 dev_id: 0x9035
1107[ 7.963406]@2 msm-dai-q6-tdm soc:qcom,msm-dai-tdm-quat-tx:qcom,msm-dai-q6-tdm-quat-tx-2: msm_dai_q6_tdm_dev_probe: Custom tdm header not supported
1108[ 7.963558]@2 msm-dai-q6-tdm soc:qcom,msm-dai-tdm-quat-tx:qcom,msm-dai-q6-tdm-quat-tx-3: msm_dai_q6_tdm_dev_probe: dev_name: soc:qcom,msm-dai-tdm-quat-tx:qcom,msm-dai-q6-tdm-quat-tx-3 dev_id: 0x9037
1109[ 7.963565]@2 msm-dai-q6-tdm soc:qcom,msm-dai-tdm-quat-tx:qcom,msm-dai-q6-tdm-quat-tx-3: msm_dai_q6_tdm_dev_probe: Custom tdm header not supported
1110[ 7.965891]@2 msm-compr-dsp soc:qcom,msm-compr-dsp: msm_compr_probe: dev name soc:qcom,msm-compr-dsp
1111[ 7.974636]@2 msm8996_populate_dai_link_component_of_node codec_name=tfa98xx.3-0036
1112[ 7.974931]@2 msm8996-asoc-snd soc:sound-9335: ASoC: platform (null) not registered
1113[ 7.976627]@2 GACT probability NOT on
1114[ 7.976638]@2 Mirror/redirect action on
1115[ 7.976652]@2 u32 classifier
1116[ 7.976653]@2 Actions configured
1117[ 7.976742]@2 TCP: cubic registered
1118[ 7.976747]@2 Initializing XFRM netlink socket
1119[ 7.976951]@2 NET: Registered protocol family 10
1120[ 7.977565]@2 mip6: Mobile IPv6
1121[ 7.977570]@2 sit: IPv6 over IPv4 tunneling driver
1122[ 7.977821]@2 NET: Registered protocol family 17
1123[ 7.977832]@2 NET: Registered protocol family 15
1124[ 7.977854]@2 bridge: automatic filtering via arp/ip/ip6tables has been deprecated. Update your scripts to load br_netfilter if you need this.
1125[ 7.977872]@2 l2tp_core: L2TP core driver, V2.0
1126[ 7.977880]@2 l2tp_ppp: PPPoL2TP kernel driver, V2.0
1127[ 7.977884]@2 l2tp_ip: L2TP IP encapsulation support (L2TPv3)
1128[ 7.977895]@2 l2tp_netlink: L2TP netlink interface
1129[ 7.977908]@2 l2tp_eth: L2TP ethernet pseudowire support (L2TPv3)
1130[ 7.977929]@2 l2tp_debugfs: L2TP debugfs support
1131[ 7.977932]@2 l2tp_ip6: L2TP IP encapsulation support for IPv6 (L2TPv3)
1132[ 7.978702]@2 NET: Registered protocol family 27
1133[ 7.978735]@2 IPC_RTR: ipc_router_create_log_ctx: Unable to create IPC logging for [local_IPCRTR]
1134kgsl kgsl-3d0: Initialized kgsl-3d0: mmu=on
1135[ 7.989423]@0 sps_register_bam_device : unable to create IPC Logging 0 for bam 0x0000000006b04000
1136sps_register_bam_device : unable to create IPC Logging 1 for bam 0x0000000006b04000
1137sps_register_bam_device : unable to create IPC Logging 2 for bam 0x0000000006b04000
1138sps_register_bam_device : unable to create IPC Logging 3 for bam 0x0000000006b04000
1139sps_register_bam_device : unable to create IPC Logging 4 for bam 0x0000000006b04000
1140sps:BAM 0x0000000006b04000 is registered.
1141qpnp-smbcharger qpnp-smbcharger-17: node /soc/qcom,spmi@400f000/qcom,pmi8994@2/qcom,qpnp-smbcharger IO resource absent!
1142[ 7.991066]@2 SMBCHG: qpnp_battery_temp_region_set: set temp_region = 5
1143[ 7.991147]@2 smbcharger_charger_otg: no parameters
1144[ 7.991255]@2 smbcharger_external_otg: no parameters
1145[ 7.991270]@2 smbcharger_external_otg: supplied by pmi8994_boost_5v
1146[ 7.991348]@2 SMBCHG: smbchg_hw_init: enable APSD
1147[ 7.991386]@2 SMBCHG: smbchg_hw_init: disabe HVDCP
1148[ 7.991578]@2 SMBCHG: smbchg_charging_en: enable=1
1149[ 7.991669]@2 SMBCHG: smbchg_charging_en: enable=1
1150[ 7.991689]@2 SMBCHG: smbchg_usb_suspend: suspend=0
1151[ 7.992058]@2 SMBCHG: smbchg_set_fastchg_current_raw: fastcharge current requested 500, set to 500
1152[ 8.020150]@0 SMBCHG: src_detect_handler: chip->usb_present = 0 usb_present = 1 src_detect = 1 hvdcp_3_det_ignore_uv=0
1153[ 8.020179]@0 SMBCHG: handle_usb_insertion: inserted type = 4 (SDP)
1154[ 8.020182]@0 SMBCHG: smbchg_charging_en: enable=1
1155[ 8.020203]@0 FG: oneplus_set_allow_read_iic: set allow read extern fg iic fail
1156[ 8.020208]@0 SMBCHG: smbchg_set_usb_current_max: USB current_ma = 500, typeC_support_current_ma = 4000
1157[ 8.020454]@1 synaptics,s3320: synaptics_tpedge_limitfunc limit_enable =1,mode:0x4b !
1158[ 8.020651]@1 synaptics,s3320: synaptics_input_init is called
1159[ 8.020754]@1 input: synaptics,s3320 as /devices/soc/75ba000.i2c/i2c-12/12-0020/input/input2
1160[ 8.035653]@2 msm-usb-ssphy-qmp 7410000.ssphy: QMP PHY initialization timeout
1161[ 8.035657]@2 msm-usb-ssphy-qmp 7410000.ssphy: USB3_PHY_PCS_STATUS:69696969
1162[ 8.035763]@2 msm-dwc3 6a00000.ssusb: dwc3_otg_sm_work line:3562 usage_count:1
1163[ 8.035776]@2 msm-dwc3 6a00000.ssusb: Not in P3,aborting LPM sequence
1164[ 8.035779]@2 msm-dwc3 6a00000.ssusb: dwc3_otg_sm_work line:3565 usage_count:0
1165[ 8.035889]@0 SMBCHG: handle_usb_insertion: inserted type = 4 (SDP)
1166[ 8.035893]@0 SMBCHG: smbchg_charging_en: enable=1
1167[ 8.035914]@0 FG: oneplus_set_allow_read_iic: set allow read extern fg iic fail
1168[ 8.036157]@0 SMBCHG: load_data: stored_soc[0xbf], shutdown_soc[95]
1169[ 8.036232]@0 SMBCHG: load_data: stored_soc[0xbf], shutdown_soc[95]
1170[ 8.036364]@0 oem_test_id ret:1, otg_switch:1, otg_state:1
1171[ 8.036368]@0 msm-dwc3 6a00000.ssusb: dwc3_otg_sm_work line:3608 usage_count:1
1172[ 8.036374]@0 msm-dwc3 6a00000.ssusb: dwc3_otg_start_peripheral line:3314 usage_count:2
1173[ 8.036481]@0 SMBCHG: smbchg_usb_update_online_work: chip->usb_online = -22, online = 1
1174[ 8.037475]@0 msm-dwc3 6a00000.ssusb: dwc3_otg_start_peripheral line:3341 usage_count:3
1175[ 8.037485]@0 oem_test_id ret:1, otg_switch:1, otg_state:3
1176[ 8.052912]@0 SMBCHG: load_data: stored_soc[0xbf], shutdown_soc[95]
1177[ 8.053222]@0 SMBCHG: load_data: stored_soc[0xbf], shutdown_soc[95]
1178[ 8.053277]@0 SMBCHG: load_data: stored_soc[0xbf], shutdown_soc[95]
1179[ 8.053350]@0 SMBCHG: load_data: stored_soc[0xbf], shutdown_soc[95]
1180[ 8.055808]@1 qpnp-smbcharger qpnp-smbcharger-17: node /soc/qcom,spmi@400f000/qcom,pmi8994@2/qcom,qpnp-smbcharger IO resource absent!
1181[ 8.055859]@1 SMBCHG: load_data: stored_soc[0xbf], shutdown_soc[95]
1182[ 8.056085]@0 SMBCHG: load_data: stored_soc[0xbf], shutdown_soc[95]
1183[ 8.056158]@0 SMBCHG: load_data: stored_soc[0xbf], shutdown_soc[95]
1184[ 8.056213]@0 SMBCHG: load_data: stored_soc[0xbf], shutdown_soc[95]
1185[ 8.056284]@0 SMBCHG: load_data: stored_soc[0xbf], shutdown_soc[95]
1186[ 8.057036]@0 qpnp-smbcharger qpnp-smbcharger-17: SMBCHG successfully probe Charger version=SCHG Revision DIG:2.0 ANA:2.1 batt=1 dc=0 usb=1
1187[ 8.058799]@0 msm8996_populate_dai_link_component_of_node codec_name=tfa98xx.3-0036
1188[ 8.058966]@0 SMBCHG: load_data: stored_soc[0xbf], shutdown_soc[95]
1189[ 8.059299]@0 msm8996-asoc-snd soc:sound-9335: ASoC: platform (null) not registered
1190[ 8.059781]@0 tusb320 7-0060: tusb320_probe
1191[ 8.060196]@0 i2c-msm-v2 75b5000.i2c: msm_bus_scale_register_client(mstr-id:84):0x22 (ok)
1192i2c-msm-v2 75b5000.i2c: NACK: slave not responding, ensure its powered: msgs(n:2 cur:0 tx) bc(rx:1 tx:1) mode:FIFO slv_addr:0x60 MSTR_STS:0x0d1300c8 OPER:0x00000010
1193[ 8.060335]@0 tusb320_read_reg:reg(0x0), ret(-107)
1194[ 8.060340]@0 tusb320 7-0060: DEV_ID(0x0)!= 0x30
1195[ 8.060352]@0 tusb320: probe of 7-0060 failed with error -22
1196[ 8.060408]@0 fusb301 7-0021: fusb301_probe
1197[ 8.060684]@0 fusb301 7-0021: fusb301_gpio_configure OK!
1198[ 8.061333]@0 fusb301 7-0021: fusb301_probe OK!
1199[ 8.061389]@0 ptn5150 7-001d: ptn5150_probe
1200[ 8.061444]@0 i2c-msm-v2 75b5000.i2c: NACK: slave not responding, ensure its powered: msgs(n:2 cur:0 tx) bc(rx:1 tx:1) mode:FIFO slv_addr:0x1d MSTR_STS:0x0d1300c8 OPER:0x00000010
1201[ 8.061467]@0 ptn5150_read_reg: i2c read error: -5
1202[ 8.061471]@0 ptn5150 7-001d: DEV_ID(0x00)!= 0x0b || 0x09
1203[ 8.061478]@0 ptn5150: probe of 7-001d failed with error -22
1204[ 8.062933]@0 msm8996_populate_dai_link_component_of_node codec_name=tfa98xx.3-0036
1205[ 8.063254]@0 msm8996-asoc-snd soc:sound-9335: ASoC: platform (null) not registered
1206[ 8.064055]@2 Creating CPU group 0
1207[ 8.064058]@2 Init CPU0 state
1208[ 8.064060]@2 Init CPU1 state
1209[ 8.064180]@0 Creating CPU group 2
1210[ 8.064186]@0 Init CPU2 state
1211[ 8.064188]@0 Init CPU3 state
1212[ 8.080046]@1 synaptics,s3320: synaptic:ts->irq is 414
1213[ 8.080494]@1 synaptics,s3320: enter reset tp status,and ts->in_gesture_mode is:0
1214[ 8.080498]@1 synaptics,s3320: synaptics_init_panel is called!
1215[ 8.080734]@1 synaptics,s3320: synaptics_mode_change: set TP to mode[0x80]
1216[ 8.085097]@2 Key type encrypted registered
1217[ 8.086962]@0 project_info_init_sysfs success
1218[ 8.097351]@1 msm8996_populate_dai_link_component_of_node codec_name=tfa98xx.3-0036
1219[ 8.097651]@1 msm8996-asoc-snd soc:sound-9335: ASoC: platform (null) not registered
1220[ 8.098247]@2 ngd_msm_ctrl 91c0000.slim: error creating ipc_logging context
1221[ 8.099278]@0 RNDIS_IPA module is loaded.
1222file system registered
1223[ 8.100145]@2 mbim_init: initialize 1 instances
1224[ 8.100183]@2 mbim_init: Initialized 1 ports
1225[ 8.100394]@1 msm8996_populate_dai_link_component_of_node codec_name=tfa98xx.3-0036
1226[ 8.100691]@1 msm8996-asoc-snd soc:sound-9335: ASoC: platform (null) not registered
1227[ 8.101259]@2 rndis_qc_init: initialize rndis QC instance
1228[ 8.101391]@2 Number of LUNs=8
1229[ 8.101397]@2 Mass Storage Function, version: 2009/09/11
1230[ 8.101400]@2 LUN: removable file: (no medium)
1231[ 8.101410]@2 Number of LUNs=1
1232[ 8.101440]@2 LUN: removable read only CD-ROM file: (no medium)
1233[ 8.101442]@2 Number of LUNs=1
1234[ 8.101591]@2 android_usb gadget: android_usb ready
1235[ 8.103196]@1 msm8996_populate_dai_link_component_of_node codec_name=tfa98xx.3-0036
1236[ 8.103515]@1 msm8996-asoc-snd soc:sound-9335: ASoC: platform (null) not registered
1237[ 8.103826]@2 input: gpio-keys as /devices/soc/soc:gpio_keys/input/input3
1238[ 8.105149]@1 msm8996_populate_dai_link_component_of_node codec_name=tfa98xx.3-0036
1239[ 8.105442]@1 msm8996-asoc-snd soc:sound-9335: ASoC: platform (null) not registered
1240[ 8.106038]@2 qcom,qpnp-rtc qpnp-rtc-8: setting system clock to 1970-01-24 22:55:22 UTC (2069722)
1241[ 8.107764]@2 SMBCHG: load_data: stored_soc[0xbf], shutdown_soc[95]
1242[ 8.108198]@1 msm8996_populate_dai_link_component_of_node codec_name=tfa98xx.3-0036
1243[ 8.108522]@1 msm8996-asoc-snd soc:sound-9335: ASoC: platform (null) not registered
1244[ 8.110520]@1 msm8996_populate_dai_link_component_of_node codec_name=tfa98xx.3-0036
1245[ 8.110596]@1 synaptics,s3320: synaptics_ts_probe: going to create files--tp_fw_update
1246[ 8.110722]@1 synaptics,s3320: synaptics_ts_probe 3203: normal end
1247[ 8.111014]@1 msm8996-asoc-snd soc:sound-9335: ASoC: platform (null) not registered
1248[ 8.113111]@0 msm8996_populate_dai_link_component_of_node codec_name=tfa98xx.3-0036
1249[ 8.113724]@0 msm8996-asoc-snd soc:sound-9335: ASoC: platform (null) not registered
1250[ 8.114305]@2 lmh_lite:lmh_parse_sensor Registering sensor:[DLMt_APC1]
1251[ 8.114554]@1 lmh_lite:lmh_parse_sensor Registering sensor:[LLM_cp00]
1252[ 8.114731]@0 lmh_lite:lmh_parse_sensor Registering sensor:[LLM_cp01]
1253[ 8.114891]@0 lmh_lite:lmh_parse_sensor Registering sensor:[LLM_cp10]
1254[ 8.115044]@0 lmh_lite:lmh_parse_sensor Registering sensor:[LLM_cp11]
1255[ 8.115200]@0 lmh_lite:lmh_parse_sensor Registering sensor:[LLM_m4m0]
1256[ 8.115350]@0 lmh_lite:lmh_parse_sensor Registering sensor:[LLM_l21-]
1257[ 8.115500]@0 lmh_lite:lmh_parse_sensor Registering sensor:[LLM_l20-]
1258[ 8.117685]@2 msm8996_populate_dai_link_component_of_node codec_name=tfa98xx.3-0036
1259[ 8.117973]@2 msm8996-asoc-snd soc:sound-9335: ASoC: platform (null) not registered
1260[ 8.119183]@0 parse_cpu_levels: idx 1 545
1261[ 8.119190]@0 parse_cpu_levels: idx 2 1785
1262[ 8.119192]@0 parse_cpu_levels: idx 2 3025
1263[ 8.119242]@0 parse_cpu_levels: idx 1 545
1264[ 8.119244]@0 parse_cpu_levels: idx 2 1785
1265[ 8.119246]@0 parse_cpu_levels: idx 2 3025
1266[ 8.127182]@0 msm8996_populate_dai_link_component_of_node codec_name=tfa98xx.3-0036
1267[ 8.127524]@0 msm8996-asoc-snd soc:sound-9335: ASoC: platform (null) not registered
1268[ 8.127775]@2 qcom,qpnp-flash-led qpnp-flash-led-25: Unable to acquire pinctrl
1269[ 8.129283]@2 rmnet_ipa started initialization
1270[ 8.129292]@2 IPA SSR support = True
1271[ 8.129300]@2 IPA ipa-loaduC = True
1272[ 8.129302]@2 IPA SG support = True
1273[ 8.129721]@0 msm8996_populate_dai_link_component_of_node codec_name=tfa98xx.3-0036
1274[ 8.130432]@0 msm8996-asoc-snd soc:sound-9335: ASoC: platform (null) not registered
1275[ 8.130897]@1 ipa ipa_sps_irq_control_all:932 EP (5) not allocated.
1276[ 8.130903]@1 ipa ipa_uc_state_check:296 uC is not loaded
1277[ 8.131661]@2 rmnet_ipa completed initialization
1278[ 8.132938]@0 msm8996_populate_dai_link_component_of_node codec_name=tfa98xx.3-0036
1279[ 8.133293]@0 msm8996-asoc-snd soc:sound-9335: ASoC: platform (null) not registered
1280[ 8.135343]@2 qcom,cc-debug-8996 362000.qcom,cc-debug: Registered debug mux.
1281[ 8.136578]@0 msm8996_populate_dai_link_component_of_node codec_name=tfa98xx.3-0036
1282[ 8.136775]@2 rome_vreg: disabling
1283[ 8.136779]@2 gdsc_mmagic_bimc: disabling
1284[ 8.136813]@2 kryo1-retention: disabling
1285[ 8.136816]@2 kryo0-retention: disabling
1286[ 8.136818]@2 gfx_mem_acc_corner: disabling
1287[ 8.136820]@2 apcc_l3_mem_acc_corner: disabling
1288[ 8.136822]@2 apc1_perfcl_mem_acc_corner: disabling
1289[ 8.136824]@2 apc0_pwrcl_mem_acc_corner: disabling
1290[ 8.136829]@2 regulator_proxy_consumer_remove_all: removing regulator proxy consumer requests
1291[ 8.136897]@0 msm8996-asoc-snd soc:sound-9335: ASoC: platform (null) not registered
1292[ 8.137073]@2 clock_late_init: Removing enables held for handed-off clocks
1293[ 8.140483]@2 ALSA device list:
1294[ 8.140486]@2 No soundcards found.
1295[ 8.180381]@1 i2c-msm-v2 75b6000.i2c: msm_bus_scale_register_client(mstr-id:84):0x24 (ok)
1296touchkey,s1302: product id is s1302
1297[ 8.181269]@1 touchkey,s1302: F11_2D_QUERY_BASE = 95
1298 F11_2D_CMD_BASE = 6e
1299 F11_2D_CTRL_BASE = 3d
1300 F11_2D_DATA_BASE = 15
1301
1302touchkey,s1302: CURRENT_FIRMWARE_ID = 0x4
1303[ 8.182715]@1 touchkey,s1302: before fw update,bootloader_mode = 0x0
1304[ 8.182826]@1 input: HWK,synaptics,s1302 as /devices/soc/75b6000.i2c/i2c-8/8-0020/input/input4
1305[ 8.240068]@0 get_param_by_index_and_offset[75] sid_index = 7 offset = 24 buf = ffffffc0b50e3d20 length = 4
1306[ 8.240075]@0 SMBCHG: charger_type_record: charger_type_record: charger_type_record: param_value = 1|0|0,dash_on=124,dash_present=0
1307[ 8.240078]@0 set_param_by_index_and_offset[99]sid_index = 7 offset = 688 buf = ffffffc0b50e3d48 length = 4
1308[ 8.240098]@0 open file /dev/block/bootdevice/by-name/param failed.(-2)
1309[ 8.240101]@0 Error write param partition.(-2)
1310[ 8.240103]@0 set_param_charger_type_value[882] failed!
1311[ 8.240105]@0 set_param_by_index_and_offset[99]sid_index = 7 offset = 692 buf = ffffffc0b50e3d4c length = 4
1312[ 8.240114]@0 open file /dev/block/bootdevice/by-name/param failed.(-2)
1313[ 8.240116]@0 Error write param partition.(-2)
1314[ 8.240118]@0 set_param_charger_type_value[882] failed!
1315[ 8.240120]@0 set_param_by_index_and_offset[99]sid_index = 7 offset = 696 buf = ffffffc0b50e3d50 length = 4
1316[ 8.240128]@0 open file /dev/block/bootdevice/by-name/param failed.(-2)
1317[ 8.240130]@0 Error write param partition.(-2)
1318[ 8.240132]@0 set_param_charger_type_value[882] failed!
1319[ 8.240134]@0 set_param_by_index_and_offset[99]sid_index = 7 offset = 700 buf = ffffffc0b50e3d54 length = 4
1320[ 8.240142]@0 open file /dev/block/bootdevice/by-name/param failed.(-2)
1321[ 8.240144]@0 Error write param partition.(-2)
1322[ 8.240146]@0 set_param_charger_type_value[882] failed!
1323[ 8.240148]@0 set_param_by_index_and_offset[99]sid_index = 7 offset = 704 buf = ffffffc0b50e3d58 length = 4
1324[ 8.240156]@0 open file /dev/block/bootdevice/by-name/param failed.(-2)
1325[ 8.240158]@0 Error write param partition.(-2)
1326[ 8.240160]@0 set_param_charger_type_value[882] failed!
1327[ 8.240162]@0 set_param_by_index_and_offset[99]sid_index = 7 offset = 24 buf = ffffffc0b50e3d20 length = 4
1328[ 8.240170]@0 open file /dev/block/bootdevice/by-name/param failed.(-2)
1329[ 8.240172]@0 Error write param partition.(-2)
1330[ 8.240173]@0 set_param_charger_type_count[867] failed!
1331[ 8.280039]@1 touchkey,s1302: synaptic:ts->irq is 421
1332[ 8.280165]@1 touchkey,s1302: touchkey using poll status:0
1333[ 8.280431]@1 touchkey,s1302: synaptics_soft_reset !!!
1334[ 8.280460]@1 touchkey,s1302: create nodes is successe!
1335[ 8.280529]@1 touchkey,s1302: synaptics_ts_probe s1302: normal end
1336[ 8.280531]@1 touchkey,s1302: boot_time: synaptics_ts_probe return 0
1337[ 8.827977]@0 BQ: bq27541_hw_config: DEVICE_TYPE is 0x541, FIRMWARE_VERSION is 0x200
1338[ 8.827984]@0 BQ: bq27541_hw_config: Complete bq27541 configuration 0x604B
1339[ 9.413893]@0 of_batterydata_get_best_profile: itech_3000mah found
1340[ 9.419059]@0 SMBCHG: smbchg_charging_en: enable=0
1341[ 10.270661]@2 Freeing unused kernel memory: 452K (ffffffc000fb6000 - ffffffc001027000)
1342[ 10.277553]@2 Freeing alternatives memory: 28K (ffffffc001027000 - ffffffc00102e000)
1343[ 10.300171]@2 init: init started!
1344[ 10.302699]@2 SELinux: security_load_policy, ss_initialized: 0
1345[ 10.311835]@2 SELinux: Permission audit_read in class capability2 not defined in policy.
1346[ 10.318988]@2 SELinux: the above unknown classes and permissions will be denied
1347[ 10.360086]@2 SELinux: security_load_policy, sidtab.shutdown: 0
1348[ 10.368454]@2 audit: type=1403 audit(2069724.749:2): policy loaded auid=4294967295 ses=4294967295
1349[ 10.376673]@2 init: (Initializing SELinux non-enforcing took 0.07s.)
1350[ 10.385389]@2 init: init second stage started!
1351[ 10.389027]@2 init: property_set("ro.boot.bootdevice", "624000.ufshc") failed
1352[ 10.767623]@2 init: waitpid failed: No child processes
1353[ 10.772011]@2 init: (Loading properties from /default.prop took 0.00s.)
1354[ 10.778616]@2 init: /init.rc: 62: invalid command 'load_all_props'
1355[ 10.784568]@2 init: could not import file '/init.recovery.logd.rc' from '/init.rc'
1356[ 10.792118]@2 init: (Parsing /init.recovery.usb.rc took 0.00s.)
1357[ 10.797979]@2 init: (Parsing /init.recovery.service.rc took 0.00s.)
1358[ 10.804251]@2 init: (Parsing /init.recovery.qcom.rc took 0.00s.)
1359[ 10.810209]@2 init: (Parsing /init.rc took 0.03s.)
1360[ 10.815026]@2 audit: type=1400 audit(2069725.199:3): avc: denied { setcheckreqprot } for pid=1 comm="init" scontext=u:r:init:s0 tcontext=u:object_r:kernel:s0 tclass=security permissive=1
1361[ 10.831873]@2 audit: type=1400 audit(2069725.219:4): avc: denied { setcurrent } for pid=1 comm="init" scontext=u:r:init:s0 tcontext=u:r:init:s0 tclass=process permissive=1
1362[ 10.847368]@2 audit: type=1400 audit(2069725.229:5): avc: denied { dyntransition } for pid=1 comm="init" scontext=u:r:init:s0 tcontext=u:r:init:s0 tclass=process permissive=1
1363[ 10.863217]@2 init: SELinux: Could not get canonical path /postinstall restorecon: No such file or directory.
1364[ 10.873074]@2 init: Starting service 'ueventd'...
1365[ 10.877881]@2 init: Starting service 'healthd'...
1366[ 10.879041]@3 ueventd: ueventd started!
1367[ 10.886426]@2 init: Waiting for /dev/.coldboot_done...
1368[ 11.105203]@2 BQ: bq27541_battery_soc: bq27541_battery_soc = 95
1369[ 11.106084]@3 BQ: bq27541_battery_soc: bq27541_battery_soc = 95
1370[ 11.106105]@3 SMBCHG: load_data: stored_soc[0xbf], shutdown_soc[95]
1371[ 11.106108]@3 BQ: fg_soc_calibrate: soc=95, soc_load=95
1372[ 11.410199]@0 of_batterydata_get_best_profile: itech_3000mah found
1373[ 11.421009]@0 SMBCHG: smbchg_charging_en: enable=1
1374[ 11.432287]@0 FG: fg_batt_profile_init: Battery SOC: 100, V: 4273046uV
1375[ 11.789791]@3 ueventd: Coldboot took 0.91s.
1376[ 11.790713]@1 init: Waiting for /dev/.coldboot_done took 0.90s.
1377[ 11.811102]@1 functions_store: android_usb: functions_store'mtp,adb'
1378[ 11.817734]@1 init: (Loading properties from /system/build.prop took 0.00s.)
1379[ 11.823860]@2 init: (Loading properties from /vendor/build.prop took 0.00s.)
1380[ 11.830807]@2 init: (Loading properties from /factory/factory.prop took 0.00s.)
1381[ 11.843257]@2 init: (Loading properties from /data/local.prop took 0.00s.)
1382[ 11.849112]@2 init: Unable to open persistent property directory "/data/property": No such file or directory
1383[ 11.859217]@2 init: Starting service 'set_permissive'...
1384[ 11.864371]@2 init: Starting service 'recovery'...
1385[ 11.869771]@2 enable_store: android_usb: already disabled
1386[ 11.873134]@1 audit: type=1400 audit(2069726.259:6): avc: denied { write } for pid=422 comm="setenforce" name="enforce" dev="selinuxfs" ino=4 scontext=u:r:recovery:s0 tcontext=u:object_r:selinuxfs:s0 tclass=file permissive=1
1387[ 11.894928]@2 init: avc: denied { set } for property=twrp.crash_counter scontext=u:r:recovery:s0 tcontext=u:object_r:default_prop:s0 tclass=property_service
1388[ 11.908815]@2 init: Service 'set_permissive' (pid 421) exited with status 0
1389[ 11.915732]@2 functions_store: android_usb: functions_store'mtp,adb'
1390[ 11.922024]@2 init: Starting service 'adbd'...
1391[ 11.926564]@2 init: Service 'adbd' is being killed...
1392[ 11.928611]@1 ep0_open success!
1393[ 11.928625]@1 read descriptors
1394[ 11.928631]@1 read strings
1395[ 11.933943]@0 mdss_dsi_on start
1396[ 11.933950]@0 get_param_by_index_and_offset[75] sid_index = 2 offset = 32 buf = ffffffc1749acec8 length = 4
1397[ 11.933954]@0 mdss_dsi_on:srgb mode 0
1398[ 11.933957]@0 get_param_by_index_and_offset[75] sid_index = 2 offset = 36 buf = ffffffc1749acf30 length = 4
1399[ 11.933960]@0 mdss_dsi_on:srgb mode 0
1400[ 11.933961]@0 get_param_by_index_and_offset[75] sid_index = 2 offset = 40 buf = ffffffc1749acf98 length = 4
1401[ 11.933965]@0 mdss_dsi_on:srgb mode 0
1402[ 11.933968]@0 mdss_dsi_on end
1403[ 11.987105]@2 init: Service 'adbd' (pid 425) killed by signal 9
1404[ 11.992608]@2 init: Service 'adbd' (pid 425) killing any children in process group
1405[ 12.164865]@0 mdss_dsi_off start
1406[ 12.202700]@2 mdss_dsi_on start
1407[ 12.239090]@0 mdss_dsi_on end
1408[ 12.265033]@0 Start read the lcd register value
1409[ 12.269948]@0 rx_buf.data[0]=a0
1410[ 12.272367]@0 rx_buf.data[1]=2
1411[ 12.275127]@0 rx_buf.data[2]=4
1412[ 12.278164]@0 rx_buf.data[3]=3b
1413[ 12.281364]@0 rx_buf.data[4]=c7
1414[ 12.284417]@0 rx_buf.data[5]=12
1415[ 12.287538]@0 rx_buf.data[6]=8
1416[ 12.290739]@0 rx_buf.data[7]=7
1417[ 12.293626]@0 rx_buf.data[8]=a8
1418[ 12.296729]@0 rx_buf.data[9]=4b
1419[ 12.300665]@0 --------backlight level = 127---------
1420[ 12.332230]@2 blank off start
1421[ 12.332238]@2 fpc1020 soc:fpc_fpc1020: fb_notifier_callback screen off
1422[ 12.332262]@2 synaptics,s3320: fb_notifier_callback blank[4],event[0x10]
1423[ 12.332265]@2 synaptics,s3320: fb_notifier_callback : going TP suspend start
1424[ 12.332270]@2 synaptics,s3320: synaptics_ts_suspend enter
1425[ 12.332279]@2 synaptics,s3320: synaptics_ts_suspend normal end
1426[ 12.332280]@2 synaptics,s3320: fb_notifier_callback : going TP suspend end
1427[ 12.332322]@2 --------backlight level = 0---------
1428[ 12.340133]@0 switch_dev_work ,tristatekey set to state(1)
1429[ 12.535948]@0 mdss_dsi_off start
1430[ 12.565515]@0 synaptics,s3320: fb_notifier_callback blank[4],event[0x9]
1431[ 12.566704]@0 blank off end
1432[ 12.629883]@2 blank on start
1433[ 12.629914]@2 fpc1020 soc:fpc_fpc1020: fb_notifier_callback screen on
1434[ 12.630268]@2 synaptics,s3320: fb_notifier_callback blank[0],event[0x10]
1435[ 12.630307]@2 synaptics,s3320: fb_notifier_callback going TP resume start
1436[ 12.630328]@2 synaptics,s3320: synaptics_ts_resume enter!
1437[ 12.630371]@2 synaptics,s3320: synaptics_ts_resume:normal end!
1438[ 12.630375]@2 synaptics,s3320: fb_notifier_callback going TP resume end
1439[ 12.631738]@0 mdss_dsi_on start
1440[ 12.640060]@1 synaptics,s3320: tp_baseline_get start!
1441[ 12.664290]@0 mdss_dsi_on end
1442[ 12.671463]@2 sps: BAM device 0x0000000007584000 is not registered yet.
1443[ 12.671496]@2 sps_register_bam_device : unable to create IPC Logging 0 for bam 0x0000000007584000
1444sps_register_bam_device : unable to create IPC Logging 1 for bam 0x0000000007584000
1445sps_register_bam_device : unable to create IPC Logging 2 for bam 0x0000000007584000
1446sps_register_bam_device : unable to create IPC Logging 3 for bam 0x0000000007584000
1447sps_register_bam_device : unable to create IPC Logging 4 for bam 0x0000000007584000
1448sps:BAM 0x0000000007584000 is registered.
1449sps:BAM 0x0000000007584000 (va:0xffffff8006600000) enabled: ver:0x19, number of pipes:24
1450[ 12.685513]@0 Start read the lcd register value
1451[ 12.685849]@0 rx_buf.data[0]=a0
1452[ 12.685851]@0 rx_buf.data[1]=2
1453[ 12.685853]@0 rx_buf.data[2]=4
1454[ 12.685855]@0 rx_buf.data[3]=3b
1455[ 12.685856]@0 rx_buf.data[4]=c7
1456[ 12.685858]@0 rx_buf.data[5]=12
1457[ 12.685859]@0 rx_buf.data[6]=8
1458[ 12.685861]@0 rx_buf.data[7]=7
1459[ 12.685862]@0 rx_buf.data[8]=a8
1460[ 12.685864]@0 rx_buf.data[9]=4b
1461[ 12.686620]@0 --------backlight level = 127---------
1462[ 12.687752]@0 synaptics,s3320: fb_notifier_callback blank[0],event[0x9]
1463[ 12.687758]@0 BQ: bq27541_set_lcd_off_status: off=0
1464[ 12.687992]@0 blank on end
1465[ 12.730457]@1 synaptics,s3320: enter reset tp status,and ts->in_gesture_mode is:0
1466[ 12.730467]@1 synaptics,s3320: synaptics_init_panel is called!
1467[ 12.730747]@1 synaptics,s3320: synaptics_mode_change: set TP to mode[0x80]
1468[ 12.800571]@0 synaptics,s3320: synaptics_tpedge_limitfunc limit_enable =1,mode:0x4b !
1469[ 12.800965]@0 synaptics,s3320: tp_baseline_get end!
1470[ 12.914086]@3 blank off start
1471[ 12.914093]@3 fpc1020 soc:fpc_fpc1020: fb_notifier_callback screen off
1472[ 12.914115]@3 synaptics,s3320: fb_notifier_callback blank[4],event[0x10]
1473[ 12.914118]@3 synaptics,s3320: fb_notifier_callback : going TP suspend start
1474[ 12.914123]@3 synaptics,s3320: synaptics_ts_suspend enter
1475[ 12.914132]@3 synaptics,s3320: synaptics_ts_suspend normal end
1476[ 12.914133]@3 synaptics,s3320: fb_notifier_callback : going TP suspend end
1477[ 12.914170]@3 --------backlight level = 0---------
1478[ 13.060238]@0 SMBCHG: smbchg_re_det_chg_type: Re-detect charger type
1479[ 13.060272]@0 SMBCHG: smbchg_set_usb_current_max: USB current_ma = 300, typeC_support_current_ma = 4000
1480[ 13.060360]@0 SMBCHG: smbchg_re_det_chg_type: Faking Removal
1481[ 13.060617]@2 SMBCHG: usbin_uv_handler: triggered
1482[ 13.060656]@2 SMBCHG: usbin_uv_handler: chip->usb_present = 1 rt_sts = 0x01 hvdcp_3_det_ignore_uv = 0 aicl = 1500
1483[ 13.060683]@3 SMBCHG: src_detect_handler: chip->usb_present = 1 usb_present = 0 src_detect = 0 hvdcp_3_det_ignore_uv=0
1484[ 13.060751]@3 SMBCHG: handle_usb_removal: triggered
1485[ 13.061666]@3 SMBCHG: smbchg_usb_update_online_work: chip->usb_online = 1, online = 0
1486[ 13.148324]@1 mdss_dsi_off start
1487[ 13.176753]@0 synaptics,s3320: fb_notifier_callback blank[4],event[0x9]
1488[ 13.176795]@0 BQ: bq27541_set_lcd_off_status: off=1
1489[ 13.177882]@0 BQ: bq27541_set_lcd_off_status: lcd_off_delt_soc:0,soc=95,soc_pre=95
1490[ 13.178611]@0 blank off end
1491[ 13.180626]@1 msm-dwc3 6a00000.ssusb: dwc3_otg_start_peripheral line:3314 usage_count:2
1492[ 13.180716]@1 msm-dwc3 6a00000.ssusb: dwc3_otg_start_peripheral line:3341 usage_count:3
1493[ 13.180751]@1 msm-dwc3 6a00000.ssusb: dwc3_otg_sm_work line:3646 usage_count:2
1494[ 13.180793]@1 android_work: android_work: did not send uevent (0 0 (null))
1495[ 13.180829]@1 oem_test_id ret:1, otg_switch:1, otg_state:1
1496[ 13.180867]@1 msm-dwc3 6a00000.ssusb: dwc3_otg_sm_work line:3625 usage_count:1
1497[ 13.181542]@1 msm-dwc3 6a00000.ssusb: DWC3 in low power mode. irq:730 status:1
1498[ 13.359226]@3 blank on start
1499[ 13.359235]@3 fpc1020 soc:fpc_fpc1020: fb_notifier_callback screen on
1500[ 13.359254]@3 synaptics,s3320: fb_notifier_callback blank[0],event[0x10]
1501[ 13.359258]@3 synaptics,s3320: fb_notifier_callback going TP resume start
1502[ 13.359261]@3 synaptics,s3320: synaptics_ts_resume enter!
1503[ 13.359279]@3 synaptics,s3320: synaptics_ts_resume:normal end!
1504[ 13.359281]@3 synaptics,s3320: fb_notifier_callback going TP resume end
1505[ 13.360142]@1 synaptics,s3320: tp_baseline_get start!
1506[ 13.361075]@2 mdss_dsi_on start
1507[ 13.394056]@0 mdss_dsi_on end
1508[ 13.417293]@0 Start read the lcd register value
1509[ 13.418526]@0 rx_buf.data[0]=a0
1510[ 13.418543]@0 rx_buf.data[1]=2
1511[ 13.418556]@0 rx_buf.data[2]=4
1512[ 13.418566]@0 rx_buf.data[3]=3b
1513[ 13.418577]@0 rx_buf.data[4]=c7
1514[ 13.418587]@0 rx_buf.data[5]=12
1515[ 13.418598]@0 rx_buf.data[6]=8
1516[ 13.418608]@0 rx_buf.data[7]=7
1517[ 13.418617]@0 rx_buf.data[8]=a8
1518[ 13.418628]@0 rx_buf.data[9]=4b
1519[ 13.420857]@0 --------backlight level = 127---------
1520[ 13.420973]@1 synaptics,s3320: enter reset tp status,and ts->in_gesture_mode is:0
1521[ 13.420998]@1 synaptics,s3320: synaptics_init_panel is called!
1522[ 13.421457]@1 synaptics,s3320: synaptics_mode_change: set TP to mode[0x80]
1523[ 13.422472]@0 synaptics,s3320: fb_notifier_callback blank[0],event[0x9]
1524[ 13.422497]@0 BQ: bq27541_set_lcd_off_status: off=0
1525[ 13.423051]@0 blank on end
1526[ 13.500503]@1 synaptics,s3320: synaptics_tpedge_limitfunc limit_enable =1,mode:0x4b !
1527[ 13.500850]@1 synaptics,s3320: tp_baseline_get end!
1528[ 13.570148]@0 SMBCHG: smbchg_re_det_chg_type: Faking Insertion
1529[ 13.575180]@3 SMBCHG: usbin_uv_handler: triggered
1530[ 13.579677]@3 SMBCHG: usbin_uv_handler: chip->usb_present = 0 rt_sts = 0x00 hvdcp_3_det_ignore_uv = 0 aicl = 1500
1531[ 13.612003]@3 audit: type=1400 audit(2069727.999:7): avc: denied { write } for pid=423 comm="recovery" name="etc" dev="rootfs" ino=7926 scontext=u:r:recovery:s0 tcontext=u:object_r:rootfs:s0 tclass=dir permissive=1
1532[ 13.630283]@3 audit: type=1400 audit(2069728.019:8): avc: denied { add_name } for pid=423 comm="recovery" name="mtab" scontext=u:r:recovery:s0 tcontext=u:object_r:rootfs:s0 tclass=dir permissive=1
1533[ 13.647989]@3 audit: type=1400 audit(2069728.029:9): avc: denied { create } for pid=423 comm="recovery" name="mtab" scontext=u:r:recovery:s0 tcontext=u:object_r:rootfs:s0 tclass=lnk_file permissive=1
1534[ 13.666389]@3 audit: type=1400 audit(2069728.049:10): avc: denied { create } for pid=423 comm="recovery" name="firmware" scontext=u:r:recovery:s0 tcontext=u:object_r:rootfs:s0 tclass=dir permissive=1
1535[ 13.927711]@1 audit: type=1400 audit(2069728.309:11): avc: denied { mounton } for pid=423 comm="recovery" path="/cache" dev="rootfs" ino=6691 scontext=u:r:recovery:s0 tcontext=u:object_r:cache_file:s0 tclass=dir permissive=1
1536[ 13.957732]@1 EXT4-fs (sda3): mounted filesystem with ordered data mode. Opts:
1537[ 13.978258]@1 EXT4-fs (sde20): mounted filesystem with ordered data mode. Opts:
1538[ 14.425020]@3 SMBCHG: src_detect_handler: chip->usb_present = 0 usb_present = 1 src_detect = 1 hvdcp_3_det_ignore_uv=0
1539[ 14.434884]@3 SMBCHG: handle_usb_insertion: inserted type = 4 (SDP)
1540[ 14.434911]@0 SMBCHG: smbchg_set_usb_current_max: USB current_ma = 1800, typeC_support_current_ma = 4000
1541[ 14.435033]@0 SMBCHG: smbchg_rerun_aicl: Rerunning AICL...
1542[ 14.455957]@3 SMBCHG: smbchg_charging_en: enable=1
1543[ 14.490276]@3 SMBCHG: smbchg_set_usb_current_max: USB current_ma = 500, typeC_support_current_ma = 4000
1544[ 14.499025]@3 SMBCHG: smbchg_usb_update_online_work: chip->usb_online = 0, online = 1
1545[ 14.610349]@1 oem_test_id ret:1, otg_switch:1, otg_state:1
1546[ 14.614845]@1 msm-dwc3 6a00000.ssusb: dwc3_otg_sm_work line:3608 usage_count:0
1547[ 14.666327]@1 msm-usb-ssphy-qmp 7410000.ssphy: QMP PHY initialization timeout
1548[ 14.672484]@1 msm-usb-ssphy-qmp 7410000.ssphy: USB3_PHY_PCS_STATUS:69696969
1549[ 14.679654]@1 msm-dwc3 6a00000.ssusb: DWC3 exited from low power mode. irq:730 status:1
1550[ 14.687380]@1 msm-dwc3 6a00000.ssusb: dwc3_otg_start_peripheral line:3314 usage_count:1
1551[ 14.690073]@3 get_param_by_index_and_offset[75] sid_index = 7 offset = 24 buf = ffffffc175e37d20 length = 4
1552[ 14.690079]@3 SMBCHG: charger_type_record: charger_type_record: charger_type_record: param_value = 1|0|1,dash_on=124,dash_present=0
1553[ 14.690083]@3 set_param_by_index_and_offset[99]sid_index = 7 offset = 708 buf = ffffffc175e37d48 length = 4
1554[ 14.692366]@3 set_param_by_index_and_offset[99]sid_index = 7 offset = 712 buf = ffffffc175e37d4c length = 4
1555[ 14.692814]@3 set_param_by_index_and_offset[99]sid_index = 7 offset = 716 buf = ffffffc175e37d50 length = 4
1556[ 14.693261]@3 set_param_by_index_and_offset[99]sid_index = 7 offset = 720 buf = ffffffc175e37d54 length = 4
1557[ 14.693707]@3 set_param_by_index_and_offset[99]sid_index = 7 offset = 724 buf = ffffffc175e37d58 length = 4
1558[ 14.694146]@3 set_param_by_index_and_offset[99]sid_index = 7 offset = 24 buf = ffffffc175e37d20 length = 4
1559[ 14.751126]@0 random: nonblocking pool is initialized
1560[ 14.781682]@1 msm-dwc3 6a00000.ssusb: dwc3_otg_start_peripheral line:3341 usage_count:2
1561[ 14.788656]@1 oem_test_id ret:1, otg_switch:1, otg_state:3
1562[ 15.424181]@3 mtp_open
1563[ 16.120185]@1 synap rmidev_create_attr
1564[ 16.300498]@1 synap rmidev_create_attr
1565[ 16.626687]@0 init: Starting service 'adbd'...
1566[ 16.640130]@3 ep0_open success!
1567[ 16.642323]@3 read descriptors
1568[ 16.645347]@3 read strings
1569[ 16.648094]@3 mtp_bind_config
1570[ 16.651066]@3 mtp_create_bulk_endpoints: useFixAddr:false
1571[ 16.808839]@0 android_work: android_work: sent uevent USB_STATE=CONNECTED
1572[ 16.830316]@0 SMBCHG: notify_usb_enumeration_function: status=1
1573[ 16.858076]@0 android_usb gadget: high-speed config #1: 66bf0c8.android_usb
1574[ 16.864302]@0 usb_gadget_vbus_draw USB setting current is 500mA
1575[ 16.869961]@0 msm-dwc3 6a00000.ssusb: Avail curr from USB = 500
1576[ 16.881796]@0 SMBCHG: set_chg_ibat_vbat_max: vote ibatmax = 1910 and set vbatmax = 4370
1577[ 16.888888]@0 SMBCHG: smbchg_set_fastchg_current_raw: fastcharge current requested 1910, set to 1900
1578[ 16.898840]@0 SMBCHG: qpnp_battery_temp_region_set: set temp_region = 5
1579[ 16.904637]@0 SMBCHG: smbchg_external_power_changed: change usb_target_current_ma = 500
1580[ 16.930098]@0 android_work: android_work: sent uevent USB_STATE=CONFIGURED
1581[19700124_22:55:33.469262]@0 SMBCHG: update_heartbeat: inserted charger type = 4 (SDP), charger_type = 4
1582[19700124_22:55:33.484487]@0 SMBCHG: update_heartbeat: charger_type:4,bat_voltage:4290,charger_voltage:4749,current:-277,temp:216,capacity:95
1583[19700124_22:55:49.407904]@1 synaptics,s3320: start get base data:1
1584[19700124_22:55:49.412896]@1 synaptics,s3320: tp_baseline_get start!
1585[19700124_22:55:49.540922]@0 synaptics,s3320: synaptics_tpedge_limitfunc limit_enable =1,mode:0x4b !
1586[19700124_22:55:49.549181]@0 synaptics,s3320: tp_baseline_get end!
1587[19700124_22:55:49.557006]@1 synaptics,s3320: enter reset tp status,and ts->in_gesture_mode is:0
1588[19700124_22:55:49.564612]@1 synaptics,s3320: synaptics_init_panel is called!
1589[19700124_22:55:49.572864]@1 synaptics,s3320: synaptics_mode_change: set TP to mode[0x80]
1590[19700124_22:56:10.304875]@1 synaptics,s3320: all finger up
1591[19700124_22:56:13.090958]@3 EXT4-fs (sde20): mounted filesystem with ordered data mode. Opts:
1592[19700124_22:56:13.107652]@3 EXT4-fs (sde20): mounted filesystem with ordered data mode. Opts:
1593[19700124_22:56:13.540500]@0 active wakeup source: chg_wake_lock
1594[19700124_22:56:13.545257]@0 active wakeup source: 6a00000.ssusb
1595[19700124_22:56:15.260552]@3 audit_printk_skb: 45 callbacks suppressed
1596[19700124_22:56:15.265786]@3 audit: type=1400 audit(2069775.259:27): avc: denied { write } for pid=423 comm="recovery" name=".twrps" dev="sda15" ino=420 scontext=u:r:recovery:s0 tcontext=u:object_r:system_data_file:s0 tclass=file permissive=1
1597[19700124_22:56:15.287358]@3 audit: type=1400 audit(2069775.279:28): avc: denied { relabelfrom } for pid=423 comm="recovery" name=".twrps" dev="sda15" ino=420 scontext=u:r:recovery:s0 tcontext=u:object_r:system_data_file:s0 tclass=file permissive=1
1598[19700124_22:56:15.309222]@3 audit: type=1400 audit(2069775.299:29): avc: denied { relabelto } for pid=423 comm="recovery" name=".twrps" dev="sda15" ino=420 scontext=u:r:recovery:s0 tcontext=u:object_r:system_data_file:s0 tclass=file permissive=1
1599[19700124_22:56:15.331049]@3 audit: type=1400 audit(2069775.329:30): avc: denied { setattr } for pid=423 comm="recovery" name=".twrps" dev="sda15" ino=420 scontext=u:r:recovery:s0 tcontext=u:object_r:system_data_file:s0 tclass=file permissive=1
1600[19700124_22:56:15.362279]@0 SysRq : Emergency Remount R/O
1601[19700124_22:56:15.370809]@0 EXT4-fs (sda3): re-mounted. Opts: (null)
1602[19700124_22:56:15.376588]@0 Emergency Remount complete
1603[19700124_22:56:15.442096]@0 BQ: bq27541_battery_soc: bq27541_battery_soc = 96
1604[19700124_22:56:15.451383]@0 BQ: fg_soc_calibrate: soc:96, soc_calib:96, VOLT:4293, current:-281
1605[19700124_22:56:15.468038]@0 fusb301_power_down_callback : action=0x1
1606[19700124_22:56:15.476985]@0 sd 0:0:0:4: [sde] Synchronizing SCSI cache
1607[19700124_22:56:15.486205]@0 sd 0:0:0:0: [sda] Synchronizing SCSI cache
1608[19700124_22:56:15.494058]@0 mdss_fb_release_all: try to close unopened fb 1! from pid:1 name:init
1609[19700124_22:56:15.504788]@2 --------backlight level = 0---------
1610[19700124_22:56:15.513874]@2 mdss_mdp_overlay_release: Unable to unset pipe(s) ndx=0x8 unset=0x0
1611[19700124_22:56:15.747282]@1 mdss_dsi_off start
1612[19700124_22:56:15.782097]@1 FASTCHG: usb_sw_gpio_set: set usb_sw_gpio = 0
1613[19700124_22:56:15.787932]@1 SMBCHG: backup_soc: backup_soc[96]
1614[19700124_22:56:15.796250]@1 SMBCHG: smbchg_shutdown: smbchg_shutdown
1615[19700124_22:56:15.803508]@0 reboot: Restarting system with command 'bootloader'
1616[19700124_22:56:15.809680]@0 Going down for restart now
1617[19700124_22:56:15.814630]@0 set_dload_mode OFF
1618[19700124_22:56:15.819558]@0 qcom,qpnp-power-on qpnp-power-on-11: PMIC@SID2: configuring PON for reset