· 9 years ago · Jan 05, 2017, 06:16 PM
1<6>[ 0.000000] Initializing cgroup subsys cpu
2
3<6>[ 0.000000] Initializing cgroup subsys cpuacct
4
5<5>[ 0.000000] Linux version 3.18.45-twrp-ailsa_ii-2.0 (jc@westerley) (gcc version 5.3.1 20160412 (Linaro GCC 5.3-2016.05) ) #1 SMP PREEMPT Sat Dec 17 12:55:38 EST 2016
6
7<4>[ 0.000000] CPU: AArch64 Processor [511f2112] revision 2
8
9<6>[ 0.000000] Machine: Qualcomm Technologies, Inc. MSM 8996 v3 + PMI8996 MTP
10
11<6>[ 0.000000] efi: Getting EFI parameters from FDT:
12
13<6>[ 0.000000] efi: UEFI not found.
14
15<6>[ 0.000000] Reserved memory: reserved region for node 'removed_regions@85800000': base 0x0000000085800000, size 48 MiB
16
17<6>[ 0.000000] Reserved memory: reserved region for node 'peripheral_region@8ea00000': base 0x000000008ea00000, size 43 MiB
18
19<6>[ 0.000000] Reserved memory: reserved region for node 'modem_region@88800000': base 0x0000000088800000, size 98 MiB
20
21<6>[ 0.000000] Reserved memory: reserved region for node 'dfps_data_mem@83400000': base 0x0000000083400000, size 0 MiB
22
23<6>[ 0.000000] Reserved memory: reserved region for node 'cont_splash_mem@83401000': base 0x0000000083401000, size 35 MiB
24
25<6>[ 0.000000] Reserved memory: reserved region for node 'ramoops_region@bfc00000': base 0x00000000bfc00000, size 4 MiB
26
27<6>[ 0.000000] Reserved memory: reserved region for node 'cont_splash_mem_hdmi@b1c00000': base 0x00000000b1c00000, size 35 MiB
28
29<6>[ 0.000000] Removed memory: created DMA memory pool at 0x0000000085800000, size 48 MiB
30
31<6>[ 0.000000] Reserved memory: initialized node removed_regions@85800000, compatible id removed-dma-pool
32
33<6>[ 0.000000] Removed memory: created DMA memory pool at 0x000000008ea00000, size 43 MiB
34
35<6>[ 0.000000] Reserved memory: initialized node peripheral_region@8ea00000, compatible id removed-dma-pool
36
37<6>[ 0.000000] Reserved memory: allocated memory for 'adsp_region' node: base 0x00000000ff800000, size 4 MiB
38
39<6>[ 0.000000] Reserved memory: created CMA memory pool at 0x00000000ff800000, size 4 MiB
40
41<6>[ 0.000000] Reserved memory: initialized node adsp_region, compatible id shared-dma-pool
42
43<6>[ 0.000000] Reserved memory: allocated memory for 'qseecom_region' node: base 0x00000000fe400000, size 20 MiB
44
45<6>[ 0.000000] Reserved memory: created CMA memory pool at 0x00000000fe400000, size 20 MiB
46
47<6>[ 0.000000] Reserved memory: initialized node qseecom_region, compatible id shared-dma-pool
48
49<6>[ 0.000000] Reserved memory: allocated memory for 'secure_region' node: base 0x00000000f8800000, size 92 MiB
50
51<6>[ 0.000000] Reserved memory: created CMA memory pool at 0x00000000f8800000, size 92 MiB
52
53<6>[ 0.000000] Reserved memory: initialized node secure_region, compatible id shared-dma-pool
54
55<6>[ 0.000000] Removed memory: created DMA memory pool at 0x0000000088800000, size 98 MiB
56
57<6>[ 0.000000] Reserved memory: initialized node modem_region@88800000, compatible id removed-dma-pool
58
59<6>[ 0.000000] Reserved memory: created DMA memory pool at 0x0000000083400000, size 0 MiB
60
61<6>[ 0.000000] Reserved memory: initialized node dfps_data_mem@83400000, compatible id shared-dma-pool
62
63<6>[ 0.000000] ramoops: Removed memory: created ramoops memory pool at 0x00000000bfc00000, size 4 MiB
64
65<6>[ 0.000000] Reserved memory: initialized node ramoops_region@bfc00000, compatible id removed_ramoops_memory
66
67<5>[ 0.000000] sdlog disabled
68
69<6>[ 0.000000] cma: Reserved 32 MiB at 0x00000000f6800000
70
71<7>[ 0.000000] On node 0 totalpages: 992335
72
73<7>[ 0.000000] DMA zone: 7420 pages used for memmap
74
75<7>[ 0.000000] DMA zone: 0 pages reserved
76
77<7>[ 0.000000] DMA zone: 474879 pages, LIFO batch:31
78
79<7>[ 0.000000] Normal zone: 8086 pages used for memmap
80
81<7>[ 0.000000] Normal zone: 517456 pages, LIFO batch:31
82
83<6>[ 0.000000] psci: probing for conduit method from DT.
84
85<6>[ 0.000000] psci: PSCIv1.0 detected in firmware.
86
87<6>[ 0.000000] psci: Using standard PSCI v0.2 function IDs
88
89<6>[ 0.000000] psci: Initializing psco_cpu_init
90
91<6>[ 0.000000] psci: Initializing psco_cpu_init
92
93<6>[ 0.000000] psci: Initializing psco_cpu_init
94
95<6>[ 0.000000] PERCPU: Embedded 11 pages/cpu @ffffffc0fe30c000 s16128 r0 d28928 u45056
96
97<7>[ 0.000000] pcpu-alloc: s16128 r0 d28928 u45056 alloc=11*4096
98
99<7>[ 0.000000] pcpu-alloc: [0] 0 [0] 1 [0] 2 [0] 3
100
101<4>[ 0.000000] Built 1 zonelists in Zone order, mobility grouping on. Total pages: 976829
102
103<5>[ 0.000000] Kernel command line: sched_enable_hmp=1 sched_enable_power_aware=1 console=ttyHSL0,115200,n8 androidboot.console=ttyHSL0 androidboot.hardware=qcom androidboot.selinux=permissive user_debug=31 msm_rtb.filter=0x237 ehci-hcd.park=3 lpm_levels.sleep_disabled=1 cma=32M@0-0xffffffff enforcing=0 androidboot.bootdevice=624000.ufshc androidboot.verifiedbootstate=orange androidboot.veritymode=logging androidboot.serialno=7925d2a5 gpt androidboot.baseband=msm sdlog.size=0x00000000 androidboot.mode=recovery androidboot.pv-version=0 androidboot.dmverity_disabled=0 androidboot.adbtradefed=0 androidboot.fingerprinthw=auto
104
105<3>[ 0.000000] bootmode_init: KERENEL:boot_mode:RECOVERY
106
107<3>[ 0.000000] pv flag: 0
108
109<3>[ 0.000000] pv flag: 0 boot_stats fingerprint_hw: -1
110
111<6>[ 0.000000] PID hash table entries: 4096 (order: 3, 32768 bytes)
112
113<6>[ 0.000000] Dentry cache hash table entries: 524288 (order: 10, 4194304 bytes)
114
115<6>[ 0.000000] Inode-cache hash table entries: 262144 (order: 9, 2097152 bytes)
116
117<4>[ 0.000000] Memory: 3635256K/3969340K available (12112K kernel code, 1127K rwdata, 4272K rodata, 2104K init, 4144K bss, 334084K reserved)
118
119<5>[ 0.000000] Virtual kernel memory layout:
120
121<5>[ 0.000000] vmalloc : 0xffffff8000000000 - 0xffffffbdbfff0000 ( 246 GB)
122
123<5>[ 0.000000] vmemmap : 0xffffffbdc0000000 - 0xffffffbfc0000000 ( 8 GB maximum)
124
125<5>[ 0.000000] 0xffffffbdc0000000 - 0xffffffbdc3f95400 ( 63 MB actual)
126
127<5>[ 0.000000] PCI I/O : 0xffffffbffa000000 - 0xffffffbffb000000 ( 16 MB)
128
129<5>[ 0.000000] fixed : 0xffffffbffbdfe000 - 0xffffffbffbdff000 ( 4 KB)
130
131<5>[ 0.000000] modules : 0xffffffbffc000000 - 0xffffffc000000000 ( 64 MB)
132
133<5>[ 0.000000] memory : 0xffffffc000000000 - 0xffffffc0fe550000 ( 4069 MB)
134
135<5>[ 0.000000] .init : 0xffffffc001200000 - 0xffffffc00140e000 ( 2104 KB)
136
137<5>[ 0.000000] .text : 0xffffffc000080000 - 0xffffffc001200000 ( 17920 KB)
138
139<5>[ 0.000000] .data : 0xffffffc001417000 - 0xffffffc001530d20 ( 1128 KB)
140
141<6>[ 0.000000] SLUB: HWalign=128, Order=0-3, MinObjects=0, CPUs=4, Nodes=1
142
143<6>[ 0.000000] HMP scheduling enabled.
144
145<6>[ 0.000000] Preemptible hierarchical RCU implementation.
146
147<6>[ 0.000000] RCU dyntick-idle grace-period acceleration is enabled.
148
149<6>[ 0.000000] NR_IRQS:64 nr_irqs:64 0
150
151<6>[ 0.000000] CPU0: found redistributor 0 region 0:0x0000000009c00000
152
153<4>[ 0.000000] mpm_init_irq_domain(): Cannot find irq controller for qcom,gpio-parent
154
155<3>[ 0.000000] MPM 1 irq mapping errored -517
156
157<6>[ 0.000000] Architected cp15 and mmio timer(s) running at 19.20MHz (virt/virt).
158
159<6>[ 0.000004] sched_clock: 56 bits at 19MHz, resolution 52ns, wraps every 3579139424256ns
160
161<6>[ 0.000015] Switched to clocksource arch_sys_counter
162
163<6>[ 0.000736] Calibrating delay loop (skipped), value calculated using timer frequency.. 38.40 BogoMIPS (lpj=192000)
164
165<6>[ 0.000748] pid_max: default: 32768 minimum: 301
166
167<6>[ 0.000811] Security Framework initialized
168
169<6>[ 0.000824] SELinux: Initializing.
170
171<7>[ 0.000853] SELinux: Starting in permissive mode
172
173<6>[ 0.000882] Mount-cache hash table entries: 8192 (order: 4, 65536 bytes)
174
175<6>[ 0.000889] Mountpoint-cache hash table entries: 8192 (order: 4, 65536 bytes)
176
177<6>[ 0.001312] Initializing cgroup subsys freezer
178
179<4>[ 0.001560] /cpus/cpu@0: Unknown CPU type
180
181<4>[ 0.001568] /cpus/cpu@1: Unknown CPU type
182
183<4>[ 0.001575] /cpus/cpu@100: Unknown CPU type
184
185<4>[ 0.001583] /cpus/cpu@101: Unknown CPU type
186
187<6>[ 0.001605] hw perfevents: enabled with arm/armv8-pmuv3 PMU driver, 9 counters available
188
189<6>[ 0.001626] EFI services will not be available.
190
191<4>[ 0.009156] NOHZ: local_softirq_pending 02
192
193<6>[ 0.010982] MSM Memory Dump base table set up
194
195<6>[ 0.011002] MSM Memory Dump apps data table set up
196
197<3>[ 0.011020] hyp_assign_table is not functional as qcom_secure_mem is not allocated.
198
199<6>[ 0.012596] clock-cpu-8996: configuring clocks for the perf cluster
200
201<6>[ 0.012746] cpu_clock_8996_early_init: finished CPU clock configuration
202
203<6>[ 0.014688] CPU1: found redistributor 1 region 0:0x0000000009c40000
204
205<6>[ 0.016550] CPU2: found redistributor 100 region 0:0x0000000009c80000
206
207<6>[ 0.018249] CPU3: found redistributor 101 region 0:0x0000000009cc0000
208
209<6>[ 0.018343] Brought up 4 CPUs
210
211<6>[ 0.018359] SMP: Total of 4 processors activated.
212
213<6>[ 0.023681] pinctrl core: initialized pinctrl subsystem
214
215<6>[ 0.024030] regulator-dummy: no parameters
216
217<6>[ 0.090640] NET: Registered protocol family 16
218
219<6>[ 0.130060] cpuidle: using governor ladder
220
221<6>[ 0.200059] cpuidle: using governor menu
222
223<6>[ 0.220069] cpuidle: using governor qcom
224
225<6>[ 0.220684] vdso: 2 pages (1 code @ ffffffc00141d000, 1 data @ ffffffc00141c000)
226
227<6>[ 0.221118] software IO TLB [mem 0xffc00000-0x100000000] (4MB) mapped at [ffffffc07fc00000-ffffffc07fffffff]
228
229<6>[ 0.221788] DMA: preallocated 256 KiB pool for atomic allocations
230
231<3>[ 0.222036] msm_smem_init: unable to create logging context
232
233<3>[ 0.222072] msm_smd_init: unable to create SMD logging context
234
235<3>[ 0.222078] msm_smd_init: unable to create SMSM logging context
236
237<3>[ 0.222290] <CORE> glink_init: unable to create log context
238
239<3>[ 0.222503] <CORE> glink_core_register_transport: unable to create log context for [dsps:smd_trans]
240
241<3>[ 0.222623] <CORE> glink_core_register_transport: unable to create log context for [lpass:smd_trans]
242
243<3>[ 0.222746] <CORE> glink_core_register_transport: unable to create log context for [mpss:smd_trans]
244
245<3>[ 0.222872] <CORE> glink_core_register_transport: unable to create log context for [wcnss:smd_trans]
246
247<3>[ 0.222982] <CORE> glink_core_register_transport: unable to create log context for [rpm:smd_trans]
248
249<6>[ 0.223445] msm_pm_sleep_status_init: e
250
251<3>[ 0.223970] Failed to create IPC log0
252
253<3>[ 0.223976] Failed to create IPC log1
254
255<3>[ 0.223981] Failed to create IPC log2
256
257<3>[ 0.223986] Failed to create IPC log3
258
259<3>[ 0.223990] Failed to create IPC log4
260
261<6>[ 0.225593] platform 994400.qcom,mdss_dsi_pll: assigned reserved memory node dfps_data_mem@83400000
262
263<6>[ 0.234377] qcom,msm-apm 99e0000.apm: overriding clock sources across APM switch
264
265<6>[ 0.235197] sps:sps is ready.
266
267<6>[ 0.235698] i2c-msm-v2 75ba000.i2c: could not find pctldev for node /soc/pinctrl@01010000/i2c_12/i2c_12_active, deferring probe
268
269<6>[ 0.236484] i2c-msm-v2 7577000.i2c: could not find pctldev for node /soc/pinctrl@01010000/i2c_3/i2c_3_active, deferring probe
270
271<6>[ 0.236736] i2c-msm-v2 757a000.i2c: could not find pctldev for node /soc/pinctrl@01010000/i2c_6/i2c_6_active, deferring probe
272
273<6>[ 0.236985] i2c-msm-v2 75b5000.i2c: could not find pctldev for node /soc/pinctrl@01010000/i2c_7/i2c_7_active, deferring probe
274
275<6>[ 0.237272] i2c-msm-v2 75b6000.i2c: could not find pctldev for node /soc/pinctrl@01010000/i2c_8/i2c_8_active, deferring probe
276
277<4>[ 0.237606] irq: no irq domain found for /soc/pinctrl@01010000 !
278
279<3>[ 0.239076] cpu-clock-8996 6400000.qcom,cpu-clock-8996: resources init failed
280
281<3>[ 0.299940] smd_channel_probe_now: allocation table not initialized
282
283<3>[ 0.300225] smd_channel_probe_now: allocation table not initialized
284
285<3>[ 0.300466] smd_channel_probe_now: allocation table not initialized
286
287<3>[ 0.300715] smd_channel_probe_now: allocation table not initialized
288
289<3>[ 0.300735] smem_zte_set_nv_bootmode: set ftm flag 1297368654 to smem.
290
291<6>[ 0.300949] msm_watchdog 9830000.qcom,wdt: wdog absent resource not present
292
293<6>[ 0.301165] msm_watchdog 9830000.qcom,wdt: MSM Watchdog Initialized
294
295<6>[ 0.301818] msm_rpm_dev_probe: APSS-RPM communication over GLINK
296
297<3>[ 0.309557] spmi_pmic_arb 400f000.qcom,spmi: PMIC Arb Version-2 0x20010000
298
299<3>[ 0.311289] spmi_pmic_arb 400f000.qcom,spmi: missing property: qcom,pmic-arb-max-periph-interrupts
300
301<6>[ 0.315730] pmi8994_s2: 400 <--> 1015 mV at 1000 mV normal idle
302
303<6>[ 0.316359] platform 9300000.qcom,lpass: assigned reserved memory node peripheral_region@8ea00000
304
305<6>[ 0.316900] platform ce0000.qcom,venus: assigned reserved memory node peripheral_region@8ea00000
306
307<6>[ 0.317739] platform 1c00000.qcom,ssc: assigned reserved memory node peripheral_region@8ea00000
308
309<6>[ 0.318378] platform 2080000.qcom,mss: assigned reserved memory node modem_region@88800000
310
311<6>[ 0.321422] msm-thermal 70000.qcom,msm-thermal: msm_thermal:Failed reading node=/soc/qcom,msm-thermal, key=qcom,rpm-phase-resource-type err=-22. KTM continues
312
313<6>[ 0.321443] msm-thermal 70000.qcom,msm-thermal: msm_thermal:Failed reading node=/soc/qcom,msm-thermal, key=qcom,gfx-sensor-id. err=-22. KTM continues
314
315<6>[ 0.321461] msm-thermal 70000.qcom,msm-thermal: probe_vdd_mx:Failed reading node=/soc/qcom,msm-thermal, key=qcom,mx-restriction-temp. KTM continues
316
317<6>[ 0.321474] msm-thermal 70000.qcom,msm-thermal: probe_psm:Failed reading node=/soc/qcom,msm-thermal, key=qcom,pmic-sw-mode-temp. err=-22. KTM continues
318
319<6>[ 0.321593] msm_thermal:vdd_restriction_reg_init Defer regulator vdd-dig probe
320
321<3>[ 0.321600] msm_thermal:probe_vdd_rstr Err regulator init. err:-517. KTM continues.
322
323<6>[ 0.321610] msm-thermal 70000.qcom,msm-thermal: probe_vdd_rstr:Failed reading node=/soc/qcom,msm-thermal, key=qcom,max-freq-level. err=-517. KTM continues
324
325<3>[ 0.321617] msm_thermal:msm_thermal_dev_probe Failed reading node=/soc/qcom,msm-thermal, key=qcom,online-hotplug-core. err:-517
326
327<6>[ 0.325863] platform soc:qcom,msm-adsprpc-mem: assigned reserved memory node adsp_region
328
329<3>[ 0.326929] <CORE> glink_core_register_transport: unable to create log context for [mpss:smem]
330
331<3>[ 0.327571] <CORE> glink_core_register_transport: unable to create log context for [lpass:smem]
332
333<3>[ 0.328206] <CORE> glink_core_register_transport: unable to create log context for [dsps:smem]
334
335<3>[ 0.328690] <CORE> glink_core_register_transport: unable to create log context for [rpm:smem]
336
337<3>[ 0.328901] smd_channel_probe_now: allocation table not initialized
338
339<6>[ 0.329015] msm_rpm_trans_notify_state: glink config params: transport=(null), edge=rpm, name=rpm_requests
340
341<6>[ 0.329683] msm_cache_erp64 6500000.qcom,cache_erp64: Registering for L1 error interrupts
342
343<6>[ 0.329769] msm_cache_erp64 6500000.qcom,cache_erp64: Registering for L2 error interrupts
344
345<6>[ 0.329912] msm_cache_erp64 6500000.qcom,cache_erp64: Registering for L3 error interrupts
346
347<6>[ 0.330183] msm_m4m_erp 9a40000.qcom,m4m_erp64: Registering for M4M error interrupts
348
349<6>[ 0.331264] platform soc:qcom,ramoops@8fc00000: assigned reserved memory node ramoops_region@bfc00000
350
351<6>[ 0.337042] console [pstore-1] enabled
352
353<6>[ 0.337147] pstore: Registered ramoops as persistent store backend
354
355<6>[ 0.337157] ramoops: attached 0x400000@0xbfc00000, ecc: 0/0
356
357<6>[ 0.338195] apc0_pwrcl_mem_acc_corner: 0 <--> 0 mV
358
359<6>[ 0.338533] apc1_perfcl_mem_acc_corner: 0 <--> 0 mV
360
361<6>[ 0.338849] apcc_l3_mem_acc_corner: 0 <--> 0 mV
362
363<6>[ 0.339160] gfx_mem_acc_corner: 0 <--> 0 mV
364
365<6>[ 0.339547] kryo0-retention: 468 <--> 892 mV at 520 mV
366
367<6>[ 0.339738] kryo0: 468 <--> 892 mV at 754 mV
368
369<6>[ 0.339880] kryo_regulator_probe: kryo0: default LDO functional volt=754021 uV, LDO retention volt=521789 uV, Vref func=325285 + 4466*(val), cluster-num=0
370
371<6>[ 0.340211] kryo1-retention: 468 <--> 892 mV at 520 mV
372
373<6>[ 0.340402] kryo1: 468 <--> 892 mV at 754 mV
374
375<6>[ 0.340542] kryo_regulator_probe: kryo1: default LDO functional volt=754021 uV, LDO retention volt=521789 uV, Vref func=325285 + 4466*(val), cluster-num=1
376
377<6>[ 0.344561] platform soc:qcom,kgsl-hyp: assigned reserved memory node peripheral_region@8ea00000
378
379<3>[ 0.345795] msm_mpm_dev_probe(): Cannot get clk resource for XO: -517
380
381<4>[ 0.363815] __of_mpm_init(): MPM driver mapping exists
382
383<4>[ 0.364008] ZTE_PM_IRQ INT number will be showed if device is waked up by GPIOs
384
385<6>[ 0.374154] i2c-msm-v2 75ba000.i2c: probing driver i2c-msm-v2
386
387<3>[ 0.374269] i2c-msm-v2 75ba000.i2c: error on clk_get(core_clk):-517
388
389<3>[ 0.374282] i2c-msm-v2 75ba000.i2c: error probe() failed with err:-517
390
391<6>[ 0.374720] i2c-msm-v2 7577000.i2c: probing driver i2c-msm-v2
392
393<3>[ 0.374798] i2c-msm-v2 7577000.i2c: error on clk_get(core_clk):-517
394
395<3>[ 0.374810] i2c-msm-v2 7577000.i2c: error probe() failed with err:-517
396
397<6>[ 0.375187] i2c-msm-v2 757a000.i2c: probing driver i2c-msm-v2
398
399<3>[ 0.375266] i2c-msm-v2 757a000.i2c: error on clk_get(core_clk):-517
400
401<3>[ 0.375278] i2c-msm-v2 757a000.i2c: error probe() failed with err:-517
402
403<6>[ 0.375680] i2c-msm-v2 75b5000.i2c: probing driver i2c-msm-v2
404
405<3>[ 0.375758] i2c-msm-v2 75b5000.i2c: error on clk_get(core_clk):-517
406
407<3>[ 0.375769] i2c-msm-v2 75b5000.i2c: error probe() failed with err:-517
408
409<6>[ 0.376123] i2c-msm-v2 75b6000.i2c: probing driver i2c-msm-v2
410
411<3>[ 0.376201] i2c-msm-v2 75b6000.i2c: error on clk_get(core_clk):-517
412
413<3>[ 0.376212] i2c-msm-v2 75b6000.i2c: error probe() failed with err:-517
414
415<3>[ 0.376395] cpu-clock-8996 6400000.qcom,cpu-clock-8996: resources init failed
416
417<6>[ 0.377232] pm8994_s1_corner: 0 <--> 0 mV at 0 mV normal idle
418
419<6>[ 0.377683] pm8994_s1_floor_corner: 0 <--> 0 mV at 0 mV normal idle
420
421<6>[ 0.378063] pm8994_s1_corner_ao: 0 <--> 0 mV at 0 mV normal idle
422
423<6>[ 0.378503] pm8994_s2_corner: 0 <--> 0 mV at 0 mV normal idle
424
425<6>[ 0.378862] pm8994_s2_corner_ao: 0 <--> 0 mV at 0 mV normal idle
426
427<6>[ 0.379302] pm8994_s3: 1300 mV normal idle
428
429<6>[ 0.379718] pm8994_s4: 1800 mV normal idle
430
431<6>[ 0.380223] pm8994_s5: 2150 mV normal idle
432
433<6>[ 0.380646] pm8994_s7: 800 mV normal idle
434
435<6>[ 0.381074] pm8994_l1: 1000 mV normal idle
436
437<6>[ 0.381490] pm8994_l2: 1250 mV normal idle
438
439<6>[ 0.382204] pm8994_l3: 850 mV normal idle
440
441<6>[ 0.382631] pm8994_l4: 1225 mV normal idle
442
443<6>[ 0.383030] pm8994_l6: 1200 mV normal idle
444
445<6>[ 0.383453] pm8994_l8: 1800 mV normal idle
446
447<6>[ 0.383856] pm8994_l9: 1800 mV normal idle
448
449<6>[ 0.384266] pm8994_l10: 1800 mV normal idle
450
451<6>[ 0.384662] pm8994_l11: 1150 mV normal idle
452
453<6>[ 0.385082] pm8994_l12: 1800 mV normal idle
454
455<6>[ 0.385705] pm8994_l13: 1800 <--> 2950 mV at 2950 mV normal idle
456
457<6>[ 0.386126] pm8994_l14: 1800 mV normal idle
458
459<6>[ 0.386713] pm8994_l15: 1800 mV normal idle
460
461<6>[ 0.387122] pm8994_l16: 2700 mV normal idle
462
463<6>[ 0.387521] pm8994_l17: 2900 mV normal idle
464
465<6>[ 0.387925] pm8994_l18: 2700 <--> 2900 mV at 2700 mV normal idle
466
467<6>[ 0.388276] pm8994_l18_pin_ctrl: 2700 <--> 2900 mV at 2700 mV normal idle
468
469<6>[ 0.388692] pm8994_l19: 3000 mV normal idle
470
471<6>[ 0.389096] pm8994_l20: 2950 mV normal idle
472
473<6>[ 0.389502] pm8994_l21: 2950 mV normal idle
474
475<6>[ 0.389896] pm8994_l22: 3300 mV normal idle
476
477<6>[ 0.390344] pm8994_l23: 2800 mV normal idle
478
479<6>[ 0.390740] pm8994_l24: 3075 mV normal idle
480
481<6>[ 0.391154] pm8994_l25: 1200 mV normal idle
482
483<6>[ 0.391776] pm8994_l26_corner: 0 <--> 0 mV at 0 mV normal idle
484
485<6>[ 0.392143] pm8994_l26_floor_corner: 0 <--> 0 mV at 0 mV normal idle
486
487<6>[ 0.392549] pm8994_l27: 1000 mV normal idle
488
489<6>[ 0.392960] pm8994_l28: 925 mV normal idle
490
491<6>[ 0.393550] pm8994_l29: 2800 mV normal idle
492
493<6>[ 0.393956] pm8994_l30: 1800 mV normal idle
494
495<6>[ 0.394358] pm8994_l32: 1800 mV normal idle
496
497<6>[ 0.394750] pm8994_lvs1: no parameters
498
499<6>[ 0.395107] pm8994_lvs2: no parameters
500
501<6>[ 0.395487] pmi8994_s1: 1025 mV normal idle
502
503<6>[ 0.395885] pmi8994_boost_5v: no parameters
504
505<3>[ 0.395978] qcom,rpm-smd-regulator soc:qcom,rpm-smd:rpm-regulator-bstb:regulator-bst: Failed to find supply parent
506
507<3>[ 0.396073] rpm_vreg_device_probe: regulator_register failed: pmi8994_boost_5v, rc=-517
508
509<6>[ 0.396351] pmi8994_boost_pin_ctrl: no parameters
510
511<3>[ 0.396396] qcom,rpm-smd-regulator soc:qcom,rpm-smd:rpm-regulator-bstb:regulator-bst-pin-ctrl: Failed to find supply parent
512
513<3>[ 0.396478] rpm_vreg_device_probe: regulator_register failed: pmi8994_boost_pin_ctrl, rc=-517
514
515<6>[ 0.396799] pmi8994_boostbypass: 3150 <--> 3600 mV at 3150 mV normal idle
516
517<6>[ 0.397131] pm8994_s11: 470 <--> 1140 mV at 905 mV normal idle
518
519<6>[ 0.397334] pm8994_s11_avs_limit: 470 <--> 1140 mV
520
521<6>[ 0.397451] spm_regulator_probe: name=pm8994_s11, range=LV, voltage=905000 uV, mode=AUTO, step rate=2400 uV/us
522
523<6>[ 0.398307] msm-thermal 70000.qcom,msm-thermal: msm_thermal:Failed reading node=/soc/qcom,msm-thermal, key=qcom,rpm-phase-resource-type err=-22. KTM continues
524
525<6>[ 0.398327] msm-thermal 70000.qcom,msm-thermal: msm_thermal:Failed reading node=/soc/qcom,msm-thermal, key=qcom,gfx-sensor-id. err=-22. KTM continues
526
527<6>[ 0.398337] msm_thermal:sensor_mgr_init_threshold threshold id already initialized
528
529<6>[ 0.398352] msm-thermal 70000.qcom,msm-thermal: probe_vdd_mx:Failed reading node=/soc/qcom,msm-thermal, key=qcom,mx-restriction-temp. KTM continues
530
531<6>[ 0.398366] msm-thermal 70000.qcom,msm-thermal: probe_psm:Failed reading node=/soc/qcom,msm-thermal, key=qcom,pmic-sw-mode-temp. err=-22. KTM continues
532
533<6>[ 0.398639] msm_thermal:vdd_restriction_reg_init Defer regulator vdd-gfx probe
534
535<3>[ 0.398651] msm_thermal:probe_vdd_rstr Err regulator init. err:-517. KTM continues.
536
537<6>[ 0.398663] msm-thermal 70000.qcom,msm-thermal: probe_vdd_rstr:Failed reading node=/soc/qcom,msm-thermal, key=qcom,max-freq-level. err=-517. KTM continues
538
539<3>[ 0.398672] msm_thermal:msm_thermal_dev_probe Failed reading node=/soc/qcom,msm-thermal, key=qcom,online-hotplug-core. err:-517
540
541<3>[ 0.399286] msm_mpm_dev_probe(): Cannot get clk resource for XO: -517
542
543<6>[ 0.399688] i2c-msm-v2 75ba000.i2c: probing driver i2c-msm-v2
544
545<3>[ 0.399748] i2c-msm-v2 75ba000.i2c: error on clk_get(core_clk):-517
546
547<3>[ 0.399760] i2c-msm-v2 75ba000.i2c: error probe() failed with err:-517
548
549<6>[ 0.400106] i2c-msm-v2 7577000.i2c: probing driver i2c-msm-v2
550
551<3>[ 0.400162] i2c-msm-v2 7577000.i2c: error on clk_get(core_clk):-517
552
553<3>[ 0.400173] i2c-msm-v2 7577000.i2c: error probe() failed with err:-517
554
555<6>[ 0.400432] i2c-msm-v2 757a000.i2c: probing driver i2c-msm-v2
556
557<3>[ 0.400482] i2c-msm-v2 757a000.i2c: error on clk_get(core_clk):-517
558
559<3>[ 0.400493] i2c-msm-v2 757a000.i2c: error probe() failed with err:-517
560
561<6>[ 0.400764] i2c-msm-v2 75b5000.i2c: probing driver i2c-msm-v2
562
563<3>[ 0.400815] i2c-msm-v2 75b5000.i2c: error on clk_get(core_clk):-517
564
565<3>[ 0.400827] i2c-msm-v2 75b5000.i2c: error probe() failed with err:-517
566
567<6>[ 0.401063] i2c-msm-v2 75b6000.i2c: probing driver i2c-msm-v2
568
569<3>[ 0.401114] i2c-msm-v2 75b6000.i2c: error on clk_get(core_clk):-517
570
571<3>[ 0.401125] i2c-msm-v2 75b6000.i2c: error probe() failed with err:-517
572
573<3>[ 0.401340] cpu-clock-8996 6400000.qcom,cpu-clock-8996: resources init failed
574
575<6>[ 0.419578] qcom,gcc-8996 300000.qcom,gcc: Registered GCC clocks.
576
577<6>[ 0.420600] vfe0_clk_src: set OPP pair(75000000 Hz: 3 uV) on a10000.qcom,vfe0
578
579<6>[ 0.420616] vfe0_clk_src: set OPP pair(320000000 Hz: 5 uV) on a10000.qcom,vfe0
580
581<6>[ 0.420627] vfe0_clk_src: set OPP pair(600000000 Hz: 7 uV) on a10000.qcom,vfe0
582
583<6>[ 0.420841] vfe1_clk_src: set OPP pair(75000000 Hz: 3 uV) on a14000.qcom,vfe1
584
585<6>[ 0.420853] vfe1_clk_src: set OPP pair(320000000 Hz: 5 uV) on a14000.qcom,vfe1
586
587<6>[ 0.420864] vfe1_clk_src: set OPP pair(600000000 Hz: 7 uV) on a14000.qcom,vfe1
588
589<6>[ 0.421098] cpp_clk_src: set OPP pair(100000000 Hz: 3 uV) on a04000.qcom,cpp
590
591<6>[ 0.421111] cpp_clk_src: set OPP pair(480000000 Hz: 5 uV) on a04000.qcom,cpp
592
593<6>[ 0.421119] cpp_clk_src: set OPP pair(640000000 Hz: 7 uV) on a04000.qcom,cpp
594
595<6>[ 0.429706] qcom,mmsscc-8996 8c0000.qcom,mmsscc: Registered MMSS clocks.
596
597<6>[ 0.431431] pmi8994_boost_5v: no parameters
598
599<3>[ 0.431519] qcom,rpm-smd-regulator soc:qcom,rpm-smd:rpm-regulator-bstb:regulator-bst: Failed to find supply parent
600
601<3>[ 0.431613] rpm_vreg_device_probe: regulator_register failed: pmi8994_boost_5v, rc=-517
602
603<6>[ 0.431806] pmi8994_boost_pin_ctrl: no parameters
604
605<3>[ 0.431850] qcom,rpm-smd-regulator soc:qcom,rpm-smd:rpm-regulator-bstb:regulator-bst-pin-ctrl: Failed to find supply parent
606
607<3>[ 0.431933] rpm_vreg_device_probe: regulator_register failed: pmi8994_boost_pin_ctrl, rc=-517
608
609<6>[ 0.432723] msm-thermal 70000.qcom,msm-thermal: msm_thermal:Failed reading node=/soc/qcom,msm-thermal, key=qcom,rpm-phase-resource-type err=-22. KTM continues
610
611<6>[ 0.432741] msm-thermal 70000.qcom,msm-thermal: msm_thermal:Failed reading node=/soc/qcom,msm-thermal, key=qcom,gfx-sensor-id. err=-22. KTM continues
612
613<6>[ 0.432752] msm_thermal:sensor_mgr_init_threshold threshold id already initialized
614
615<6>[ 0.432766] msm-thermal 70000.qcom,msm-thermal: probe_vdd_mx:Failed reading node=/soc/qcom,msm-thermal, key=qcom,mx-restriction-temp. KTM continues
616
617<6>[ 0.432780] msm-thermal 70000.qcom,msm-thermal: probe_psm:Failed reading node=/soc/qcom,msm-thermal, key=qcom,pmic-sw-mode-temp. err=-22. KTM continues
618
619<6>[ 0.432951] msm_thermal:vdd_restriction_reg_init Defer regulator vdd-gfx probe
620
621<3>[ 0.432961] msm_thermal:probe_vdd_rstr Err regulator init. err:-517. KTM continues.
622
623<6>[ 0.432972] msm-thermal 70000.qcom,msm-thermal: probe_vdd_rstr:Failed reading node=/soc/qcom,msm-thermal, key=qcom,max-freq-level. err=-517. KTM continues
624
625<3>[ 0.432982] msm_thermal:msm_thermal_dev_probe Failed reading node=/soc/qcom,msm-thermal, key=qcom,online-hotplug-core. err:-517
626
627<6>[ 0.433444] cpr3_msm8996_hmss_read_fuse_data: apc0_pwrcl_corner: speed bin = 0
628
629<6>[ 0.433455] cpr3_msm8996_hmss_read_fuse_data: apc0_pwrcl_corner: CPR fusing revision = 6
630
631<6>[ 0.433464] cpr3_msm8996_hmss_read_fuse_data: apc0_pwrcl_corner: using redundant fuses = N
632
633<6>[ 0.433472] cpr3_msm8996_hmss_read_fuse_data: apc0_pwrcl_corner: CPR limitation = none
634
635<6>[ 0.433481] cpr3_msm8996_hmss_read_fuse_data: apc0_pwrcl_corner: CPR partial binning limitation = none
636
637<6>[ 0.433491] cpr3_msm8996_hmss_read_fuse_data: apc0_pwrcl_corner: Retention voltage fuses: VDD_MX = 4, VDD_APCC = 4
638
639<6>[ 0.433668] cpr3_hmss_kvreg_init: apc0_pwrcl_corner: LDO min headroom=150000 uV, LDO max headroom=470000 uV, LDO adj=0 uV, LDO mode=allowed, LDO retention=490000 uV
640
641<6>[ 0.433836] cpr3_msm8996_hmss_calculate_open_loop_voltages: apc0_pwrcl_corner: fused MinSVS: open-loop= 605000 uV
642
643<6>[ 0.433845] cpr3_msm8996_hmss_calculate_open_loop_voltages: apc0_pwrcl_corner: fused SVS: open-loop= 695000 uV
644
645<6>[ 0.433853] cpr3_msm8996_hmss_calculate_open_loop_voltages: apc0_pwrcl_corner: fused NOM: open-loop= 805000 uV
646
647<6>[ 0.433861] cpr3_msm8996_hmss_calculate_open_loop_voltages: apc0_pwrcl_corner: fused TURBO: open-loop= 910000 uV
648
649<6>[ 0.433942] cpr3_msm8996_hmss_calculate_target_quotients: apc0_pwrcl_corner: fused MinSVS: quot[ 7]= 352
650
651<6>[ 0.433952] cpr3_msm8996_hmss_calculate_target_quotients: apc0_pwrcl_corner: fused SVS: quot[ 7]= 516, quot_offset[ 7]= 125
652
653<6>[ 0.433960] cpr3_msm8996_hmss_calculate_target_quotients: apc0_pwrcl_corner: fused NOM: quot[ 7]= 742, quot_offset[ 7]= 225
654
655<6>[ 0.433968] cpr3_msm8996_hmss_calculate_target_quotients: apc0_pwrcl_corner: fused TURBO: quot[ 7]= 937, quot_offset[ 7]= 195
656
657<6>[ 0.434094] cpr3_msm8996_hmss_read_fuse_data: apc0_cbf_corner: speed bin = 0
658
659<6>[ 0.434103] cpr3_msm8996_hmss_read_fuse_data: apc0_cbf_corner: CPR fusing revision = 6
660
661<6>[ 0.434112] cpr3_msm8996_hmss_read_fuse_data: apc0_cbf_corner: using redundant fuses = N
662
663<6>[ 0.434120] cpr3_msm8996_hmss_read_fuse_data: apc0_cbf_corner: CPR limitation = none
664
665<6>[ 0.434128] cpr3_msm8996_hmss_read_fuse_data: apc0_cbf_corner: CPR partial binning limitation = none
666
667<6>[ 0.434138] cpr3_msm8996_hmss_read_fuse_data: apc0_cbf_corner: Retention voltage fuses: VDD_MX = 4, VDD_APCC = 4
668
669<6>[ 0.434263] cpr3_msm8996_hmss_calculate_open_loop_voltages: apc0_cbf_corner: fused MinSVS: open-loop= 605000 uV
670
671<6>[ 0.434272] cpr3_msm8996_hmss_calculate_open_loop_voltages: apc0_cbf_corner: fused SVS: open-loop= 695000 uV
672
673<6>[ 0.434280] cpr3_msm8996_hmss_calculate_open_loop_voltages: apc0_cbf_corner: fused NOM: open-loop= 805000 uV
674
675<6>[ 0.434288] cpr3_msm8996_hmss_calculate_open_loop_voltages: apc0_cbf_corner: fused TURBO: open-loop= 910000 uV
676
677<6>[ 0.434329] cpr3_msm8996_hmss_calculate_target_quotients: apc0_cbf_corner: fused MinSVS: quot[ 7]= 352
678
679<6>[ 0.434337] cpr3_msm8996_hmss_calculate_target_quotients: apc0_cbf_corner: fused SVS: quot[ 7]= 516, quot_offset[ 7]= 125
680
681<6>[ 0.434345] cpr3_msm8996_hmss_calculate_target_quotients: apc0_cbf_corner: fused NOM: quot[ 7]= 742, quot_offset[ 7]= 225
682
683<6>[ 0.434353] cpr3_msm8996_hmss_calculate_target_quotients: apc0_cbf_corner: fused TURBO: quot[ 7]= 937, quot_offset[ 7]= 195
684
685<6>[ 0.434454] cpr3_msm8996_hmss_read_fuse_data: apc1_corner: speed bin = 0
686
687<6>[ 0.434463] cpr3_msm8996_hmss_read_fuse_data: apc1_corner: CPR fusing revision = 6
688
689<6>[ 0.434471] cpr3_msm8996_hmss_read_fuse_data: apc1_corner: using redundant fuses = N
690
691<6>[ 0.434480] cpr3_msm8996_hmss_read_fuse_data: apc1_corner: CPR limitation = none
692
693<6>[ 0.434488] cpr3_msm8996_hmss_read_fuse_data: apc1_corner: CPR partial binning limitation = none
694
695<6>[ 0.434498] cpr3_msm8996_hmss_read_fuse_data: apc1_corner: Retention voltage fuses: VDD_MX = 4, VDD_APCC = 4
696
697<6>[ 0.434671] cpr3_hmss_kvreg_init: apc1_corner: LDO min headroom=150000 uV, LDO max headroom=470000 uV, LDO adj=0 uV, LDO mode=allowed, LDO retention=490000 uV
698
699<6>[ 0.434860] cpr3_msm8996_hmss_calculate_open_loop_voltages: apc1_corner: fused MinSVS: open-loop= 615000 uV
700
701<6>[ 0.434870] cpr3_msm8996_hmss_calculate_open_loop_voltages: apc1_corner: fused SVS: open-loop= 665000 uV
702
703<6>[ 0.434877] cpr3_msm8996_hmss_calculate_open_loop_voltages: apc1_corner: fused NOM: open-loop= 715000 uV
704
705<6>[ 0.434884] cpr3_msm8996_hmss_calculate_open_loop_voltages: apc1_corner: fused TURBO: open-loop= 980000 uV
706
707<6>[ 0.434991] cpr3_msm8996_hmss_calculate_target_quotients: apc1_corner: fused MinSVS: quot[ 7]= 371
708
709<6>[ 0.435000] cpr3_msm8996_hmss_calculate_target_quotients: apc1_corner: fused SVS: quot[ 7]= 452, quot_offset[ 7]= 40
710
711<6>[ 0.435009] cpr3_msm8996_hmss_calculate_target_quotients: apc1_corner: fused NOM: quot[ 7]= 555, quot_offset[ 7]= 100
712
713<6>[ 0.435017] cpr3_msm8996_hmss_calculate_target_quotients: apc1_corner: fused TURBO: quot[ 7]=1057, quot_offset[ 7]= 500
714
715<6>[ 0.435460] cpr3_regulator_init_ctrl: apcc: Default CPR mode = SW closed-loop
716
717<6>[ 0.435597] apc0_pwrcl_corner: 0 <--> 0 mV at 0 mV
718
719<6>[ 0.435798] apc0_cbf_corner: 0 <--> 0 mV at 0 mV
720
721<6>[ 0.438603] cpr3_regulator_measure_aging: apcc: average quotient delta=10 (count=10)
722
723<6>[ 0.438626] cpr3_regulator_aging_adjust: apcc: aging measurement successful; aging reference adjustment voltage=1250 uV
724
725<6>[ 0.438905] apc1_corner: 0 <--> 0 mV at 0 mV
726
727<6>[ 0.440335] cpr3_msm8996_mmss_read_fuse_data: gfx_corner: CPR fusing revision = 4
728
729<6>[ 0.440350] cpr3_msm8996_mmss_read_fuse_data: gfx_corner: CPR limitation = none
730
731<6>[ 0.440622] cpr3_msm8996_mmss_calculate_open_loop_voltages: gfx_corner: fuse_corner[0] open-loop= 640000 uV
732
733<6>[ 0.440631] cpr3_msm8996_mmss_calculate_open_loop_voltages: gfx_corner: fuse_corner[1] open-loop= 695000 uV
734
735<6>[ 0.440639] cpr3_msm8996_mmss_calculate_open_loop_voltages: gfx_corner: fuse_corner[2] open-loop= 815000 uV
736
737<6>[ 0.440646] cpr3_msm8996_mmss_calculate_open_loop_voltages: gfx_corner: fuse_corner[3] open-loop= 905000 uV
738
739<6>[ 0.440801] cpr3_regulator_init_ctrl: gfx: Default CPR mode = closed-loop
740
741<6>[ 0.440927] gfx_corner: 0 <--> 0 mV at 0 mV
742
743<6>[ 0.442065] i2c-msm-v2 75ba000.i2c: probing driver i2c-msm-v2
744
745<3>[ 0.442146] AXI: msm_bus_scale_register_client(): msm_bus_scale_register_client: Bus driver not ready.
746
747<6>[ 0.442157] i2c-msm-v2 75ba000.i2c: msm_bus_scale_register_client(mstr-id:84):0 (not a problem)
748
749<6>[ 0.443036] i2c-msm-v2 7577000.i2c: probing driver i2c-msm-v2
750
751<3>[ 0.443106] AXI: msm_bus_scale_register_client(): msm_bus_scale_register_client: Bus driver not ready.
752
753<6>[ 0.443117] i2c-msm-v2 7577000.i2c: msm_bus_scale_register_client(mstr-id:86):0 (not a problem)
754
755<6>[ 0.443831] i2c-msm-v2 757a000.i2c: probing driver i2c-msm-v2
756
757<3>[ 0.443900] AXI: msm_bus_scale_register_client(): msm_bus_scale_register_client: Bus driver not ready.
758
759<6>[ 0.443911] i2c-msm-v2 757a000.i2c: msm_bus_scale_register_client(mstr-id:86):0 (not a problem)
760
761<6>[ 0.444570] i2c-msm-v2 75b5000.i2c: probing driver i2c-msm-v2
762
763<3>[ 0.444639] AXI: msm_bus_scale_register_client(): msm_bus_scale_register_client: Bus driver not ready.
764
765<6>[ 0.444651] i2c-msm-v2 75b5000.i2c: msm_bus_scale_register_client(mstr-id:84):0 (not a problem)
766
767<6>[ 0.445401] i2c-msm-v2 75b6000.i2c: probing driver i2c-msm-v2
768
769<3>[ 0.445473] AXI: msm_bus_scale_register_client(): msm_bus_scale_register_client: Bus driver not ready.
770
771<6>[ 0.445484] i2c-msm-v2 75b6000.i2c: msm_bus_scale_register_client(mstr-id:84):0 (not a problem)
772
773<6>[ 0.446297] cpu-clock-8996 6400000.qcom,cpu-clock-8996: using perf/pwr/cbf speed bin 0 and pvs_ver 0
774
775<6>[ 0.448064] clock-cpu-8996: set OPP pair (307200000 Hz, 625000 uv) on cpu0
776
777<6>[ 0.448107] clock-cpu-8996: set OPP pair (1593600000 Hz, 885000 uv) on cpu0
778
779<6>[ 0.448126] clock-cpu-8996: set OPP pair (307200000 Hz, 625000 uv) on cpu1
780
781<6>[ 0.448159] clock-cpu-8996: set OPP pair (1593600000 Hz, 885000 uv) on cpu1
782
783<6>[ 0.448177] clock-cpu-8996: set OPP pair (307200000 Hz, 635000 uv) on cpu2
784
785<6>[ 0.448231] clock-cpu-8996: set OPP pair (2150400000 Hz, 965000 uv) on cpu2
786
787<6>[ 0.448250] clock-cpu-8996: set OPP pair (307200000 Hz, 635000 uv) on cpu3
788
789<6>[ 0.448299] clock-cpu-8996: set OPP pair (2150400000 Hz, 965000 uv) on cpu3
790
791<6>[ 0.448418] clock-cpu-8996: set OPP pair (307200000 Hz, 650000 uv) on soc:qcom,m4m
792
793<6>[ 0.448458] clock-cpu-8996: set OPP pair (1593600000 Hz, 885000 uv) on soc:qcom,m4m
794
795<6>[ 0.448791] qcom,gpucc-8996 8c0000.qcom,gpucc: using speed bin 0
796
797<6>[ 0.449130] gfx3d_clk_src_v2: set OPP pair(133000000 Hz: 570000 uV) on b00000.qcom,kgsl-3d0
798
799<6>[ 0.449153] gfx3d_clk_src_v2: set OPP pair(624000000 Hz: 905000 uV) on b00000.qcom,kgsl-3d0
800
801<6>[ 0.450577] qcom,gpucc-8996 8c0000.qcom,gpucc: Registered GPU clocks.
802
803<6>[ 0.450786] pmi8994_boost_5v: no parameters
804
805<3>[ 0.450852] qcom,rpm-smd-regulator soc:qcom,rpm-smd:rpm-regulator-bstb:regulator-bst: Failed to find supply parent
806
807<3>[ 0.450945] rpm_vreg_device_probe: regulator_register failed: pmi8994_boost_5v, rc=-517
808
809<6>[ 0.451133] pmi8994_boost_pin_ctrl: no parameters
810
811<3>[ 0.451178] qcom,rpm-smd-regulator soc:qcom,rpm-smd:rpm-regulator-bstb:regulator-bst-pin-ctrl: Failed to find supply parent
812
813<3>[ 0.451264] rpm_vreg_device_probe: regulator_register failed: pmi8994_boost_pin_ctrl, rc=-517
814
815<6>[ 0.452088] msm-thermal 70000.qcom,msm-thermal: msm_thermal:Failed reading node=/soc/qcom,msm-thermal, key=qcom,rpm-phase-resource-type err=-22. KTM continues
816
817<6>[ 0.452106] msm-thermal 70000.qcom,msm-thermal: msm_thermal:Failed reading node=/soc/qcom,msm-thermal, key=qcom,gfx-sensor-id. err=-22. KTM continues
818
819<6>[ 0.452117] msm_thermal:sensor_mgr_init_threshold threshold id already initialized
820
821<6>[ 0.452131] msm-thermal 70000.qcom,msm-thermal: probe_vdd_mx:Failed reading node=/soc/qcom,msm-thermal, key=qcom,mx-restriction-temp. KTM continues
822
823<6>[ 0.452145] msm-thermal 70000.qcom,msm-thermal: probe_psm:Failed reading node=/soc/qcom,msm-thermal, key=qcom,pmic-sw-mode-temp. err=-22. KTM continues
824
825<3>[ 0.452385] msm_thermal:update_cpu_freq Unable to update policy for cpu:0. err:-19
826
827<3>[ 0.452397] msm_thermal:update_cpu_freq Unable to update policy for cpu:2. err:-19
828
829<3>[ 0.452406] msm_thermal:update_cpu_freq Unable to update policy for cpu:2. err:-19
830
831<3>[ 0.452425] msm-thermal 70000.qcom,msm-thermal: probe_ocr:Failed reading node=/soc/qcom,msm-thermal, key=qcom,pmic-opt-curr-temp err:-22. KTM continues
832
833<3>[ 0.453313] msm_thermal:update_cpu_freq Unable to update policy for cpu:0. err:-19
834
835<3>[ 0.453325] msm_thermal:update_cpu_freq Unable to update policy for cpu:2. err:-19
836
837<3>[ 0.453335] msm_thermal:update_cpu_freq Unable to update policy for cpu:2. err:-19
838
839<6>[ 0.453506] pmi8994_boost_5v: no parameters
840
841<3>[ 0.453566] qcom,rpm-smd-regulator soc:qcom,rpm-smd:rpm-regulator-bstb:regulator-bst: Failed to find supply parent
842
843<3>[ 0.453661] rpm_vreg_device_probe: regulator_register failed: pmi8994_boost_5v, rc=-517
844
845<6>[ 0.453852] pmi8994_boost_pin_ctrl: no parameters
846
847<3>[ 0.453896] qcom,rpm-smd-regulator soc:qcom,rpm-smd:rpm-regulator-bstb:regulator-bst-pin-ctrl: Failed to find supply parent
848
849<3>[ 0.453980] rpm_vreg_device_probe: regulator_register failed: pmi8994_boost_pin_ctrl, rc=-517
850
851<6>[ 0.480630] KPI: Bootloader start count = 46181
852
853<6>[ 0.480647] KPI: Bootloader end count = 109732
854
855<6>[ 0.480654] KPI: Bootloader display count = 63211
856
857<6>[ 0.480662] KPI: Bootloader load kernel count = 2028
858
859<6>[ 0.480671] KPI: Kernel MPM timestamp = 132645
860
861<6>[ 0.480678] KPI: Kernel MPM Clock frequency = 32768
862
863<6>[ 0.480700] socinfo_print: v0.11, id=246, ver=3.1, raw_id=2375, raw_ver=4, hw_plat=1, hw_plat_ver=65536
864
865<6>[ 0.480700] accessory_chip=0, hw_plat_subtype=0, pmic_model=65545, pmic_die_revision=131072 foundry_id=3 serial_number=3077271212 num_pmics=2
866
867<6>[ 0.480954] gdsc_mmagic_bimc: no parameters
868
869<6>[ 0.481729] usb_otg_vreg: no parameters
870
871<3>[ 0.481791] reg-fixed-voltage soc:usb-otg-switch: Failed to find supply vin
872
873<3>[ 0.481889] reg-fixed-voltage soc:usb-otg-switch: Failed to register regulator: -517
874
875<6>[ 0.482050] rome_vreg: no parameters
876
877<6>[ 0.482670] vgaarb: loaded
878
879<3>[ 0.483160] chenjun:ak49xx_irq_probe: Enter
880
881<3>[ 0.483208] ak49xx_intc soc:ak49xx-irq: ak49xx_irq_probe: virq = 438
882
883<3>[ 0.483220] ak49xx_irq_probe data->es804_rst_gpio : -2
884
885<3>[ 0.483230] ak49xx_intc soc:ak49xx-irq: Looking up es804,cdc-reset-gpio property in node /soc/ak49xx-irq failed -2
886
887<3>[ 0.483266] ak49xx_irq_probe data->es804_ldo_gpio : 16
888
889<3>[ 0.483275] ak49xx_irq_get_pinctrl_configs(): Using Pinctrl
890
891<3>[ 0.483281] pinctrl lookup failed for cdc_int_cfgak49xx_irq_probe(): 2: es804_ldo_gpio(16) value(1)
892
893<5>[ 0.484835] SCSI subsystem initialized
894
895<6>[ 0.485746] usbcore: registered new interface driver usbfs
896
897<6>[ 0.485788] usbcore: registered new interface driver hub
898
899<6>[ 0.485931] usbcore: registered new device driver usb
900
901<4>[ 0.486293] soc:usb_nop_phy supply vcc not found, using dummy regulator
902
903<6>[ 0.486887] media: Linux media interface: v0.10
904
905<6>[ 0.486935] Linux video capture interface: v2.00
906
907<6>[ 0.570583] cpufreq: driver msm up and running
908
909<6>[ 0.571090] platform soc:qcom,ion:qcom,ion-heap@22: assigned reserved memory node adsp_region
910
911<6>[ 0.571213] platform soc:qcom,ion:qcom,ion-heap@27: assigned reserved memory node qseecom_region
912
913<6>[ 0.571327] platform soc:qcom,ion:qcom,ion-heap@10: assigned reserved memory node secure_region
914
915<6>[ 0.571540] ION heap system created
916
917<6>[ 0.571634] ION heap adsp created at 0x00000000ff800000 with size 400000
918
919<6>[ 0.571644] ION heap qsecom created at 0x00000000fe400000 with size 1400000
920
921<6>[ 0.571651] ION heap secure_display created at 0x00000000f8800000 with size 5c00000
922
923<6>[ 0.571658] ION heap secure_heap created
924
925<3>[ 0.572356] msm_bus_fabric_init_driver
926
927<3>[ 0.575104] msm-bus-type fab-a0noc: Error: Failed to get regulator bus-gdsc:-517
928
929<3>[ 0.575115] msm-bus-type fab-a0noc: Error: Failed to get regulator bus-a-gdsc:-517
930
931<3>[ 0.577776] msm-bus-type slv-vmem-cfg: Error: Failed to get regulator node-gdsc:-517
932
933<3>[ 0.578205] msm-bus-type slv-vmem: Error: Failed to get regulator node-gdsc:-517
934
935<3>[ 0.583631] msm-bus-type fab-a0noc: Error: Failed to get regulator aggre0-snoc-axi-no-rate:-517
936
937<3>[ 0.583642] msm-bus-type fab-a0noc: Error: Failed to get regulator aggre0-snoc-axi-no-rate:-517
938
939<3>[ 0.583651] msm-bus-type fab-a0noc: Error: Failed to get regulator aggre0-snoc-axi-no-rate:-517
940
941<3>[ 0.583759] msm-bus-type fab-mnoc: Error: Failed to get regulator mmagic-mdss-axi-no-rate:-517
942
943<3>[ 0.583778] msm-bus-type fab-mnoc: Error: Failed to get regulator mmagic-mdss-axi-no-rate:-517
944
945<3>[ 0.583797] msm-bus-type fab-mnoc: Error: Failed to get regulator mmagic-mdss-axi-no-rate:-517
946
947<3>[ 0.583815] msm-bus-type fab-mnoc: Error: Failed to get regulator mmagic-mdss-axi-no-rate:-517
948
949<3>[ 0.583833] msm-bus-type fab-mnoc: Error: Failed to get regulator mmagic-mdss-axi-no-rate:-517
950
951<3>[ 0.583851] msm-bus-type fab-mnoc: Error: Failed to get regulator mmagic-mdss-axi-no-rate:-517
952
953<3>[ 0.583869] msm-bus-type fab-mnoc: Error: Failed to get regulator mmagic-mdss-axi-no-rate:-517
954
955<6>[ 0.585165] qcom,qpnp-power-on qpnp-power-on-2: PMIC@SID0 Power-on reason: Triggered from Hard Reset and 'cold' boot
956
957<6>[ 0.585184] qcom,qpnp-power-on qpnp-power-on-2: PMIC@SID0: Power-off reason: Triggered from PS_HOLD (PS_HOLD/MSM controlled shutdown)
958
959<6>[ 0.585311] input: qpnp_pon as /devices/virtual/input/input0
960
961<6>[ 0.586344] pon_spare_reg: no parameters
962
963<6>[ 0.586394] qcom,qpnp-power-on qpnp-power-on-11: No PON config. specified
964
965<6>[ 0.586449] qcom,qpnp-power-on qpnp-power-on-11: PMIC@SID2 Power-on reason: Triggered from USB (USB charger insertion) and 'cold' boot
966
967<6>[ 0.586463] qcom,qpnp-power-on qpnp-power-on-11: PMIC@SID2: Power-off reason: Triggered from PS_HOLD (PS_HOLD/MSM controlled shutdown)
968
969<6>[ 0.586615] PMIC@SID0: PM8994 v2.0 options: 0, 0, 2, 2
970
971<6>[ 0.586704] PMIC@SID2: PMI8996 v1.1 options: 0, 0, 0, 0
972
973<3>[ 0.587720] ipa ipa_uc_state_check:291 uC interface not initialized
974
975<3>[ 0.587729] ipa ipa_sps_irq_control_all:932 EP (2) not allocated.
976
977<3>[ 0.587733] ipa ipa_sps_irq_control_all:932 EP (5) not allocated.
978
979<3>[ 0.589270] sps_register_bam_device : unable to create IPC Logging 0 for bam 0x0000000000684000
980
981<3>[ 0.589279] sps_register_bam_device : unable to create IPC Logging 1 for bam 0x0000000000684000sps_register_bam_device : unable to create IPC Logging 2 for bam 0x0000000000684000
982
983<3>[ 0.589295] sps_register_bam_device : unable to create IPC Logging 3 for bam 0x0000000000684000sps_register_bam_device : unable to create IPC Logging 4 for bam 0x0000000000684000
984
985<6>[ 0.589314] sps:BAM 0x0000000000684000 is registered.<3>[ 0.589906] ipa ipa_uc_state_check:291 uC interface not initialized
986
987<6>[ 0.590142] sps:BAM 0x0000000000684000 (va:0xffffff8001b40000) enabled: ver:0x27, number of pipes:20
988
989<3>[ 0.591424] ipa ipa_uc_state_check:291 uC interface not initialized
990
991<3>[ 0.598929] ipa ipa_uc_state_check:291 uC interface not initialized
992
993<6>[ 0.600589] IPA driver initialization was successful.
994
995<6>[ 0.601852] gdsc_mmagic_video: no parameters
996
997<6>[ 0.602082] gdsc_mmagic_mdss: no parameters
998
999<6>[ 0.602251] gdsc_mmagic_camss: no parameters
1000
1001<6>[ 0.602479] gdsc_venus: no parameters
1002
1003<6>[ 0.602498] gdsc_venus: supplied by gdsc_mmagic_video
1004
1005<6>[ 0.602665] gdsc_venus_core0: fast normal
1006
1007<6>[ 0.602846] gdsc_venus_core1: fast normal
1008
1009<6>[ 0.603016] gdsc_camss_top: no parameters
1010
1011<6>[ 0.603032] gdsc_camss_top: supplied by gdsc_mmagic_camss
1012
1013<6>[ 0.603212] gdsc_vfe0: no parameters
1014
1015<6>[ 0.603236] gdsc_vfe0: supplied by gdsc_camss_top
1016
1017<6>[ 0.603402] gdsc_vfe1: no parameters
1018
1019<6>[ 0.603417] gdsc_vfe1: supplied by gdsc_camss_top
1020
1021<6>[ 0.603601] gdsc_mdss: no parameters
1022
1023<6>[ 0.603616] gdsc_mdss: supplied by gdsc_mmagic_mdss
1024
1025<6>[ 0.603895] gdsc_jpeg: no parameters
1026
1027<6>[ 0.603910] gdsc_jpeg: supplied by gdsc_camss_top
1028
1029<6>[ 0.604069] gdsc_cpp: no parameters
1030
1031<6>[ 0.604084] gdsc_cpp: supplied by gdsc_camss_top
1032
1033<6>[ 0.604265] gdsc_pcie_0: no parameters
1034
1035<6>[ 0.604397] gdsc_pcie_1: no parameters
1036
1037<6>[ 0.604563] gdsc_pcie_2: no parameters
1038
1039<6>[ 0.604694] gdsc_usb30: no parameters
1040
1041<6>[ 0.604825] gdsc_ufs: no parameters
1042
1043<6>[ 0.605047] gdsc_fd: no parameters
1044
1045<6>[ 0.605065] gdsc_fd: supplied by gdsc_camss_top
1046
1047<6>[ 0.605231] gdsc_gpu: no parameters
1048
1049<6>[ 0.605400] gdsc_gpu_gx: no parameters
1050
1051<6>[ 0.605757] gdsc_gpu_gx: supplied by gfx_corner
1052
1053<6>[ 0.605951] gdsc_hlos1_vote_aggre0_noc: no parameters
1054
1055<6>[ 0.606084] gdsc_hlos1_vote_lpass_adsp: no parameters
1056
1057<6>[ 0.606216] gdsc_hlos1_vote_lpass_core: no parameters
1058
1059<6>[ 0.606372] gdsc_aggre0_noc: no parameters
1060
1061<6>[ 0.608564] mdss_pll_probe: MDSS pll label = MDSS DSI 0 PLL
1062
1063<6>[ 0.608581] mdss_pll_probe: mdss_pll_probe: label=MDSS DSI 0 PLL PLL SSC enabled
1064
1065<6>[ 0.610871] dsi_pll_clock_register_8996: Registered DSI PLL ndx=0 clocks successfully
1066
1067<6>[ 0.610954] mdss_pll_probe: MDSS pll label = MDSS DSI 1 PLL
1068
1069<6>[ 0.610963] mdss_pll_probe: mdss_pll_probe: label=MDSS DSI 1 PLL PLL SSC enabled
1070
1071<3>[ 0.612063] pll_is_pll_locked_8996: DSI PLL ndx=1 status=0 failed to Lock
1072
1073<6>[ 0.612588] dsi_pll_clock_register_8996: Registered DSI PLL ndx=1 clocks successfully
1074
1075<6>[ 0.612626] mdss_pll_probe: MDSS pll label = MDSS HDMI PLL
1076
1077<3>[ 0.612633] mdss_pll_probe: Unable to get the cell-index rc=-22
1078
1079<3>[ 0.628676] arm-smmu d80000.arm,smmu-jpeg: found 4 context interrupt(s) but have 3 context banks. assuming 3 context interrupts.
1080
1081<3>[ 0.636880] arm-smmu b40000.arm,smmu-kgsl: found 4 context interrupt(s) but have 2 context banks. assuming 2 context interrupts.
1082
1083<3>[ 0.645984] arm-smmu da0000.arm,smmu-vfe: found 4 context interrupt(s) but have 2 context banks. assuming 2 context interrupts.
1084
1085<3>[ 0.655600] arm-smmu d40000.arm,smmu-venus: found 11 context interrupt(s) but have 7 context banks. assuming 7 context interrupts.
1086
1087<3>[ 0.664799] arm-smmu d00000.arm,smmu-mdp: found 4 context interrupt(s) but have 2 context banks. assuming 2 context interrupts.
1088
1089<3>[ 0.673969] arm-smmu d20000.arm,smmu-rot: found 4 context interrupt(s) but have 2 context banks. assuming 2 context interrupts.
1090
1091<3>[ 0.683102] arm-smmu d60000.arm,smmu-cpp_fd: found 4 context interrupt(s) but have 3 context banks. assuming 3 context interrupts.
1092
1093<3>[ 0.691406] arm-smmu 1600000.arm,smmu-lpass_q6: found 16 context interrupt(s) but have 12 context banks. assuming 12 context interrupts.
1094
1095<3>[ 0.699459] arm-smmu 1640000.arm,smmu-anoc0: found 6 context interrupt(s) but have 7 context banks. assuming 7 context interrupts.
1096
1097<3>[ 0.707280] arm-smmu 1660000.arm,smmu-anoc1: found 8 context interrupt(s) but have 4 context banks. assuming 4 context interrupts.
1098
1099<3>[ 0.715141] arm-smmu 1680000.arm,smmu-anoc2: found 12 context interrupt(s) but have 8 context banks. assuming 8 context interrupts.
1100
1101<6>[ 0.718043] Advanced Linux Sound Architecture Driver Initialized.
1102
1103<6>[ 0.718620] Bluetooth: Core ver 2.19
1104
1105<6>[ 0.718698] NET: Registered protocol family 31
1106
1107<6>[ 0.718704] Bluetooth: HCI device and connection manager initialized
1108
1109<6>[ 0.718719] Bluetooth: HCI socket layer initialized
1110
1111<6>[ 0.718728] Bluetooth: L2CAP socket layer initialized
1112
1113<6>[ 0.718754] Bluetooth: SCO socket layer initialized
1114
1115<6>[ 0.719123] cfg80211: Calling CRDA to update world regulatory domain
1116
1117<6>[ 0.719149] cfg80211: World regulatory domain updated:
1118
1119<6>[ 0.719157] cfg80211: DFS Master region: unset
1120
1121<6>[ 0.719163] cfg80211: (start_freq - end_freq @ bandwidth), (max_antenna_gain, max_eirp), (dfs_cac_time)
1122
1123<6>[ 0.719175] cfg80211: (2402000 KHz - 2472000 KHz @ 40000 KHz), (N/A, 2000 mBm), (N/A)
1124
1125<6>[ 0.719181] cfg80211: (2457000 KHz - 2482000 KHz @ 40000 KHz), (N/A, 2000 mBm), (N/A)
1126
1127<6>[ 0.719186] cfg80211: (2474000 KHz - 2494000 KHz @ 20000 KHz), (N/A, 2000 mBm), (N/A)
1128
1129<6>[ 0.719192] cfg80211: (5170000 KHz - 5250000 KHz @ 80000 KHz), (N/A, 2000 mBm), (N/A)
1130
1131<6>[ 0.719197] cfg80211: (5250000 KHz - 5330000 KHz @ 80000 KHz), (N/A, 2000 mBm), (N/A)
1132
1133<6>[ 0.719204] cfg80211: (5490000 KHz - 5710000 KHz @ 80000 KHz), (N/A, 2000 mBm), (N/A)
1134
1135<6>[ 0.719210] cfg80211: (5735000 KHz - 5835000 KHz @ 80000 KHz), (N/A, 2000 mBm), (N/A)
1136
1137<6>[ 0.719215] cfg80211: (57240000 KHz - 63720000 KHz @ 2160000 KHz), (N/A, 0 mBm), (N/A)
1138
1139<1>[ 0.719380] pcie:pcie_init.
1140
1141<3>[ 0.719386] pcie_init: unable to create IPC log context for pcie0-short
1142
1143<3>[ 0.719392] pcie_init: unable to create IPC log context for pcie0-long
1144
1145<3>[ 0.719398] pcie_init: unable to create IPC log context for pcie0-dump
1146
1147<3>[ 0.719403] pcie_init: unable to create IPC log context for pcie1-short
1148
1149<3>[ 0.719409] pcie_init: unable to create IPC log context for pcie1-long
1150
1151<3>[ 0.719413] pcie_init: unable to create IPC log context for pcie1-dump
1152
1153<3>[ 0.719418] pcie_init: unable to create IPC log context for pcie2-short
1154
1155<3>[ 0.719424] pcie_init: unable to create IPC log context for pcie2-long
1156
1157<3>[ 0.719429] pcie_init: unable to create IPC log context for pcie2-dump
1158
1159<4>[ 0.721333] 600000.qcom,pcie supply vreg-3.3 not found, using dummy regulator
1160
1161<3>[ 0.723801] msm_pcie_get_resources: PCIe: RC0 can't get tcsr resource.
1162
1163<4>[ 0.724801] 608000.qcom,pcie supply vreg-3.3 not found, using dummy regulator
1164
1165<3>[ 0.726955] msm_pcie_get_resources: PCIe: RC1 can't get tcsr resource.
1166
1167<4>[ 0.727919] 610000.qcom,pcie supply vreg-3.3 not found, using dummy regulator
1168
1169<3>[ 0.731066] msm_pcie_get_resources: PCIe: RC2 can't get tcsr resource.
1170
1171<6>[ 0.733576] pmi8994_boost_5v: no parameters
1172
1173<6>[ 0.733845] pmi8994_boost_5v: supplied by pon_spare_reg
1174
1175<6>[ 0.734333] pmi8994_boost_pin_ctrl: no parameters
1176
1177<6>[ 0.734517] pmi8994_boost_pin_ctrl: supplied by pon_spare_reg
1178
1179<6>[ 0.735197] ibb_reg: 4600 <--> 6000 mV at 5500 mV
1180
1181<6>[ 0.735615] lab_reg: 4600 <--> 6000 mV at 5500 mV
1182
1183<6>[ 0.736323] usb_otg_vreg: no parameters
1184
1185<3>[ 0.736487] reg-fixed-voltage soc:usb-otg-switch: Failed to find supply vin
1186
1187<3>[ 0.736607] reg-fixed-voltage soc:usb-otg-switch: Failed to register regulator: -517
1188
1189<6>[ 0.737103] Switched to clocksource arch_sys_counter
1190
1191<6>[ 0.740551] unable to find DT imem sdlog mem addr node, use sdlog addr
1192
1193<6>[ 0.743374] unable to find DT imem sdlog mem size node, use sdlog size
1194
1195<4>[ 0.743420] msm_tb_dev_init
1196
1197<4>[ 0.743617] msm_tb_dev_init - succeed
1198
1199<6>[ 0.746280] zte_misc_probe +++++
1200
1201<6>[ 0.746297] zte_misc: translate hardware pin to system pin
1202
1203<3>[ 0.748753] unable to find DT imem msm-imem-pm_parameter node
1204
1205<6>[ 0.748768] is_haptics=0
1206
1207<6>[ 0.749671] board_id=3
1208
1209<6>[ 0.749686] fingerprint_hw=0 GOODIX
1210
1211<6>[ 0.749691] zte_misc_probe ----
1212
1213<6>[ 0.750659] bcl_peripheral:bcl_perph_init BCL Initialized
1214
1215<4>[ 0.751103] [zte]psy change, func __power_supply_register,line 828,psy name: fg_adc
1216
1217<6>[ 0.752942] NET: Registered protocol family 2
1218
1219<6>[ 0.753510] TCP established hash table entries: 32768 (order: 6, 262144 bytes)
1220
1221<6>[ 0.753592] TCP bind hash table entries: 32768 (order: 7, 524288 bytes)
1222
1223<6>[ 0.753890] TCP: Hash tables configured (established 32768 bind 32768)
1224
1225<6>[ 0.754015] TCP: reno registered
1226
1227<6>[ 0.754031] UDP hash table entries: 2048 (order: 4, 65536 bytes)
1228
1229<6>[ 0.754053] UDP-Lite hash table entries: 2048 (order: 4, 65536 bytes)
1230
1231<6>[ 0.754379] NET: Registered protocol family 1
1232
1233<7>[ 0.754441] PCI: CLS 0 bytes, default 128
1234
1235<6>[ 0.755263] usb_otg_vreg: no parameters
1236
1237<3>[ 0.755405] reg-fixed-voltage soc:usb-otg-switch: Failed to find supply vin
1238
1239<3>[ 0.755493] reg-fixed-voltage soc:usb-otg-switch: Failed to register regulator: -517
1240
1241<6>[ 0.755990] Unpacking initramfs...
1242
1243<6>[ 0.942989] Freeing initrd memory: 9056K (ffffffc002600000 - ffffffc002ed8000)
1244
1245<6>[ 0.944724] kryo perfevents: CPU pmu for kryo-pmuv3 detected
1246
1247<6>[ 0.949735] futex hash table entries: 1024 (order: 5, 131072 bytes)
1248
1249<5>[ 0.949851] Initialise system trusted keyring
1250
1251<6>[ 0.949935] audit: initializing netlink subsys (disabled)
1252
1253<5>[ 0.950580] audit: type=2000 audit(0.949:1): initialized
1254
1255<4>[ 0.950989] vmscan: error setting kswapd cpu affinity mask
1256
1257<6>[ 0.954280] exfat: init_exfat_fs: exFAT Filesystem version 1.2.24
1258
1259<6>[ 0.954626] fuse init (API version 7.23)
1260
1261<6>[ 0.955294] pfk [pfk_init]: Driver initialized successfully
1262
1263<6>[ 0.956544] Block layer SCSI generic (bsg) driver version 0.4 loaded (major 246)
1264
1265<6>[ 0.956563] io scheduler noop registered (default)
1266
1267<4>[ 0.967364] mdss_mdp_parse_dt_hw_settings: MDSS VBIF settings not found
1268
1269<6>[ 0.967413] mdss_mdp_parse_dt_prop_len: prop qcom,mdss-smp-data : doesn't exist in device tree
1270
1271<6>[ 0.967486] mdss_mdp_pipe_addr_setup: type:1 ftchid:0 xinid:0 num:0 ndx:0x1 prio:0
1272
1273<6>[ 0.967493] mdss_mdp_pipe_addr_setup: type:1 ftchid:0 xinid:4 num:1 ndx:0x2 prio:1
1274
1275<6>[ 0.967498] mdss_mdp_pipe_addr_setup: type:1 ftchid:0 xinid:8 num:2 ndx:0x4 prio:2
1276
1277<6>[ 0.967507] mdss_mdp_pipe_addr_setup: type:2 ftchid:0 xinid:1 num:3 ndx:0x8 prio:4
1278
1279<6>[ 0.967512] mdss_mdp_pipe_addr_setup: type:2 ftchid:0 xinid:5 num:4 ndx:0x10 prio:5
1280
1281<6>[ 0.967517] mdss_mdp_pipe_addr_setup: type:2 ftchid:0 xinid:9 num:5 ndx:0x20 prio:6
1282
1283<6>[ 0.967525] mdss_mdp_pipe_addr_setup: type:3 ftchid:0 xinid:2 num:6 ndx:0x40 prio:8
1284
1285<6>[ 0.967530] mdss_mdp_pipe_addr_setup: type:3 ftchid:0 xinid:10 num:7 ndx:0x80 prio:9
1286
1287<6>[ 0.967535] mdss_mdp_pipe_addr_setup: type:1 ftchid:0 xinid:12 num:8 ndx:0x100 prio:3
1288
1289<6>[ 0.967540] mdss_mdp_pipe_addr_setup: type:2 ftchid:0 xinid:13 num:9 ndx:0x200 prio:7
1290
1291<3>[ 0.967556] mdss_mdp_parse_dt_handler: Error from prop qcom,mdss-pipe-sw-reset-off : u32 array read
1292
1293<6>[ 0.967584] mdss_mdp_pipe_addr_setup: type:4 ftchid:-1 xinid:7 num:10 ndx:0x400 prio:0
1294
1295<6>[ 0.967590] mdss_mdp_pipe_addr_setup: type:4 ftchid:-1 xinid:7 num:11 ndx:0x800 prio:1
1296
1297<6>[ 0.967595] mdss_mdp_parse_dt_pipe: dedicated vp cursors detected, num=2
1298
1299<3>[ 0.967663] mdss_mdp_parse_dt_handler: Error from prop qcom,mdss-ib-factor-overlap : u32 array read
1300
1301<6>[ 0.967676] mdss_mdp_parse_dt_prop_len: prop qcom,mdss-clk-levels : doesn't exist in device tree
1302
1303<6>[ 0.967713] mdss_mdp_parse_dt_prop_len: prop qcom,mdss-smp-data : doesn't exist in device tree
1304
1305<3>[ 0.968622] mdss_mdp_irq_clk_register: unable to get clk: lut_clk
1306
1307<6>[ 0.970288] xlog_status: enable:0, panic:1, dump:2
1308
1309<3>[ 0.970622] OF: no ranges; cannot translate
1310
1311<3>[ 0.970638] OF: no ranges; cannot translate
1312
1313<3>[ 0.971129] OF: no ranges; cannot translate
1314
1315<3>[ 0.971138] OF: no ranges; cannot translate
1316
1317<3>[ 0.971244] OF: no ranges; cannot translate
1318
1319<3>[ 0.971252] OF: no ranges; cannot translate
1320
1321<3>[ 0.971358] OF: no ranges; cannot translate
1322
1323<3>[ 0.971367] OF: no ranges; cannot translate
1324
1325<3>[ 0.971649] mdss_smmu_attach_v2: iommu device not attached for domain[0]
1326
1327<3>[ 0.971657] mdss_mdp_clk_ctrl: IOMMU attach failed
1328
1329<3>[ 0.971664] No change in context(0==0), skip
1330
1331<6>[ 0.973265] mdss_mdp_probe: mdss version = 0x10070002, bootloader display is on
1332
1333<6>[ 0.978031] mdss_smmu_probe: iommu v2 domain[0] mapping and clk register successful!
1334
1335<6>[ 0.978183] mdss_smmu_probe: iommu v2 domain[1] mapping and clk register successful!
1336
1337<6>[ 0.978283] mdss_smmu_probe: iommu v2 domain[2] mapping and clk register successful!
1338
1339<6>[ 0.978389] mdss_smmu_probe: iommu v2 domain[3] mapping and clk register successful!
1340
1341<6>[ 0.980911] mdss_dsi_ctrl_probe: DSI Ctrl name = MDSS DSI CTRL->0
1342
1343<4>[ 0.981127] mdss_dsi_config_panel:2731:dsi specific cfg not present
1344
1345<6>[ 0.981138] mdss_dsi_panel_init: Panel Name = zteSAM_S6E3HA3_SAM_25601440_5P5Inch
1346
1347<6>[ 0.981221] mdss_dsi_panel_timing_from_dt: found new timing "qcom,mdss_dsi_zte_samsung_5p5_wqhd_dualmipi_cmd" (ffffffc0f989b4f8)
1348
1349<3>[ 0.981234] mdss_dsi_parse_dcs_cmds: failed, key=qcom,mdss-dsi-post-panel-on-command
1350
1351<3>[ 0.981241] mdss_dsi_parse_dcs_cmds: failed, key=qcom,mdss-dsi-timing-switch-command
1352
1353<6>[ 0.981307] mdss_dsi_parse_panel_features: partial_update_enabled=0
1354
1355<6>[ 0.981314] mdss_dsi_parse_panel_features: ulps feature enabled
1356
1357<6>[ 0.981321] mdss_dsi_parse_panel_features: ulps during suspend feature disabled
1358
1359<6>[ 0.981327] mdss_dsi_parse_dms_config: dynamic switch feature enabled: 0
1360
1361<4>[ 0.981356] LCD mdss_dsi_parse_esd_params:,zte,esd-interrupt-gpio found:53!
1362
1363<4>[ 0.981361] LCD mdss_dsi_parse_esd_params:,zte,lcd-esd-gpio-enable:0
1364
1365<3>[ 0.981365] LCD mdss_dsi_parse_esd_params:, zte,lcd-esd-gpio not specified :-2
1366
1367<3>[ 0.981817] mdss_dsi_parse_ctrl_params:3778 Unable to read qcom,display-id, data= (null),len=20
1368
1369<6>[ 0.981870] mdss_dsi_parse_gpio_params: bklt_en gpio not specified
1370
1371<3>[ 0.981908] msm_dss_get_res_byname: 'dsi_phy_regulator' resource not found
1372
1373<3>[ 0.981929] mdss_dsi_retrieve_ctrl_resources+0x150/0x1bc->msm_dss_ioremap_byname: 'dsi_phy_regulator' msm_dss_get_res_byname failed
1374
1375<6>[ 0.981934] mdss_dsi_retrieve_ctrl_resources: ctrl_base=ffffff8001b72000 ctrl_size=400 phy_base=ffffff8001b74400 phy_size=588
1376
1377<6>[ 0.982058] dsi_panel_device_register: Continuous splash enabled
1378
1379<6>[ 0.982630] mdss_register_panel: adding framebuffer device 994000.qcom,mdss_dsi_ctrl0
1380
1381<4>[ 0.983142] LCD 3v_power GPIO(vsp):40 , Enable:1
1382
1383<6>[ 1.000500] mdss_dsi_ctrl_probe: Dsi Ctrl->0 initialized, DSI rev:0x10040001, PHY rev:0x2
1384
1385<6>[ 1.001113] mdss_dsi_ctrl_probe: DSI Ctrl name = MDSS DSI CTRL->1
1386
1387<4>[ 1.001318] mdss_dsi_config_panel:2731:dsi specific cfg not present
1388
1389<6>[ 1.001329] mdss_dsi_panel_init: Panel Name = zteSAM_S6E3HA3_SAM_25601440_5P5Inch
1390
1391<6>[ 1.001417] mdss_dsi_panel_timing_from_dt: found new timing "qcom,mdss_dsi_zte_samsung_5p5_wqhd_dualmipi_cmd" (ffffffc0f989b4f8)
1392
1393<3>[ 1.001429] mdss_dsi_parse_dcs_cmds: failed, key=qcom,mdss-dsi-post-panel-on-command
1394
1395<3>[ 1.001435] mdss_dsi_parse_dcs_cmds: failed, key=qcom,mdss-dsi-timing-switch-command
1396
1397<6>[ 1.001497] mdss_dsi_parse_panel_features: partial_update_enabled=0
1398
1399<6>[ 1.001504] mdss_dsi_parse_panel_features: ulps feature enabled
1400
1401<6>[ 1.001510] mdss_dsi_parse_panel_features: ulps during suspend feature disabled
1402
1403<6>[ 1.001516] mdss_dsi_parse_dms_config: dynamic switch feature enabled: 0
1404
1405<4>[ 1.001527] LCD mdss_dsi_parse_esd_params:,zte,lcd-esd-gpio-enable:0
1406
1407<3>[ 1.001533] LCD mdss_dsi_parse_esd_params:, zte,lcd-esd-gpio not specified :-2
1408
1409<3>[ 1.001916] mdss_dsi_parse_ctrl_params:3778 Unable to read qcom,display-id, data= (null),len=20
1410
1411<3>[ 1.001948] request lcd_3v_vsp_en_gpio failed, rc=-16
1412
1413<6>[ 1.001966] mdss_dsi_parse_gpio_params: bklt_en gpio not specified
1414
1415<3>[ 1.002001] msm_dss_get_res_byname: 'dsi_phy_regulator' resource not found
1416
1417<3>[ 1.002022] mdss_dsi_retrieve_ctrl_resources+0x150/0x1bc->msm_dss_ioremap_byname: 'dsi_phy_regulator' msm_dss_get_res_byname failed
1418
1419<6>[ 1.002027] mdss_dsi_retrieve_ctrl_resources: ctrl_base=ffffff8001b78000 ctrl_size=400 phy_base=ffffff8001b7a400 phy_size=558
1420
1421<6>[ 1.002050] dsi_panel_device_register: Continuous splash enabled
1422
1423<3>[ 1.002638] panel_debug_register_base: debugfs_create_file: data_type fail
1424
1425<4>[ 1.002796] LCD 3v_power GPIO(vsp):40 , Enable:1
1426
1427<6>[ 1.020240] mdss_dsi_ctrl_probe: Dsi Ctrl->1 initialized, DSI rev:0x10040001, PHY rev:0x2
1428
1429<4>[ 1.020245] ------------[ cut here ]------------
1430
1431<4>[ 1.020253] WARNING: CPU: 3 PID: 1 at ../kernel/power/qos.c:496 mdss_dsi_ctrl_probe+0x6cc/0x6e4()
1432
1433<3>[ 1.020258] pm_qos_add_request() called for already added request
1434
1435<4>[ 1.020268] CPU: 3 PID: 1 Comm: swapper/0 Not tainted 3.18.45-twrp-ailsa_ii-2.0 #1
1436
1437<4>[ 1.020272] Hardware name: Qualcomm Technologies, Inc. MSM 8996 v3 + PMI8996 MTP (DT)
1438
1439<0>[ 1.020279] Call trace:
1440
1441<4>[ 1.020291] [<ffffffc000206200>] dump_backtrace+0x0/0xf4
1442
1443<4>[ 1.020320] ---[ end trace 307f3b7a54f85370 ]---
1444
1445<6>[ 1.021593] mdss_dsi_status_init: DSI status check interval:1000
1446
1447<3>[ 1.022493] hdmi_tx_get_dt_data:5302 Unable to read qcom,display-id, data= (null),len=0
1448
1449<6>[ 1.022907] hdmi_tx_init_resource: 'core_physical': start = 0xffffff8001b7e000, len=0x50c
1450
1451<6>[ 1.022917] hdmi_tx_init_resource: 'qfprom_physical': start = 0xffffff8001c88000, len=0x6158
1452
1453<6>[ 1.023027] hdmi_tx_init_resource: 'hdcp_physical': start = 0xffffff8001c82000, len=0xfff
1454
1455<6>[ 1.023962] mdss_register_panel: adding framebuffer device 9a0000.qcom,hdmi_tx
1456
1457<6>[ 1.026010] mdss_register_panel: adding framebuffer device soc:qcom,mdss_wb_panel
1458
1459<6>[ 1.027634] mdss_fb_probe: fb0: split_mode:2 left:720 right:720
1460
1461<6>[ 1.028432] mdss_fb_register: FrameBuffer[0] 1440x2560 registered successfully!
1462
1463<6>[ 1.029379] mdss_fb_probe: fb1: split_mode:0 left:0 right:0
1464
1465<6>[ 1.029459] mdss_fb_register: FrameBuffer[1] 640x480 registered successfully!
1466
1467<6>[ 1.033538] mdss_fb_probe: fb2: split_mode:0 left:0 right:0
1468
1469<6>[ 1.033701] mdss_fb_register: FrameBuffer[2] 640x480 registered successfully!
1470
1471<3>[ 1.033775] mdss_mdp_splash_parse_dt: splash mem child node is not present
1472
1473<3>[ 1.037041] glink_loopback_server_init: unable to create log context
1474
1475<3>[ 1.037337] msm_smp2p_init: unable to create log context
1476
1477<3>[ 1.039685] qmi_log_init: Unable to create QMI IPC logging for Req/Resp
1478
1479<3>[ 1.039699] logging for Indications: Unable to create QMI IPC qmi_log_init<6>[ 1.047836] l2cache-pmu soc:l2-pmu: Registered L2 cache PMU using 2 HW PMUs
1480
1481<3>[ 1.053499] smd_channel_probe_now: allocation table not initialized
1482
1483<6>[ 1.056476] input: qbt1000_key_input as /devices/virtual/input/input1
1484
1485<3>[ 1.058097] uart_tx_gpio is not available
1486
1487<3>[ 1.058111] uart_rx_gpio is not available
1488
1489<3>[ 1.058115] uart_cts_gpio is not available
1490
1491<3>[ 1.058120] uart_rfr_gpio is not available
1492
1493<3>[ 1.058254] msm_serial_hs 7570000.uart: msm_hs_probe: error creating logging context
1494
1495<3>[ 1.058902] sps: BAM device 0x0000000007544000 is not registered yet.
1496
1497<3>[ 1.058920] sps_register_bam_device : unable to create IPC Logging 0 for bam 0x0000000007544000
1498
1499<3>[ 1.058926] sps_register_bam_device : unable to create IPC Logging 1 for bam 0x0000000007544000sps_register_bam_device : unable to create IPC Logging 2 for bam 0x0000000007544000
1500
1501<3>[ 1.058937] sps_register_bam_device : unable to create IPC Logging 3 for bam 0x0000000007544000sps_register_bam_device : unable to create IPC Logging 4 for bam 0x0000000007544000
1502
1503<6>[ 1.058950] sps:BAM 0x0000000007544000 is registered.<3>[ 1.059280] msm_serial_hs 7570000.uart: msm_hs_probe: error creating tx logging context
1504
1505<3>[ 1.059287] msm_serial_hs 7570000.uart: msm_hs_probe: error creating rx logging context
1506
1507<3>[ 1.059293] msm_serial_hs 7570000.uart: msm_hs_probe: error creating usr logging context
1508
1509<6>[ 1.060568] 7570000.uart: ttyHS0 at MMIO 0x7570000 (irq = 21, base_baud = 460800) is a MSM HS UART
1510
1511<6>[ 1.062677] msm_serial_hs module loaded since 160624
1512
1513<3>[ 1.062704] smd_tty_log_init: Unable to create IPC log
1514
1515<3>[ 1.066833] diag: Failed to create IPC logging context
1516
1517<6>[ 1.077085] loop: module loaded
1518
1519<6>[ 1.078035] QSEECOM: qseecom_probe: qseecom.qsee_version = 0x1000000
1520
1521<4>[ 1.078076] QSEECOM: qseecom_retrieve_ce_data: Device does not support PFE
1522
1523<6>[ 1.078083] QSEECOM: qseecom_probe: no-clock-support=0x1<4>[ 1.078090] QSEECOM: qseecom_probe: qseecom.qsee_reentrancy_support = 2
1524
1525<6>[ 1.079958] ak49xx_init: succeed in registering ak4960_slim_driver
1526
1527<6>[ 1.079980] ak49xx_init: succeed in registering ak4960_spi_driver
1528
1529<6>[ 1.079995] ak49xx_init: succeed in registering ak4961_slim_driver
1530
1531<6>[ 1.080012] ak49xx_init: succeed in registering ak4961_spi_driver
1532
1533<4>[ 1.080113] i2c-core: driver [tabla-i2c-core] using legacy suspend method
1534
1535<4>[ 1.080117] i2c-core: driver [tabla-i2c-core] using legacy resume method
1536
1537<4>[ 1.080164] i2c-core: driver [wcd9xxx-i2c-core] using legacy suspend method
1538
1539<4>[ 1.080168] i2c-core: driver [wcd9xxx-i2c-core] using legacy resume method
1540
1541<4>[ 1.080219] i2c-core: driver [tasha-i2c-core] using legacy suspend method
1542
1543<4>[ 1.080223] i2c-core: driver [tasha-i2c-core] using legacy resume method
1544
1545<6>[ 1.083337] qce 660000.qcedev: Qualcomm Crypto 5.3.1 device found @0x660000
1546
1547<6>[ 1.083356] qce 660000.qcedev: CE device = 0x0
1548
1549<6>[ 1.083356] , IO base, CE = 0xffffff80026c0000
1550
1551<6>[ 1.083356] , Consumer (IN) PIPE 2, Producer (OUT) PIPE 3
1552
1553<6>[ 1.083356] IO base BAM = 0x (null)
1554
1555<6>[ 1.083356] BAM IRQ 251
1556
1557<6>[ 1.083356] Engines Availability = 0x2011053
1558
1559<3>[ 1.083394] sps_register_bam_device : unable to create IPC Logging 0 for bam 0x0000000000644000
1560
1561<3>[ 1.083399] sps_register_bam_device : unable to create IPC Logging 1 for bam 0x0000000000644000sps_register_bam_device : unable to create IPC Logging 2 for bam 0x0000000000644000
1562
1563<3>[ 1.083410] sps_register_bam_device : unable to create IPC Logging 3 for bam 0x0000000000644000sps_register_bam_device : unable to create IPC Logging 4 for bam 0x0000000000644000
1564
1565<6>[ 1.083422] sps:BAM 0x0000000000644000 is registered.<6>[ 1.083634] sps:BAM 0x0000000000644000 (va:0xffffff80035c0000) enabled: ver:0x27, number of pipes:16
1566
1567<6>[ 1.083850] QCE50: qce_sps_init: Qualcomm MSM CE-BAM at 0x0000000000644000 irq 251
1568
1569<6>[ 1.091857] qcrypto 660000.qcrypto: Qualcomm Crypto 5.3.1 device found @0x660000
1570
1571<6>[ 1.091879] qcrypto 660000.qcrypto: CE device = 0x0
1572
1573<6>[ 1.091879] , IO base, CE = 0xffffff8003740000
1574
1575<6>[ 1.091879] , Consumer (IN) PIPE 4, Producer (OUT) PIPE 5
1576
1577<6>[ 1.091879] IO base BAM = 0x (null)
1578
1579<6>[ 1.091879] BAM IRQ 251
1580
1581<6>[ 1.091879] Engines Availability = 0x2011053
1582
1583<6>[ 1.092200] QCE50: qce_sps_init: Qualcomm MSM CE-BAM at 0x0000000000644000 irq 251
1584
1585<6>[ 1.098092] qcrypto 660000.qcrypto: qcrypto-ecb-aes
1586
1587<6>[ 1.098190] qcrypto 660000.qcrypto: qcrypto-cbc-aes
1588
1589<6>[ 1.098289] qcrypto 660000.qcrypto: qcrypto-ctr-aes
1590
1591<6>[ 1.098381] qcrypto 660000.qcrypto: qcrypto-ecb-des
1592
1593<6>[ 1.098448] qcrypto 660000.qcrypto: qcrypto-cbc-des
1594
1595<6>[ 1.098515] qcrypto 660000.qcrypto: qcrypto-ecb-3des
1596
1597<6>[ 1.098581] qcrypto 660000.qcrypto: qcrypto-cbc-3des
1598
1599<6>[ 1.098647] qcrypto 660000.qcrypto: qcrypto-xts-aes
1600
1601<6>[ 1.098714] qcrypto 660000.qcrypto: qcrypto-sha1
1602
1603<6>[ 1.098782] qcrypto 660000.qcrypto: qcrypto-sha256
1604
1605<6>[ 1.098851] qcrypto 660000.qcrypto: qcrypto-aead-hmac-sha1-cbc-aes
1606
1607<6>[ 1.098916] qcrypto 660000.qcrypto: qcrypto-aead-hmac-sha1-cbc-des
1608
1609<6>[ 1.098982] qcrypto 660000.qcrypto: qcrypto-aead-hmac-sha1-cbc-3des
1610
1611<6>[ 1.099048] qcrypto 660000.qcrypto: qcrypto-aead-hmac-sha256-cbc-aes
1612
1613<6>[ 1.099115] qcrypto 660000.qcrypto: qcrypto-aead-hmac-sha256-cbc-des
1614
1615<6>[ 1.099188] qcrypto 660000.qcrypto: qcrypto-aead-hmac-sha256-cbc-3des
1616
1617<6>[ 1.099254] qcrypto 660000.qcrypto: qcrypto-hmac-sha1
1618
1619<6>[ 1.099322] qcrypto 660000.qcrypto: qcrypto-hmac-sha256
1620
1621<6>[ 1.099391] qcrypto 660000.qcrypto: qcrypto-aes-ccm
1622
1623<6>[ 1.099456] qcrypto 660000.qcrypto: qcrypto-rfc4309-aes-ccm
1624
1625<6>[ 1.102033] ICE IRQ = 33
1626
1627<3>[ 1.102169] qcom_ice_get_device_tree_data: No vdd-hba-supply regulator, assuming not needed
1628
1629<6>[ 1.102217] ICE IRQ = 34
1630
1631<6>[ 1.106229] qcom_ice_get_pdevice: found ice device ffffffc0759e6200
1632
1633<6>[ 1.106248] qcom_ice_get_pdevice: matching platform device ffffffc0f92aa400
1634
1635<3>[ 1.106625] scm_call failed: func id 0x42000c02, arginfo: 0x2, args: 0x13, 0x0, 0x0, 0x0, ret: -2, syscall returns: 0xfffffffffffffffc, 0x0, 0x0
1636
1637<3>[ 1.107245] ufs_qcom_phy_qmp_14nm 627000.ufsphy: failed to get tx_iface_clk err -517
1638
1639<3>[ 1.107253] ufs_qcom_phy_qmp_14nm 627000.ufsphy: failed to get rx_iface_clk err -517
1640
1641<6>[ 1.108092] scsi host0: ufshcd
1642
1643<6>[ 1.111698] qcom_ice 630000.ufsice: QC ICE 2.1.44 device found @0xffffff8002270000
1644
1645<6>[ 1.131684] SCSI Media Changer driver v0.25
1646
1647<3>[ 1.133465] pinmux core: 1010000.pinctrl does not support function blsp5_spi
1648
1649<3>[ 1.133484] msm8996-pinctrl 1010000.pinctrl: invalid function blsp5_spi in map table
1650
1651<3>[ 1.133493] pinmux core: 1010000.pinctrl does not support function blsp5_spi
1652
1653<3>[ 1.133498] msm8996-pinctrl 1010000.pinctrl: invalid function blsp5_spi in map table
1654
1655<3>[ 1.133506] pinmux core: 1010000.pinctrl does not support function blsp5_spi
1656
1657<3>[ 1.133511] msm8996-pinctrl 1010000.pinctrl: invalid function blsp5_spi in map table
1658
1659<3>[ 1.133518] pinmux core: 1010000.pinctrl does not support function blsp5_spi
1660
1661<3>[ 1.133523] msm8996-pinctrl 1010000.pinctrl: invalid function blsp5_spi in map table
1662
1663<3>[ 1.136449] ak49xx_spi_probe
1664
1665<6>[ 1.137343] SLIP: version 0.8.4-NET3.019-NEWTTY (dynamic channels, max=256).
1666
1667<6>[ 1.137349] CSLIP: code copyright 1989 Regents of the University of California.
1668
1669<3>[ 1.149347] ufshcd 624000.ufshc: ufshcd_print_pwr_info:[RX, TX]: gear=[1, 1], lane[1, 1], pwr[SLOWAUTO_MODE, SLOWAUTO_MODE], rate = 0
1670
1671<6>[ 1.180043] msm_pcie_enable: PCIe: Assert the reset of endpoint of RC0.
1672
1673<6>[ 1.183787] msm_pcie_enable: PCIe RC0 PHY is ready!
1674
1675<6>[ 1.193880] msm_pcie_enable: PCIe: Release the reset of endpoint of RC0.
1676
1677<6>[ 1.235856] msm_pcie_enable: PCIe RC0 link initialized
1678
1679<6>[ 1.235933] PCI host bridge /soc/qcom,pcie@00600000 ranges:
1680
1681<6>[ 1.235948] No bus range found for /soc/qcom,pcie@00600000, using [bus 00-ff]
1682
1683<6>[ 1.235976] IO 0x0c200000..0x0c2fffff -> 0x0c200000
1684
1685<6>[ 1.235990] MEM 0x0c300000..0x0cffffff -> 0x0c300000
1686
1687<6>[ 1.236141] pci-msm 600000.qcom,pcie: PCI host bridge to bus 0000:00
1688
1689<6>[ 1.236153] pci_bus 0000:00: root bus resource [bus 00-ff]
1690
1691<6>[ 1.236162] pci_bus 0000:00: root bus resource [io 0x0000-0xfffff] (bus address [0xc200000-0xc2fffff])
1692
1693<6>[ 1.236169] pci_bus 0000:00: root bus resource [mem 0x0c300000-0x0cffffff]
1694
1695<7>[ 1.236205] pci 0000:00:00.0: [17cb:0104] type 01 class 0x060400
1696
1697<3>[ 1.236233] msm_pcie_oper_conf: Read of RC0 0:0x00 + 0x0014[4] is all FFs
1698
1699<7>[ 1.236241] pci 0000:00:00.0: reg 0x10: [mem 0x00000000-0x00000fff 64bit]
1700
1701<7>[ 1.236311] pci 0000:00:00.0: PME# supported from D0 D3hot D3cold
1702
1703<3>[ 1.236332] pci 0000:00:00.0: of_irq_parse_pci() failed with rc=-19
1704
1705<6>[ 1.236504] pci 0000:00:00.0: bridge configuration invalid ([bus 00-00]), reconfiguring
1706
1707<7>[ 1.236632] pci 0000:01:00.0: [168c:003e] type 00 class 0x028000
1708
1709<3>[ 1.236686] msm_pcie_oper_conf: Read of RC0 1:0x00 + 0x0014[4] is all FFs
1710
1711<7>[ 1.236694] pci 0000:01:00.0: reg 0x10: [mem 0x00000000-0x001fffff 64bit]
1712
1713<7>[ 1.236948] pci 0000:01:00.0: PME# supported from D0 D3hot D3cold
1714
1715<7>[ 1.237348] pci_bus 0000:01: busn_res: [bus 01-ff] end is updated to 01
1716
1717<3>[ 1.237431] msm_pcie_oper_conf: Read of RC0 0:0x00 + 0x0028[4] is all FFs
1718
1719<6>[ 1.237455] pci 0000:00:00.0: BAR 8: assigned [mem 0x0c400000-0x0c5fffff]
1720
1721<6>[ 1.237464] pci 0000:00:00.0: BAR 0: assigned [mem 0x0c300000-0x0c300fff 64bit]
1722
1723<6>[ 1.237483] pci 0000:01:00.0: BAR 0: assigned [mem 0x0c400000-0x0c5fffff 64bit]
1724
1725<6>[ 1.237635] pci 0000:00:00.0: PCI bridge to [bus 01]
1726
1727<6>[ 1.237663] pci 0000:00:00.0: bridge window [mem 0x0c400000-0x0c5fffff]
1728
1729<6>[ 1.250218] msm_pcie_disable: PCIe: Assert the reset of endpoint of RC0.
1730
1731<6>[ 1.252666] cnss: Platform driver probed successfully.
1732
1733<6>[ 1.254409] msm_sharedmem: sharedmem_register_qmi: qmi init successful
1734
1735<6>[ 1.257554] msm_sharedmem: msm_sharedmem_probe: Device created for client 'rmtfs'
1736
1737<3>[ 1.265030] msm-dwc3 6a00000.ssusb: unable to get dbm device
1738
1739<6>[ 1.268202] ehci_hcd: USB 2.0 'Enhanced' Host Controller (EHCI) Driver
1740
1741<6>[ 1.268222] ehci-pci: EHCI PCI platform driver
1742
1743<6>[ 1.268291] usbcore: registered new interface driver usb-storage
1744
1745<6>[ 1.268308] usbcore: registered new interface driver ums-alauda
1746
1747<6>[ 1.268324] usbcore: registered new interface driver ums-cypress
1748
1749<6>[ 1.268340] usbcore: registered new interface driver ums-datafab
1750
1751<6>[ 1.268356] usbcore: registered new interface driver ums_eneub6250
1752
1753<6>[ 1.268372] usbcore: registered new interface driver ums-freecom
1754
1755<6>[ 1.268392] usbcore: registered new interface driver ums-isd200
1756
1757<6>[ 1.268408] usbcore: registered new interface driver ums-jumpshot
1758
1759<6>[ 1.268424] usbcore: registered new interface driver ums-karma
1760
1761<6>[ 1.268440] usbcore: registered new interface driver ums-onetouch
1762
1763<6>[ 1.268457] usbcore: registered new interface driver ums-realtek
1764
1765<6>[ 1.268474] usbcore: registered new interface driver ums-sddr09
1766
1767<6>[ 1.268490] usbcore: registered new interface driver ums-sddr55
1768
1769<6>[ 1.268505] usbcore: registered new interface driver ums-usbat
1770
1771<6>[ 1.268589] usbcore: registered new interface driver usbserial
1772
1773<6>[ 1.268610] usbcore: registered new interface driver usb_ehset_test
1774
1775<6>[ 1.269346] gbridge_init: gbridge_init successs.
1776
1777<3>[ 1.269425] hd3ss3220_pinctrl_init: pinctrl not defined
1778
1779<3>[ 1.270149] i2c-msm-v2 75b5000.i2c: msm_bus_scale_register_client(mstr-id:84):0x14 (ok)
1780
1781<6>[ 1.271122] hd3ss3220 7-0047: hd3ss3220 usb type-c ship finish probe
1782
1783<3>[ 1.271212] pi5usb302_pinctrl_init: pinctrl not defined
1784
1785<3>[ 1.272037] i2c-msm-v2 75b5000.i2c: NACK: slave not responding, ensure its powered: msgs(n:1 cur:0 tx) bc(rx:1 tx:0) mode:FIFO slv_addr:0xd MSTR_STS:0x0d1300c8 OPER:0x00000010
1786
1787<3>[ 1.272077] pi5usb302_read_byte: (0x1) error, ret(-107)
1788
1789<3>[ 1.272082] pi5usb302_initialization: read REG_ID fail!
1790
1791<3>[ 1.272086] pi5usb302_probe: fails to do initialization -107
1792
1793<4>[ 1.272098] pi5usb302: probe of 7-000d failed with error -107
1794
1795<6>[ 1.272280] mousedev: PS/2 mouse device common for all mice
1796
1797<4>[ 1.275034] pzh:Enter synaptics_rmi4_i2c_probe
1798
1799<4>[ 1.275364] pzh:leave synaptics_rmi4_i2c_probe
1800
1801<4>[ 1.276016] pzh:Enter synaptics_rmi4_probe
1802
1803<4>[ 1.276858] synaptics_rmi4_enable_reg : enable power regulator of bus_reg successfully!
1804
1805<4>[ 1.276869] synaptics_rmi4_enable_reg : enable power regulator of pwr_reg successfully!
1806
1807<3>[ 1.393947] ufshcd 624000.ufshc: ufshcd_print_pwr_info:[RX, TX]: gear=[3, 3], lane[1, 1], pwr[FAST MODE, FAST MODE], rate = 2
1808
1809<5>[ 1.394576] scsi 0:0:0:49488: Well-known LUN SAMSUNG KLUCG4J1CB-B0B1 0700 PQ: 0 ANSI: 6
1810
1811<5>[ 1.395555] scsi 0:0:0:49456: Well-known LUN SAMSUNG KLUCG4J1CB-B0B1 0700 PQ: 0 ANSI: 6
1812
1813<5>[ 1.396323] scsi 0:0:0:49476: Well-known LUN SAMSUNG KLUCG4J1CB-B0B1 0700 PQ: 0 ANSI: 6
1814
1815<5>[ 1.397166] scsi 0:0:0:0: Direct-Access SAMSUNG KLUCG4J1CB-B0B1 0700 PQ: 0 ANSI: 6
1816
1817<5>[ 1.397894] scsi 0:0:0:1: Direct-Access SAMSUNG KLUCG4J1CB-B0B1 0700 PQ: 0 ANSI: 6
1818
1819<5>[ 1.398331] scsi 0:0:0:2: Direct-Access SAMSUNG KLUCG4J1CB-B0B1 0700 PQ: 0 ANSI: 6
1820
1821<5>[ 1.398757] scsi 0:0:0:3: Direct-Access SAMSUNG KLUCG4J1CB-B0B1 0700 PQ: 0 ANSI: 6
1822
1823<5>[ 1.399173] scsi 0:0:0:4: Direct-Access SAMSUNG KLUCG4J1CB-B0B1 0700 PQ: 0 ANSI: 6
1824
1825<5>[ 1.399611] scsi 0:0:0:5: Direct-Access SAMSUNG KLUCG4J1CB-B0B1 0700 PQ: 0 ANSI: 6
1826
1827<5>[ 1.400605] sd 0:0:0:0: [sda] 16384-byte physical blocks
1828
1829<5>[ 1.401010] sd 0:0:0:1: [sdb] 16384-byte physical blocks
1830
1831<5>[ 1.402633] sd 0:0:0:2: [sdc] 16384-byte physical blocks
1832
1833<5>[ 1.403160] sd 0:0:0:5: [sdf] 16384-byte physical blocks
1834
1835<5>[ 1.403172] sd 0:0:0:3: [sdd] 16384-byte physical blocks
1836
1837<5>[ 1.403180] sd 0:0:0:4: [sde] 16384-byte physical blocks
1838
1839<6>[ 1.406944] sda: sda1 sda2 sda3 sda4 sda5 sda6 sda7 sda8 sda9
1840
1841<6>[ 1.407890] sdb: sdb1
1842
1843<6>[ 1.410951] sde: sde1 sde2 sde3 sde4 sde5 sde6 sde7 sde8 sde9 sde10 sde11 sde12 sde13 sde14 sde15 sde16 sde17 sde18 sde19 sde20 sde21 sde22 sde23 sde24 sde25 sde26
1844
1845<6>[ 1.411496] sdf: sdf1 sdf2 sdf3 sdf4 sdf5
1846
1847<6>[ 1.411542] sdd: sdd1 sdd2 sdd3
1848
1849<6>[ 1.413292] sdc: sdc1
1850
1851<3>[ 1.521604] i2c-msm-v2 75ba000.i2c: msm_bus_scale_register_client(mstr-id:84):0x15 (ok)
1852
1853<3>[ 1.523582] sps: BAM device 0x0000000007584000 is not registered yet.
1854
1855<3>[ 1.523660] sps_register_bam_device : unable to create IPC Logging 0 for bam 0x0000000007584000
1856
1857<3>[ 1.523668] sps_register_bam_device : unable to create IPC Logging 1 for bam 0x0000000007584000sps_register_bam_device : unable to create IPC Logging 2 for bam 0x0000000007584000
1858
1859<3>[ 1.523682] sps_register_bam_device : unable to create IPC Logging 3 for bam 0x0000000007584000sps_register_bam_device : unable to create IPC Logging 4 for bam 0x0000000007584000
1860
1861<6>[ 1.523696] sps:BAM 0x0000000007584000 is registered.<6>[ 1.523906] sps:BAM 0x0000000007584000 (va:0xffffff80047c0000) enabled: ver:0x19, number of pipes:24
1862
1863<4>[ 1.530433] synaptics_rmi4_f12_init---query_5->ctrl8_is_present----max x = 1439 max y = 2559
1864
1865<4>[ 1.537004] synaptics_rmi4_set_params---max x = 1439 max y = 2559
1866
1867<6>[ 1.537206] input: synaptics_dsx as /devices/soc/75ba000.i2c/i2c-12/12-0020/input/input2
1868
1869<6>[ 1.537825] syna_fwupdate_init:synaptics firmware update init succeed!
1870
1871<4>[ 1.538217] proc_create forcetouch_vendor success!
1872
1873<4>[ 1.538224] pzh:leave synaptics_rmi4_probe
1874
1875<6>[ 1.541001] qcom,qpnp-rtc qpnp-rtc-8: rtc core: registered qpnp_rtc as rtc0
1876
1877<6>[ 1.541260] i2c /dev entries driver
1878
1879<6>[ 1.576119] vmem: Up and running with 4 banks of memory from [irq size 270704111817 64bit pref disabled]
1880
1881<6>[ 1.617123] msm_cci_init:1363: hw_version = 0x10040000
1882
1883<3>[ 1.617192] ov8856_read_eeprom_memory begin
1884
1885<3>[ 1.617397] ov8856_read_eeprom_init:0x5000 temp=0x77ov8856_read_eeprom_init:0x5001 temp=0xA
1886
1887<3>[ 1.619381] sensor_module_id =0x6
1888
1889<3>[ 1.619390] ZTE_CAMERA:parse_module_name:732:sensor_module_name = qtech_ov8856
1890
1891<3>[ 1.639471] ov8856_validflag_check_eeprom :1569: valid info flag = 0x0 true
1892
1893<3>[ 1.639656] ov8856_read_eeprom_end:0x5001 temp=0x2
1894
1895<3>[ 1.639969] ov8856_read_eeprom_memory end<3>[ 1.685119] msm_camera_pinctrl_init:1201 Getting pinctrl handle failed
1896
1897<3>[ 1.685127] msm_camera_power_up:1242 Initialization of pinctrl failed
1898
1899<3>[ 1.685134] msm_camera_request_gpio_table:732 invalid gpio_tbl (null) / size 0
1900
1901<6>[ 1.691587] msm_cci_init:1363: hw_version = 0x10040000
1902
1903<3>[ 1.904401] s5k2t8_checksum_eeprom :1655: PCB version = 0x8
1904
1905<3>[ 1.904420] s5k2t8_checksum_eeprom :1725: cal info checksum rc = 0x0
1906
1907<3>[ 1.904428] s5k2t8_validflag_check_eeprom :1757: valid info flag = 0x0 true
1908
1909<3>[ 1.904432] ZTE_CAMERA:parse_module_name:732:sensor_module_name = semco_s5k2t8
1910
1911<3>[ 1.908881] msm_camera_request_gpio_table:732 invalid gpio_tbl (null) / size 0
1912
1913<3>[ 1.909072] msm_ois_init_module:949 Enter
1914
1915<3>[ 1.910850] msm_ois_platform_probe:808 Enter
1916
1917<3>[ 1.910874] msm_ois_platform_probe:823 cell-index 0, rc 0
1918
1919<3>[ 1.910881] msm_ois_platform_probe:832 qcom,cci-master 0, rc 0
1920
1921<3>[ 1.910891] msm_ois_platform_probe:858 msm_ois_platform_probe:858, ois enable gpio not specified
1922
1923<4>[ 1.911037] msm_ois_enable_debugfs:359: E
1924
1925<4>[ 1.911091] msm_ois_enable_debugfs:408: X
1926
1927<3>[ 1.911096] msm_ois_platform_probe:908 Exit
1928
1929<3>[ 1.918264] msm_sensor_driver_get_dt_data:1241, ois enable gpio not specified
1930
1931<3>[ 1.919803] msm_sensor_driver_get_dt_data:1241, ois enable gpio not specified
1932
1933<6>[ 1.925323] MSM-CPP cpp_init_hardware:1148 CPP HW Version: 0x60000000
1934
1935<3>[ 1.925335] MSM-CPP cpp_init_hardware:1169 stream_cnt:0
1936
1937<3>[ 1.932638] __msm_jpeg_init:1537] Jpeg Device id 0
1938
1939<3>[ 1.933679] __msm_jpeg_init:1537] Jpeg Device id 2__msm_jpeg_init:1537] Jpeg Device id 3
1940
1941<3>[ 1.938233] msm_fd_hw_set_dt_parms_by_name: Error property does not exist
1942
1943<3>[ 2.030044] msm_fd aa4000.qcom,fd: Face detection halt timeout
1944
1945<4>[ 2.031245] [zte]psy change, func __power_supply_register,line 828,psy name: usb-parallel
1946
1947<6>[ 2.031349] smb1351_parallel_charger_probe: smb1351 parallel successfully probed.
1948
1949<4>[ 2.033331] [zte]psy change, func __power_supply_register,line 828,psy name: bms
1950
1951<6>[ 2.033528] FG: fg_probe: FG Probe success - FG Revision DIG:3.1 ANA:1.2 PMIC subtype=19
1952
1953<6>[ 2.033655] SMBCHG: smbchg_probe: USB supply not found, deferring probe
1954
1955<3>[ 2.036130] unable to find DT imem DLOAD mode node
1956
1957<3>[ 2.037837] unable to find DT imem EDLOAD mode node
1958
1959<3>[ 2.039825] unable to find DT imem dload-type node
1960
1961<4>[ 2.042613] pzh:fwu_get_device_config_id---f34_fd.ctrl_base_addr=0x13
1962
1963<6>[ 2.079837] device-mapper: uevent: version 1.0.3
1964
1965<6>[ 2.079986] device-mapper: ioctl: 4.28.0-ioctl (2014-09-17) initialised: dm-devel@redhat.com
1966
1967<6>[ 2.080000] device-mapper: req-crypt: dm-req-crypt successfully initalized.
1968
1969<6>[ 2.080000]
1970
1971<6>[ 2.080197] sdhci: Secure Digital Host Controller Interface driver
1972
1973<6>[ 2.080202] sdhci: Copyright(c) Pierre Ossman
1974
1975<6>[ 2.080208] sdhci-pltfm: SDHCI platform and OF driver helper
1976
1977<6>[ 2.081331] qcom_ice_get_pdevice: found ice device ffffffc0759e6600
1978
1979<6>[ 2.081338] qcom_ice_get_pdevice: matching platform device ffffffc0f92aa800
1980
1981<4>[ 2.081665] sdhci_msm 74a4900.sdhci: sdhci_msm_probe: ICE device is not enabled
1982
1983<6>[ 2.095622] sdhci_msm 74a4900.sdhci: No vmmc regulator found
1984
1985<6>[ 2.095641] sdhci_msm 74a4900.sdhci: No vqmmc regulator found
1986
1987<6>[ 2.096078] mmc0: SDHCI controller on 74a4900.sdhci [74a4900.sdhci] using 64-bit ADMA in legacy mode
1988
1989<6>[ 2.130994] hidraw: raw HID events driver (C) Jiri Kosina
1990
1991<6>[ 2.131302] usbcore: registered new interface driver usbhid
1992
1993<6>[ 2.131308] usbhid: USB HID core driver
1994
1995<6>[ 2.131931] ashmem: initialized
1996
1997<6>[ 2.132051] logger: created 256K log 'log_main'
1998
1999<6>[ 2.132182] logger: created 256K log 'log_events'
2000
2001<6>[ 2.132265] logger: created 256K log 'log_radio'
2002
2003<6>[ 2.132350] logger: created 256K log 'log_system'
2004
2005<6>[ 2.133775] qpnp_coincell_charger_show_state: enabled=Y, voltage=3200 mV, resistance=2100 ohm
2006
2007<6>[ 2.135801] Haptics: sw:act_type=LRA hw:is_haptics=1(LRA)
2008
2009<3>[ 2.136868] clk_get("xo") succeed
2010
2011<6>[ 2.200054] msm_pcie_enable: PCIe: Assert the reset of endpoint of RC1.
2012
2013<6>[ 2.203626] msm_pcie_enable: PCIe RC1 PHY is ready!
2014
2015<6>[ 2.213707] msm_pcie_enable: PCIe: Release the reset of endpoint of RC1.
2016
2017<6>[ 2.268573] mmc0: new ultra high speed DDR50 SDXC card at address 0001
2018
2019<6>[ 2.268952] sdhci_msm_pm_qos_cpu_init (): voted for group #0 (mask=0x3) latency=70 (0xffffffc0f6bbe600)
2020
2021<6>[ 2.268962] sdhci_msm_pm_qos_cpu_init (): voted for group #1 (mask=0xc) latency=70 (0xffffffc0f6bbe608)
2022
2023<6>[ 2.269117] mmcblk0: mmc0:0001 00000 59.6 GiB
2024
2025<6>[ 2.270790] mmcblk0: p1
2026
2027<6>[ 2.322207] msm_pcie_enable: PCIe: Assert the reset of endpoint of RC1.
2028
2029<3>[ 2.322228] msm_pcie_enable: PCIe RC1 link initialization failed
2030
2031<3>[ 2.323383] msm_pcie_enumerate: PCIe: failed to enable RC1.
2032
2033<3>[ 2.323395] msm_11ad soc:qcom,wil6210: Parent PCIE enumeration failed
2034
2035<4>[ 2.323434] msm_11ad: probe of soc:qcom,wil6210 failed with error -1
2036
2037<6>[ 2.324953] bimc-bwmon 408000.qcom,cpu-bwmon: BW HWmon governor registered.
2038
2039<6>[ 2.326934] arm-memlat-mon soc:qcom,arm-memlat-mon-0: Memory Latency governor registered.
2040
2041<6>[ 2.326984] arm-memlat-mon soc:qcom,arm-memlat-mon-2: Memory Latency governor registered.
2042
2043<6>[ 2.331606] m4m-hwmon 6530000.qcom,m4m-hwmon: Cache HWmon governor registered.
2044
2045<3>[ 2.336689] devfreq soc:qcom,cpubw: Couldn't update frequency transition information.
2046
2047<3>[ 2.336857] devfreq soc:qcom,mincpubw: Couldn't update frequency transition information.
2048
2049<3>[ 2.337000] devfreq soc:qcom,memlat-cpu0: Couldn't update frequency transition information.
2050
2051<3>[ 2.337138] devfreq soc:qcom,memlat-cpu2: Couldn't update frequency transition information.
2052
2053<3>[ 2.338555] devfreq soc:qcom,m4m: Couldn't update frequency transition information.
2054
2055<3>[ 2.340449] probe: Failed to create IPC log context
2056
2057<6>[ 2.342071] usbcore: registered new interface driver snd-usb-audio
2058
2059<4>[ 2.344885] [AK4490] ak4490_modinit(1530)
2060
2061<4>[ 2.344915] [LHS][AK4490] ak4490_i2c_probe(1457)
2062
2063<3>[ 2.344919] [LHS]ak4490_populate_dt_pdata in 3333
2064
2065<3>[ 2.345053] ak4490_populate_dt_pdata hifi_pop_gpio(74) success
2066
2067<3>[ 2.345088] [LHS] ak4490_initial_gpio ldo -- enable !
2068
2069<3>[ 2.450120] [LHS]ak4490_initial_gpio system up ,ak4490 initial_gpio success!default setting : hifi swith power on , switch mute on , select ak4961, all others off
2070
2071<3>[ 2.450172] [LHS]ak4490_i2c_probe dev name--------sungang ak4490
2072
2073<3>[ 2.450178] [LHS]ak4490_i2c_probe leave ret=0
2074
2075<6>[ 2.450207] isl98608_init
2076
2077<3>[ 2.450230] isl98608_i2c_probe enter
2078
2079<6>[ 2.450250] ak8157_init
2080
2081<3>[ 2.450269] ak8157_i2c_probe enter
2082
2083<3>[ 2.451350] [LHS]ak8157_i2c_probe(): reset success!
2084
2085<3>[ 2.452414] [LHS]ak8157_i2c_probe(): reset tmp success!
2086
2087<3>[ 2.452715] i2c-msm-v2 757a000.i2c: msm_bus_scale_register_client(mstr-id:86):0x23 (ok)
2088
2089<3>[ 2.453254] [LHS]ak8157_config_init ret1 = e7,ret2 = 0
2090
2091<6>[ 2.462051] msm-dai-tdm soc:qcom,msm-dai-tdm-tert-rx: msm_dai_tdm_q6_probe: dev_name: soc:qcom,msm-dai-tdm-tert-rx group_id: 0x9120
2092
2093<6>[ 2.462305] msm-dai-q6-tdm soc:qcom,msm-dai-tdm-tert-rx:qcom,msm-dai-q6-tdm-tert-rx-0: msm_dai_q6_tdm_dev_probe: dev_name: soc:qcom,msm-dai-tdm-tert-rx:qcom,msm-dai-q6-tdm-tert-rx-0 dev_id: 0x9020
2094
2095<6>[ 2.462314] msm-dai-q6-tdm soc:qcom,msm-dai-tdm-tert-rx:qcom,msm-dai-q6-tdm-tert-rx-0: msm_dai_q6_tdm_dev_probe: Custom tdm header not supported
2096
2097<6>[ 2.462449] msm-dai-q6-tdm soc:qcom,msm-dai-tdm-tert-rx:qcom,msm-dai-q6-tdm-tert-rx-1: msm_dai_q6_tdm_dev_probe: dev_name: soc:qcom,msm-dai-tdm-tert-rx:qcom,msm-dai-q6-tdm-tert-rx-1 dev_id: 0x9022
2098
2099<6>[ 2.462457] msm-dai-q6-tdm soc:qcom,msm-dai-tdm-tert-rx:qcom,msm-dai-q6-tdm-tert-rx-1: msm_dai_q6_tdm_dev_probe: Custom tdm header not supported
2100
2101<6>[ 2.462588] msm-dai-q6-tdm soc:qcom,msm-dai-tdm-tert-rx:qcom,msm-dai-q6-tdm-tert-rx-2: msm_dai_q6_tdm_dev_probe: dev_name: soc:qcom,msm-dai-tdm-tert-rx:qcom,msm-dai-q6-tdm-tert-rx-2 dev_id: 0x9024
2102
2103<6>[ 2.462596] msm-dai-q6-tdm soc:qcom,msm-dai-tdm-tert-rx:qcom,msm-dai-q6-tdm-tert-rx-2: msm_dai_q6_tdm_dev_probe: Custom tdm header not supported
2104
2105<6>[ 2.462732] msm-dai-q6-tdm soc:qcom,msm-dai-tdm-tert-rx:qcom,msm-dai-q6-tdm-tert-rx-3: msm_dai_q6_tdm_dev_probe: dev_name: soc:qcom,msm-dai-tdm-tert-rx:qcom,msm-dai-q6-tdm-tert-rx-3 dev_id: 0x9026
2106
2107<6>[ 2.462739] msm-dai-q6-tdm soc:qcom,msm-dai-tdm-tert-rx:qcom,msm-dai-q6-tdm-tert-rx-3: msm_dai_q6_tdm_dev_probe: Custom tdm header not supported
2108
2109<6>[ 2.462758] msm-dai-tdm soc:qcom,msm-dai-tdm-tert-tx: msm_dai_tdm_q6_probe: dev_name: soc:qcom,msm-dai-tdm-tert-tx group_id: 0x9121
2110
2111<6>[ 2.462884] msm-dai-q6-tdm soc:qcom,msm-dai-tdm-tert-tx:qcom,msm-dai-q6-tdm-tert-tx-0: msm_dai_q6_tdm_dev_probe: dev_name: soc:qcom,msm-dai-tdm-tert-tx:qcom,msm-dai-q6-tdm-tert-tx-0 dev_id: 0x9021
2112
2113<6>[ 2.462891] msm-dai-q6-tdm soc:qcom,msm-dai-tdm-tert-tx:qcom,msm-dai-q6-tdm-tert-tx-0: msm_dai_q6_tdm_dev_probe: Custom tdm header not supported
2114
2115<6>[ 2.463021] msm-dai-q6-tdm soc:qcom,msm-dai-tdm-tert-tx:qcom,msm-dai-q6-tdm-tert-tx-1: msm_dai_q6_tdm_dev_probe: dev_name: soc:qcom,msm-dai-tdm-tert-tx:qcom,msm-dai-q6-tdm-tert-tx-1 dev_id: 0x9023
2116
2117<6>[ 2.463028] msm-dai-q6-tdm soc:qcom,msm-dai-tdm-tert-tx:qcom,msm-dai-q6-tdm-tert-tx-1: msm_dai_q6_tdm_dev_probe: Custom tdm header not supported
2118
2119<6>[ 2.463159] msm-dai-q6-tdm soc:qcom,msm-dai-tdm-tert-tx:qcom,msm-dai-q6-tdm-tert-tx-2: msm_dai_q6_tdm_dev_probe: dev_name: soc:qcom,msm-dai-tdm-tert-tx:qcom,msm-dai-q6-tdm-tert-tx-2 dev_id: 0x9025
2120
2121<6>[ 2.463167] msm-dai-q6-tdm soc:qcom,msm-dai-tdm-tert-tx:qcom,msm-dai-q6-tdm-tert-tx-2: msm_dai_q6_tdm_dev_probe: Custom tdm header not supported
2122
2123<6>[ 2.463297] msm-dai-q6-tdm soc:qcom,msm-dai-tdm-tert-tx:qcom,msm-dai-q6-tdm-tert-tx-3: msm_dai_q6_tdm_dev_probe: dev_name: soc:qcom,msm-dai-tdm-tert-tx:qcom,msm-dai-q6-tdm-tert-tx-3 dev_id: 0x9027
2124
2125<6>[ 2.463305] msm-dai-q6-tdm soc:qcom,msm-dai-tdm-tert-tx:qcom,msm-dai-q6-tdm-tert-tx-3: msm_dai_q6_tdm_dev_probe: Custom tdm header not supported
2126
2127<6>[ 2.463324] msm-dai-tdm soc:qcom,msm-dai-tdm-quat-rx: msm_dai_tdm_q6_probe: dev_name: soc:qcom,msm-dai-tdm-quat-rx group_id: 0x9130
2128
2129<6>[ 2.463451] msm-dai-q6-tdm soc:qcom,msm-dai-tdm-quat-rx:qcom,msm-dai-q6-tdm-quat-rx-0: msm_dai_q6_tdm_dev_probe: dev_name: soc:qcom,msm-dai-tdm-quat-rx:qcom,msm-dai-q6-tdm-quat-rx-0 dev_id: 0x9030
2130
2131<6>[ 2.463458] msm-dai-q6-tdm soc:qcom,msm-dai-tdm-quat-rx:qcom,msm-dai-q6-tdm-quat-rx-0: msm_dai_q6_tdm_dev_probe: Custom tdm header not supported
2132
2133<6>[ 2.463590] msm-dai-q6-tdm soc:qcom,msm-dai-tdm-quat-rx:qcom,msm-dai-q6-tdm-quat-rx-1: msm_dai_q6_tdm_dev_probe: dev_name: soc:qcom,msm-dai-tdm-quat-rx:qcom,msm-dai-q6-tdm-quat-rx-1 dev_id: 0x9032
2134
2135<6>[ 2.463597] msm-dai-q6-tdm soc:qcom,msm-dai-tdm-quat-rx:qcom,msm-dai-q6-tdm-quat-rx-1: msm_dai_q6_tdm_dev_probe: Custom tdm header not supported
2136
2137<6>[ 2.463725] msm-dai-q6-tdm soc:qcom,msm-dai-tdm-quat-rx:qcom,msm-dai-q6-tdm-quat-rx-2: msm_dai_q6_tdm_dev_probe: dev_name: soc:qcom,msm-dai-tdm-quat-rx:qcom,msm-dai-q6-tdm-quat-rx-2 dev_id: 0x9034
2138
2139<6>[ 2.463732] msm-dai-q6-tdm soc:qcom,msm-dai-tdm-quat-rx:qcom,msm-dai-q6-tdm-quat-rx-2: msm_dai_q6_tdm_dev_probe: Custom tdm header not supported
2140
2141<6>[ 2.463858] msm-dai-q6-tdm soc:qcom,msm-dai-tdm-quat-rx:qcom,msm-dai-q6-tdm-quat-rx-3: msm_dai_q6_tdm_dev_probe: dev_name: soc:qcom,msm-dai-tdm-quat-rx:qcom,msm-dai-q6-tdm-quat-rx-3 dev_id: 0x9036
2142
2143<6>[ 2.463865] msm-dai-q6-tdm soc:qcom,msm-dai-tdm-quat-rx:qcom,msm-dai-q6-tdm-quat-rx-3: msm_dai_q6_tdm_dev_probe: Custom tdm header not supported
2144
2145<6>[ 2.463882] msm-dai-tdm soc:qcom,msm-dai-tdm-quat-tx: msm_dai_tdm_q6_probe: dev_name: soc:qcom,msm-dai-tdm-quat-tx group_id: 0x9131
2146
2147<6>[ 2.464006] msm-dai-q6-tdm soc:qcom,msm-dai-tdm-quat-tx:qcom,msm-dai-q6-tdm-quat-tx-0: msm_dai_q6_tdm_dev_probe: dev_name: soc:qcom,msm-dai-tdm-quat-tx:qcom,msm-dai-q6-tdm-quat-tx-0 dev_id: 0x9031
2148
2149<6>[ 2.464012] msm-dai-q6-tdm soc:qcom,msm-dai-tdm-quat-tx:qcom,msm-dai-q6-tdm-quat-tx-0: msm_dai_q6_tdm_dev_probe: Custom tdm header not supported
2150
2151<6>[ 2.464146] msm-dai-q6-tdm soc:qcom,msm-dai-tdm-quat-tx:qcom,msm-dai-q6-tdm-quat-tx-1: msm_dai_q6_tdm_dev_probe: dev_name: soc:qcom,msm-dai-tdm-quat-tx:qcom,msm-dai-q6-tdm-quat-tx-1 dev_id: 0x9033
2152
2153<6>[ 2.464152] msm-dai-q6-tdm soc:qcom,msm-dai-tdm-quat-tx:qcom,msm-dai-q6-tdm-quat-tx-1: msm_dai_q6_tdm_dev_probe: Custom tdm header not supported
2154
2155<6>[ 2.464279] msm-dai-q6-tdm soc:qcom,msm-dai-tdm-quat-tx:qcom,msm-dai-q6-tdm-quat-tx-2: msm_dai_q6_tdm_dev_probe: dev_name: soc:qcom,msm-dai-tdm-quat-tx:qcom,msm-dai-q6-tdm-quat-tx-2 dev_id: 0x9035
2156
2157<6>[ 2.464286] msm-dai-q6-tdm soc:qcom,msm-dai-tdm-quat-tx:qcom,msm-dai-q6-tdm-quat-tx-2: msm_dai_q6_tdm_dev_probe: Custom tdm header not supported
2158
2159<6>[ 2.464413] msm-dai-q6-tdm soc:qcom,msm-dai-tdm-quat-tx:qcom,msm-dai-q6-tdm-quat-tx-3: msm_dai_q6_tdm_dev_probe: dev_name: soc:qcom,msm-dai-tdm-quat-tx:qcom,msm-dai-q6-tdm-quat-tx-3 dev_id: 0x9037
2160
2161<6>[ 2.464419] msm-dai-q6-tdm soc:qcom,msm-dai-tdm-quat-tx:qcom,msm-dai-q6-tdm-quat-tx-3: msm_dai_q6_tdm_dev_probe: Custom tdm header not supported
2162
2163<6>[ 2.466551] msm-compr-dsp soc:qcom,msm-compr-dsp: msm_compr_probe: dev name soc:qcom,msm-compr-dsp
2164
2165<3>[ 2.473748] msm8996-asoc-snd soc:sound-ak4961: chenjun:msm8996_asoc_machine_probe: matched codec is tomtom_codec.
2166
2167<3>[ 2.474851] msm8996-asoc-snd soc:sound-ak4961: ASoC: platform (null) not registered
2168
2169<6>[ 2.475363] TCP: cubic registered
2170
2171<6>[ 2.475370] Initializing XFRM netlink socket
2172
2173<6>[ 2.475546] NET: Registered protocol family 10
2174
2175<6>[ 2.475897] NET: Registered protocol family 17
2176
2177<6>[ 2.475913] NET: Registered protocol family 15
2178
2179<6>[ 2.476637] NET: Registered protocol family 27
2180
2181<3>[ 2.476674] IPC_RTR: ipc_router_create_log_ctx: Unable to create IPC logging for [local_IPCRTR]
2182
2183<6>[ 2.477992] usb_otg_vreg: no parameters
2184
2185<3>[ 2.478060] reg-fixed-voltage soc:usb-otg-switch: Failed to find supply vin
2186
2187<3>[ 2.478121] reg-fixed-voltage soc:usb-otg-switch: Failed to register regulator: -517
2188
2189<6>[ 2.484770] kgsl kgsl-3d0: Initialized kgsl-3d0: mmu=on
2190
2191<4>[ 2.486336] [zte]psy change, func __power_supply_register,line 828,psy name: usb
2192
2193<3>[ 2.487167] sps_register_bam_device : unable to create IPC Logging 0 for bam 0x0000000006b04000
2194
2195<3>[ 2.487174] sps_register_bam_device : unable to create IPC Logging 1 for bam 0x0000000006b04000sps_register_bam_device : unable to create IPC Logging 2 for bam 0x0000000006b04000
2196
2197<3>[ 2.487183] sps_register_bam_device : unable to create IPC Logging 3 for bam 0x0000000006b04000sps_register_bam_device : unable to create IPC Logging 4 for bam 0x0000000006b04000
2198
2199<6>[ 2.487191] sps:BAM 0x0000000006b04000 is registered.<3>[ 2.488557] qpnp-smbcharger qpnp-smbcharger-16: node /soc/qcom,spmi@400f000/qcom,pmi8994@2/qcom,qpnp-smbcharger IO resource absent!
2200
2201<6>[ 2.488572] SMBCHG: smbchg_check_chg_version: pmic=PMI8996, wa_flags=0xf0, hvdcp_supported=true
2202
2203<6>[ 2.488587] SMBCHG: smb_parse_dt: parallel usb thr: 1000, 9v thr: 900
2204
2205<6>[ 2.488675] smbcharger_charger_otg: no parameters
2206
2207<6>[ 2.488769] smbcharger_external_otg: no parameters
2208
2209<6>[ 2.488786] smbcharger_external_otg: supplied by pmi8994_boost_5v
2210
2211<6>[ 2.488846] SMBCHG: smbchg_hw_init: Charger Revision DIG: 2.0; ANA: 2.1
2212
2213<6>[ 2.488887] SMBCHG: smbchg_set_aicl_rerun_period_s: aicl rerun period set to 180s
2214
2215<6>[ 2.489225] SMBCHG: smbchg_hw_init: set vfloat to 4400
2216
2217<6>[ 2.489263] SMBCHG: smbchg_hw_init: set fastchg current comp to 900
2218
2219<6>[ 2.489301] SMBCHG: smbchg_hw_init: set float voltage comp to 10
2220
2221<6>[ 2.489340] SMBCHG: smbchg_iterm_set: set tcc (150) to 0x03
2222
2223<6>[ 2.489483] SMBCHG: smbchg_vfloat_adjust_check: Starting vfloat adjustments
2224
2225<6>[ 2.489502] SMBCHG: smbchg_vfloat_adjust_work: Stopping vfloat adj taper=0 parallel_ma = 0
2226
2227<6>[ 2.489883] SMBCHG: get_prop_batt_status: CHGR_STS = 0x85
2228
2229<6>[ 2.490138] SMBCHG: smbchg_set_dc_current_max: dc current set to 1500 mA
2230
2231<6>[ 2.490459] SMBCHG: smbchg_set_fastchg_current_raw: fastcharge current requested 3000, set to 3000
2232
2233<6>[ 2.490867] SMBCHG: batt_pres_handler: triggered: 0x00
2234
2235<6>[ 2.490871] SMBCHG: smbchg_vfloat_adjust_check: Starting vfloat adjustments
2236
2237<6>[ 2.490888] SMBCHG: smbchg_vfloat_adjust_work: Stopping vfloat adj taper=0 parallel_ma = 0
2238
2239<6>[ 2.491256] SMBCHG: get_prop_batt_status: CHGR_STS = 0x85
2240
2241<6>[ 2.491372] SMBCHG: batt_hot_handler: triggered: 0x00
2242
2243<6>[ 2.491376] SMBCHG: smbchg_vfloat_adjust_check: Starting vfloat adjustments
2244
2245<6>[ 2.491474] SMBCHG: smbchg_vfloat_adjust_work: Stopping vfloat adj taper=0 parallel_ma = 0
2246
2247<6>[ 2.491966] SMBCHG: get_prop_batt_status: CHGR_STS = 0x85
2248
2249<6>[ 2.492046] SMBCHG: batt_warm_handler: triggered: 0x00
2250
2251<6>[ 2.492095] SMBCHG: batt_cool_handler: triggered: 0x00
2252
2253<6>[ 2.492113] SMBCHG: batt_cold_handler: triggered: 0x00
2254
2255<6>[ 2.492172] SMBCHG: smbchg_vfloat_adjust_check: Starting vfloat adjustments
2256
2257<6>[ 2.492332] SMBCHG: smbchg_vfloat_adjust_work: Stopping vfloat adj taper=0 parallel_ma = 0
2258
2259<6>[ 2.492731] SMBCHG: get_prop_batt_status: CHGR_STS = 0x85
2260
2261<6>[ 2.492803] SMBCHG: src_detect_handler: chip->usb_present = 0 usb_present = 1 src_detect = 1 hvdcp_3_det_ignore_uv=0
2262
2263<6>[ 2.492809] SMBCHG: handle_usb_insertion: triggered
2264
2265<6>[ 2.492830] SMBCHG: handle_usb_insertion: inserted type = 4 (SDP)
2266
2267<6>[ 2.492834] SMBCHG: smbchg_change_usb_supply_type: Type 4: setting mA = 100
2268
2269<6>[ 2.492839] SMBCHG: smbchg_set_usb_current_max: USB current_ma = 100
2270
2271<6>[ 2.492991] SMBCHG: smbchg_set_usb_current_max: usb type = 4 current set to 100 mA
2272
2273<4>[ 2.493010] [zte]psy change, func dwc3_msm_power_set_property_usb,line 2498,psy name: usb
2274
2275<6>[ 2.493215] SMBCHG: handle_usb_insertion: setting usb psy present = 1
2276
2277<4>[ 2.493328] [zte]psy change, func dwc3_msm_power_set_property_usb,line 2498,psy name: usb
2278
2279<6>[ 2.493334] SMBCHG: handle_usb_insertion: setting usb psy health GOOD
2280
2281<4>[ 2.493355] [zte]psy change, func dwc3_msm_power_set_property_usb,line 2498,psy name: usb
2282
2283<6>[ 2.493455] SMBCHG: smbchg_usb_update_online_work: setting usb psy online = 1
2284
2285<4>[ 2.493459] [zte]psy change, func dwc3_msm_power_set_property_usb,line 2498,psy name: usb
2286
2287<6>[ 2.493666] smb1351_parallel_set_chg_present: smb1351_is_good=1 ,ZTE get SMB135X version =2 successful.
2288
2289<6>[ 2.496353] SMBCHG: get_prop_batt_status: CHGR_STS = 0x85
2290
2291<6>[ 2.496484] SMBCHG: determine_initial_status: setting usb psy dp=f dm=f
2292
2293<4>[ 2.496792] [zte]psy change, func dwc3_msm_power_set_property_usb,line 2498,psy name: usb
2294
2295<6>[ 2.496799] SMBCHG: handle_usb_insertion: triggered
2296
2297<6>[ 2.496841] SMBCHG: handle_usb_insertion: inserted type = 4 (SDP)
2298
2299<6>[ 2.496845] SMBCHG: smbchg_change_usb_supply_type: Type 4: setting mA = 100
2300
2301<4>[ 2.496850] [zte]psy change, func dwc3_msm_power_set_property_usb,line 2498,psy name: usb
2302
2303<6>[ 2.496940] SMBCHG: handle_usb_insertion: setting usb psy present = 1
2304
2305<6>[ 2.522925] dwc3_uevent: sent uevent USB_STATE=ONLINE
2306
2307<4>[ 2.522948] [zte]psy change, func dwc3_msm_power_set_property_usb,line 2498,psy name: usb
2308
2309<6>[ 2.522960] SMBCHG: handle_usb_insertion: setting usb psy health GOOD
2310
2311<4>[ 2.522981] [zte]psy change, func dwc3_msm_power_set_property_usb,line 2498,psy name: usb
2312
2313<6>[ 2.523145] smb1351_parallel_set_chg_present: smb1351_is_good=1 ,ZTE get SMB135X version =2 successful.
2314
2315<6>[ 2.523149] SMBCHG: usbid_change_handler: triggered
2316
2317<6>[ 2.550069] SMBCHG: is_otg_present_schg: USBID = 0x0fff, too high to be ground
2318
2319<6>[ 2.550078] SMBCHG: usbid_change_handler: setting usb psy OTG = 0
2320
2321<4>[ 2.550083] [zte]psy change, func dwc3_msm_power_set_property_usb,line 2498,psy name: usb
2322
2323<6>[ 2.550593] SMBCHG: get_prop_batt_status: CHGR_STS = 0x85
2324
2325<6>[ 2.551641] SMBCHG: get_prop_batt_status: CHGR_STS = 0x85
2326
2327<6>[ 2.552159] SMBCHG: smbchg_calc_max_flash_current: avail_iflash=2885000, ocv=4190344, ibat=172500, rbatt=173059
2328
2329<6>[ 2.567458] SMBCHG: smbchg_shipmode_get: get shipmode_test is 1
2330
2331<4>[ 2.567697] [zte]psy change, func __power_supply_register,line 828,psy name: battery
2332
2333<4>[ 2.567927] [zte]psy change, func __power_supply_register,line 828,psy name: dc
2334
2335<6>[ 2.568086] SMBCHG: get_prop_batt_status: CHGR_STS = 0x85
2336
2337<6>[ 2.568460] SMBCHG: smbchg_calc_max_flash_current: avail_iflash=2885000, ocv=4190344, ibat=172500, rbatt=173059
2338
2339<6>[ 2.569861] SMBCHG: smbchg_shipmode_get: get shipmode_test is 1
2340
2341<3>[ 2.570737] qpnp-smbcharger qpnp-smbcharger-16: node /soc/qcom,spmi@400f000/qcom,pmi8994@2/qcom,qpnp-smbcharger IO resource absent!
2342
2343<6>[ 2.570747] SMBCHG: smbchg_probe: setting usb psy present = 1
2344
2345<4>[ 2.570754] [zte]psy change, func dwc3_msm_power_set_property_usb,line 2498,psy name: usb
2346
2347<6>[ 2.571414] qpnp-smbcharger qpnp-smbcharger-16: SMBCHG successfully probe Charger version=SCHG Revision DIG:2.0 ANA:2.1 batt=1 dc=0 usb=1
2348
2349<3>[ 2.572030] msm8996-asoc-snd soc:sound-ak4961: chenjun:msm8996_asoc_machine_probe: matched codec is tomtom_codec.
2350
2351<3>[ 2.573335] msm8996-asoc-snd soc:sound-ak4961: ASoC: platform (null) not registered
2352
2353<6>[ 2.573623] usb_otg_vreg: no parameters
2354
2355<6>[ 2.573654] usb_otg_vreg: supplied by smbcharger_external_otg
2356
2357<3>[ 2.574440] msm8996-asoc-snd soc:sound-ak4961: chenjun:msm8996_asoc_machine_probe: matched codec is tomtom_codec.
2358
2359<3>[ 2.575728] msm8996-asoc-snd soc:sound-ak4961: ASoC: platform (null) not registered
2360
2361<5>[ 2.576209] Loading compiled-in X.509 certificates
2362
2363<6>[ 2.578077] f3mem_modem_restart_late_init
2364
2365<6>[ 2.578114] f3mem_modem_restart_late_init: registering notif for 'modem', handle=ffffffc07597d600
2366
2367<6>[ 2.578117] f3mem_init
2368
2369<6>[ 2.578121] f3mem_init success f3mem address 0xa0000000 size 0x1000000
2370
2371<6>[ 2.578729] imem_modem_restart_late_init
2372
2373<6>[ 2.578759] msm_scan_dt_map_imem_for_ramdump: v_address 0x0, address 0x66bf000, size 0x1000
2374
2375<6>[ 2.578763] msm_scan_dt_map_imem_for_ramdump: registering notif for 'modem', handle=ffffffc07597d600
2376
2377<6>[ 2.583415] SMBCHG: smbchg_cc_esr_wa_check: ESR count is not zero, skipping
2378
2379<6>[ 2.583424] SMBCHG: smbchg_config_chg_battery_type: Battery-type not identified
2380
2381<6>[ 2.583449] SMBCHG: smbchg_external_power_changed: usb type = SDP current_limit = 0
2382
2383<6>[ 2.583455] SMBCHG: smbchg_set_usb_current_max: USB current_ma = 0
2384
2385<6>[ 2.583478] SMBCHG: smbchg_set_usb_current_max: usb type = 4 current set to 0 mA
2386
2387<6>[ 2.583496] SMBCHG: smbchg_vfloat_adjust_check: Starting vfloat adjustments
2388
2389<4>[ 2.583501] [zte]psy change, func smbchg_external_power_changed,line 3861,psy name: battery
2390
2391<6>[ 2.583526] SMBCHG: power_ok_handler: triggered: 0x00
2392
2393<6>[ 2.583560] SMBCHG: smbchg_vfloat_adjust_work: Stopping vfloat adj taper=0 parallel_ma = 0
2394
2395<6>[ 2.583937] SMBCHG: get_prop_batt_status: CHGR_STS = 0x84
2396
2397<6>[ 2.584271] SMBCHG: smbchg_calc_max_flash_current: avail_iflash=2885000, ocv=4190344, ibat=172500, rbatt=173059
2398
2399<6>[ 2.585635] SMBCHG: smbchg_shipmode_get: get shipmode_test is 1
2400
2401<3>[ 2.587335] msm8996-asoc-snd soc:sound-ak4961: chenjun:msm8996_asoc_machine_probe: matched codec is tomtom_codec.
2402
2403<6>[ 2.587766] SMBCHG: fastchg_handler: p2f triggered
2404
2405<4>[ 2.587781] [zte]psy change, func fastchg_handler,line 6332,psy name: battery
2406
2407<6>[ 2.587790] SMBCHG: smbchg_vfloat_adjust_check: Starting vfloat adjustments
2408
2409<6>[ 2.587892] SMBCHG: smbchg_vfloat_adjust_work: Stopping vfloat adj taper=0 parallel_ma = 0
2410
2411<6>[ 2.588229] SMBCHG: get_prop_batt_status: CHGR_STS = 0x80
2412
2413<3>[ 2.588671] msm8996-asoc-snd soc:sound-ak4961: ASoC: platform (null) not registered
2414
2415<3>[ 2.589130] ngd_msm_ctrl 91c0000.slim: error creating ipc_logging context
2416
2417<6>[ 2.589247] SMBCHG: smbchg_calc_max_flash_current: avail_iflash=2885000, ocv=4190344, ibat=172500, rbatt=173059
2418
2419<6>[ 2.590780] SMBCHG: smbchg_shipmode_get: get shipmode_test is 1
2420
2421<3>[ 2.590814] msm8996-asoc-snd soc:sound-ak4961: chenjun:msm8996_asoc_machine_probe: matched codec is tomtom_codec.
2422
2423<6>[ 2.590858] file system registered
2424
2425<6>[ 2.590887] mbim_init: initialize 1 instances
2426
2427<6>[ 2.590921] mbim_init: Initialized 1 ports
2428
2429<6>[ 2.591604] rndis_qc_init: initialize rndis QC instance
2430
2431<6>[ 2.591711] Number of LUNs=8
2432
2433<6>[ 2.591717] Mass Storage Function, version: 2009/09/11
2434
2435<6>[ 2.591722] LUN: removable file: (no medium)
2436
2437<6>[ 2.591734] Number of LUNs=1
2438
2439<6>[ 2.591759] LUN: removable file: (no medium)
2440
2441<6>[ 2.591762] Number of LUNs=1
2442
2443<6>[ 2.591885] android_usb gadget: android_usb ready
2444
2445<3>[ 2.592122] msm8996-asoc-snd soc:sound-ak4961: ASoC: platform (null) not registered
2446
2447<3>[ 2.593163] msm8996-asoc-snd soc:sound-ak4961: chenjun:msm8996_asoc_machine_probe: matched codec is tomtom_codec.
2448
2449<6>[ 2.593312] input: gpio-keys as /devices/soc/soc:gpio_keys/input/input3
2450
2451<6>[ 2.594013] qcom,qpnp-rtc qpnp-rtc-8: setting system clock to 1970-01-16 00:43:49 UTC (1298629)
2452
2453<3>[ 2.594561] msm8996-asoc-snd soc:sound-ak4961: ASoC: platform (null) not registered
2454
2455<3>[ 2.595674] msm8996-asoc-snd soc:sound-ak4961: chenjun:msm8996_asoc_machine_probe: matched codec is tomtom_codec.
2456
2457<6>[ 2.595867] zte_hall_probe +++++
2458
2459<6>[ 2.595872] zte_hall: translate hardware pin to system pin
2460
2461<6>[ 2.595934] zte_hall: sys_number=124 name=hall_en
2462
2463<6>[ 2.596017] input: Unspecified device as /devices/virtual/input/input4
2464
2465<3>[ 2.597111] msm8996-asoc-snd soc:sound-ak4961: ASoC: platform (null) not registered
2466
2467<4>[ 2.597751] [zte]psy change, func __power_supply_register,line 828,psy name: bcl
2468
2469<3>[ 2.598159] msm8996-asoc-snd soc:sound-ak4961: chenjun:msm8996_asoc_machine_probe: matched codec is tomtom_codec.
2470
2471<3>[ 2.599613] msm8996-asoc-snd soc:sound-ak4961: ASoC: platform (null) not registered
2472
2473<3>[ 2.600549] msm8996-asoc-snd soc:sound-ak4961: chenjun:msm8996_asoc_machine_probe: matched codec is tomtom_codec.
2474
2475<3>[ 2.601722] msm8996-asoc-snd soc:sound-ak4961: ASoC: platform (null) not registered
2476
2477<6>[ 2.603041] msm_thermal:disable_msm_thermal Max frequency reset for CPU0
2478
2479<6>[ 2.603050] msm_thermal:disable_msm_thermal Max frequency reset for CPU1
2480
2481<6>[ 2.603053] msm_thermal:disable_msm_thermal Max frequency reset for CPU2
2482
2483<6>[ 2.603056] msm_thermal:disable_msm_thermal Max frequency reset for CPU3
2484
2485<3>[ 2.603246] msm8996-asoc-snd soc:sound-ak4961: chenjun:msm8996_asoc_machine_probe: matched codec is tomtom_codec.
2486
2487<3>[ 2.605124] msm8996-asoc-snd soc:sound-ak4961: ASoC: platform (null) not registered
2488
2489<6>[ 2.605692] lmh_lite:lmh_parse_sensor Registering sensor:[DLMt_APC1]
2490
2491<6>[ 2.605906] lmh_lite:lmh_parse_sensor Registering sensor:[LLM_cp00]
2492
2493<6>[ 2.606027] lmh_lite:lmh_parse_sensor Registering sensor:[LLM_cp01]
2494
2495<6>[ 2.606149] lmh_lite:lmh_parse_sensor Registering sensor:[LLM_cp10]
2496
2497<6>[ 2.606267] lmh_lite:lmh_parse_sensor Registering sensor:[LLM_cp11]
2498
2499<6>[ 2.606388] lmh_lite:lmh_parse_sensor Registering sensor:[LLM_m4m0]
2500
2501<6>[ 2.606511] lmh_lite:lmh_parse_sensor Registering sensor:[LLM_l21-]
2502
2503<6>[ 2.606628] lmh_lite:lmh_parse_sensor Registering sensor:[LLM_l20-]
2504
2505<3>[ 2.608080] msm8996-asoc-snd soc:sound-ak4961: chenjun:msm8996_asoc_machine_probe: matched codec is tomtom_codec.
2506
2507<3>[ 2.609251] msm8996-asoc-snd soc:sound-ak4961: ASoC: platform (null) not registered
2508
2509<3>[ 2.609341] parse_cpu_levels: idx 1 545
2510
2511<3>[ 2.609346] parse_cpu_levels: idx 2 1785
2512
2513<3>[ 2.609349] parse_cpu_levels: idx 2 3025
2514
2515<3>[ 2.609402] parse_cpu_levels: idx 1 545
2516
2517<3>[ 2.609405] parse_cpu_levels: idx 2 1785
2518
2519<3>[ 2.609408] parse_cpu_levels: idx 2 3025
2520
2521<3>[ 2.610548] msm8996-asoc-snd soc:sound-ak4961: chenjun:msm8996_asoc_machine_probe: matched codec is tomtom_codec.
2522
2523<3>[ 2.611742] msm8996-asoc-snd soc:sound-ak4961: ASoC: platform (null) not registered
2524
2525<3>[ 2.612008] qcom,qpnp-flash-led qpnp-flash-led-25: Unable to acquire pinctrl
2526
2527<3>[ 2.612994] msm8996-asoc-snd soc:sound-ak4961: chenjun:msm8996_asoc_machine_probe: matched codec is tomtom_codec.
2528
2529<6>[ 2.613075] rmnet_ipa started initialization
2530
2531<6>[ 2.613080] IPA SSR support = True
2532
2533<6>[ 2.613088] IPA ipa-loaduC = True
2534
2535<6>[ 2.613098] IPA SG support = True
2536
2537<3>[ 2.614072] msm8996-asoc-snd soc:sound-ak4961: ASoC: platform (null) not registered
2538
2539<3>[ 2.614227] ipa ipa_sps_irq_control_all:932 EP (5) not allocated.
2540
2541<3>[ 2.614233] ipa ipa_uc_state_check:296 uC is not loaded
2542
2543<6>[ 2.614905] rmnet_ipa completed initialization
2544
2545<3>[ 2.615382] msm8996-asoc-snd soc:sound-ak4961: chenjun:msm8996_asoc_machine_probe: matched codec is tomtom_codec.
2546
2547<3>[ 2.616554] msm8996-asoc-snd soc:sound-ak4961: ASoC: platform (null) not registered
2548
2549<6>[ 2.618253] qcom,cc-debug-8996 362000.qcom,cc-debug: Registered debug mux.
2550
2551<3>[ 2.618876] msm8996-asoc-snd soc:sound-ak4961: chenjun:msm8996_asoc_machine_probe: matched codec is tomtom_codec.
2552
2553<6>[ 2.619205] apc0_pwrcl_mem_acc_corner: disabling
2554
2555<6>[ 2.619210] apc1_perfcl_mem_acc_corner: disabling
2556
2557<6>[ 2.619214] apcc_l3_mem_acc_corner: disabling
2558
2559<6>[ 2.619217] gfx_mem_acc_corner: disabling
2560
2561<6>[ 2.619221] kryo0-retention: disabling
2562
2563<6>[ 2.619226] kryo1-retention: disabling
2564
2565<6>[ 2.619280] gdsc_mmagic_bimc: disabling
2566
2567<6>[ 2.619284] rome_vreg: disabling
2568
2569<6>[ 2.619351] usb_otg_vreg: disabling
2570
2571<6>[ 2.619358] regulator_proxy_consumer_remove_all: removing regulator proxy consumer requests
2572
2573<6>[ 2.619618] clock_late_init: Removing enables held for handed-off clocks
2574
2575<3>[ 2.620010] msm8996-asoc-snd soc:sound-ak4961: ASoC: platform (null) not registered
2576
2577<6>[ 2.623191] ALSA device list:
2578
2579<6>[ 2.623197] No soundcards found.
2580
2581<3>[ 2.623244] Warning: unable to open an initial console.
2582
2583<6>[ 2.623465] Freeing unused kernel memory: 2104K (ffffffc001200000 - ffffffc00140e000)
2584
2585<6>[ 2.623474] Freeing alternatives memory: 24K (ffffffc00140e000 - ffffffc001414000)
2586
2587<13>[ 2.624152] init: init started!
2588
2589<7>[ 2.625618] SELinux: 2048 avtab hash slots, 4855 rules.
2590
2591<7>[ 2.626362] SELinux: 2048 avtab hash slots, 4855 rules.
2592
2593<7>[ 2.626372] SELinux: 1 users, 2 roles, 530 types, 0 bools, 1 sens, 1024 cats
2594
2595<7>[ 2.626377] SELinux: 87 classes, 4855 rules
2596
2597<6>[ 2.626790] SELinux: Permission audit_read in class capability2 not defined in policy.
2598
2599<6>[ 2.626805] SELinux: the above unknown classes and permissions will be denied
2600
2601<7>[ 2.626818] SELinux: Completing initialization.
2602
2603<7>[ 2.626820] SELinux: Setting up existing superblocks.
2604
2605<7>[ 2.626829] SELinux: initialized (dev tmpfs, type tmpfs), uses transition SIDs
2606
2607<7>[ 2.626842] SELinux: initialized (dev rootfs, type rootfs), uses genfs_contexts
2608
2609<7>[ 2.627275] SELinux: initialized (dev bdev, type bdev), not configured for labeling
2610
2611<7>[ 2.627283] SELinux: initialized (dev proc, type proc), uses genfs_contexts
2612
2613<7>[ 2.627298] SELinux: initialized (dev debugfs, type debugfs), uses genfs_contexts
2614
2615<7>[ 2.643737] SELinux: initialized (dev sockfs, type sockfs), uses task SIDs
2616
2617<7>[ 2.643748] SELinux: initialized (dev pipefs, type pipefs), uses task SIDs
2618
2619<7>[ 2.643755] SELinux: initialized (dev anon_inodefs, type anon_inodefs), not configured for labeling
2620
2621<7>[ 2.643760] SELinux: initialized (dev aio, type aio), not configured for labeling
2622
2623<7>[ 2.643766] SELinux: initialized (dev devpts, type devpts), uses transition SIDs
2624
2625<7>[ 2.643780] SELinux: initialized (dev selinuxfs, type selinuxfs), uses genfs_contexts
2626
2627<7>[ 2.643837] SELinux: initialized (dev configfs, type configfs), not configured for labeling
2628
2629<7>[ 2.643843] SELinux: initialized (dev tmpfs, type tmpfs), uses transition SIDs
2630
2631<7>[ 2.643857] SELinux: initialized (dev sysfs, type sysfs), uses genfs_contexts
2632
2633<5>[ 2.646898] audit: type=1403 audit(1298629.539:2): policy loaded auid=4294967295 ses=4294967295
2634
2635<13>[ 2.647205] init: (Initializing SELinux non-enforcing took 0.02s.)
2636
2637<13>[ 2.650153] init: init second stage started!
2638
2639<11>[ 2.987802] init: waitpid failed: No child processes
2640
2641<13>[ 2.988039] init: (Loading properties from /default.prop took 0.00s.)
2642
2643<11>[ 2.988307] init: /init.rc: 62: invalid command 'load_all_props'
2644
2645<11>[ 2.988360] init: could not import file '/init.recovery.logd.rc' from '/init.rc'
2646
2647<13>[ 2.988429] init: (Parsing /init.recovery.usb.rc took 0.00s.)
2648
2649<13>[ 2.988462] init: (Parsing /init.recovery.service.rc took 0.00s.)
2650
2651<13>[ 2.988505] init: (Parsing /init.recovery.qcom.rc took 0.00s.)
2652
2653<13>[ 2.988515] init: (Parsing /init.rc took 0.00s.)
2654
2655<5>[ 2.988576] audit: type=1400 audit(1298629.879:3): avc: denied { setcheckreqprot } for pid=1 comm="init" scontext=u:r:init:s0 tcontext=u:object_r:kernel:s0 tclass=security permissive=1
2656
2657<5>[ 2.988618] audit: type=1400 audit(1298629.879:4): avc: denied { setcurrent } for pid=1 comm="init" scontext=u:r:init:s0 tcontext=u:r:init:s0 tclass=process permissive=1
2658
2659<5>[ 2.988634] audit: type=1400 audit(1298629.879:5): avc: denied { dyntransition } for pid=1 comm="init" scontext=u:r:init:s0 tcontext=u:r:init:s0 tclass=process permissive=1
2660
2661<11>[ 2.988664] init: SELinux: Could not get canonical path /postinstall restorecon: No such file or directory.
2662
2663<13>[ 2.988691] init: Starting service 'ueventd'...
2664
2665<13>[ 2.988854] init: Starting service 'healthd'...
2666
2667<13>[ 2.988982] init: Waiting for /dev/.coldboot_done...
2668
2669<13>[ 2.990462] ueventd: ueventd started!
2670
2671<6>[ 3.090062] SMBCHG: smbchg_parallel_usb_en_work: AICL at 1700
2672
2673<6>[ 3.090097] SMBCHG: smbchg_is_parallel_usb_ok: Not in fast charge, skipping
2674
2675<6>[ 3.217264] SMBCHG: smbchg_calc_max_flash_current: avail_iflash=2645800, ocv=4190344, ibat=531300, rbatt=173059
2676
2677<6>[ 3.218730] SMBCHG: smbchg_shipmode_get: get shipmode_test is 1
2678
2679<6>[ 3.562447] of_batterydata_get_best_profile: ZTE_BATTERY_DATA_ID_1 found
2680
2681<6>[ 3.600066] SMBCHG: smbchg_parallel_usb_en_work: AICL at 1700
2682
2683<6>[ 3.600101] SMBCHG: smbchg_is_parallel_usb_ok: Not in fast charge, skipping
2684
2685<13>[ 3.837969] ueventd: Coldboot took 0.85s.
2686
2687<13>[ 3.846275] init: Waiting for /dev/.coldboot_done took 0.86s.
2688
2689<7>[ 3.847306] SELinux: initialized (dev tmpfs, type tmpfs), uses transition SIDs
2690
2691<7>[ 3.848653] SELinux: initialized (dev pstore, type pstore), uses genfs_contexts
2692
2693<7>[ 3.849185] SELinux: initialized (dev functionfs, type functionfs), uses genfs_contexts
2694
2695<3>[ 3.849320] enable_store: android_usb: already disabled
2696
2697<13>[ 3.849584] init: (Loading properties from /system/build.prop took 0.00s.)
2698
2699<13>[ 3.849610] init: (Loading properties from /vendor/build.prop took 0.00s.)
2700
2701<13>[ 3.849631] init: (Loading properties from /factory/factory.prop took 0.00s.)
2702
2703<13>[ 3.852027] init: (Loading properties from /data/local.prop took 0.00s.)
2704
2705<11>[ 3.852056] init: Unable to open persistent property directory "/data/property": No such file or directory
2706
2707<13>[ 3.852412] init: Starting service 'set_permissive'...
2708
2709<13>[ 3.852644] init: Starting service 'recovery'...
2710
2711<13>[ 3.853394] init: Starting service 'adbd'...
2712
2713<13>[ 3.853654] init: Service 'adbd' is being killed...
2714
2715<6>[ 3.855799] read descriptors
2716
2717<6>[ 3.855816] read strings
2718
2719<6>[ 3.855837] mtp_bind_config
2720
2721<5>[ 3.861451] audit: type=1400 audit(1298630.759:6): avc: denied { write } for pid=403 comm="setenforce" name="enforce" dev="selinuxfs" ino=4 scontext=u:r:recovery:s0 tcontext=u:object_r:selinuxfs:s0 tclass=file permissive=1
2722
2723<13>[ 3.862180] init: Service 'set_permissive' (pid 399) exited with status 0
2724
2725<11>[ 3.871154] init: avc: denied { set } for property=twrp.crash_counter scontext=u:r:recovery:s0 tcontext=u:object_r:default_prop:s0 tclass=property_service
2726
2727<6>[ 3.887204] DBG fb_blank, initialize for only once
2728
2729<6>[ 3.887209] DBG fb_blank, lcd_status=-1, blank=4, Start
2730
2731<6>[ 3.887274] ZTE_PM turn LCD OFF
2732
2733<4>[ 3.887304] synaptics_rmi4_suspend: start!
2734
2735<4>[ 3.887306] synaptics_rmi4_suspend---wakeup gesture diabled!
2736
2737<4>[ 3.887311] synaptics_rmi4_irq_enable_zte:disable_irq---rmi4_data->irq_enabled=0
2738
2739<4>[ 3.910061] synaptics_rmi4_enable_reg : disable regulator of pwr_reg successfully!
2740
2741<4>[ 3.910091] synaptics_rmi4_enable_reg : disable regulator of bus_reg successfully!---retval==0
2742
2743<4>[ 3.910092] synaptics_rmi4_suspend: disable regulator succeed!
2744
2745<4>[ 3.910099] synaptics_rmi4_suspend: end!
2746
2747<4>[ 3.910109] synaptics_rmi4_fb_notifier_cb: ret=97, HZ=100
2748
2749<6>[ 3.910110] DBG fb_blank, lcd_status=4, blank=4, End
2750
2751<6>[ 3.910137] DBG fb_blank, lcd_status=4, blank=0, Start
2752
2753<6>[ 3.910230] ZTE_PM turn LCD ON
2754
2755<6>[ 3.910237] DBG fb_blank, lcd_status=0, blank=0, End
2756
2757<4>[ 3.910245] synaptics_rmi4_resume: start!
2758
2759<4>[ 3.910253] synaptics_rmi4_resume:syna_wake_gesture_flag=0
2760
2761<6>[ 3.926492] android_work: android_work: sent uevent USB_STATE=CONNECTED
2762
2763<4>[ 3.940530] synaptics_rmi4_enable_reg : enable power regulator of bus_reg successfully!
2764
2765<4>[ 3.940533] synaptics_rmi4_enable_reg : enable power regulator of pwr_reg successfully!
2766
2767<6>[ 4.007758] android_usb gadget: super-speed config #1: 66bf0c8.android_usb
2768
2769<6>[ 4.007942] msm-dwc3 6a00000.ssusb: Avail curr from USB = 900
2770
2771<4>[ 4.007966] [zte]psy change, func dwc3_msm_power_set_property_usb,line 2498,psy name: usb
2772
2773<4>[ 4.007993] [zte]psy change, func dwc3_msm_power_set_property_usb,line 2498,psy name: usb
2774
2775<4>[ 4.008011] [zte]psy change, func dwc3_msm_power_set_property_usb,line 2498,psy name: usb
2776
2777<4>[ 4.008030] [zte]psy change, func dwc3_msm_gadget_vbus_draw,line 3371,psy name: usb
2778
2779<6>[ 4.009054] SMBCHG: smbchg_config_chg_battery_type: Battery-type not identified
2780
2781<6>[ 4.009101] SMBCHG: smbchg_external_power_changed: usb type = SDP current_limit = 900
2782
2783<6>[ 4.009121] SMBCHG: smbchg_set_usb_current_max: USB current_ma = 900
2784
2785<6>[ 4.009594] SMBCHG: power_ok_handler: triggered: 0x01
2786
2787<6>[ 4.009933] SMBCHG: smbchg_set_usb_current_max: usb type = 4 current set to 900 mA
2788
2789<6>[ 4.010011] SMBCHG: smbchg_vfloat_adjust_check: Starting vfloat adjustments
2790
2791<4>[ 4.010796] [zte]psy change, func smbchg_external_power_changed,line 3861,psy name: battery
2792
2793<6>[ 4.011791] SMBCHG: smbchg_vfloat_adjust_work: Stopping vfloat adj taper=0 parallel_ma = 0
2794
2795<6>[ 4.017283] SMBCHG: smbchg_calc_max_flash_current: avail_iflash=2526200, ocv=4190344, ibat=710700, rbatt=172143
2796
2797<6>[ 4.018768] SMBCHG: smbchg_shipmode_get: get shipmode_test is 1
2798
2799<4>[ 4.050072] synaptics_rmi4_resume: enable regulator succeed!
2800
2801<4>[ 4.050081] synaptics_rmi4_resume: HW reset start!
2802
2803<6>[ 4.060080] android_work: android_work: sent uevent USB_STATE=CONFIGURED
2804
2805<5>[ 4.090380] audit: type=1400 audit(1298630.989:7): avc: denied { write } for pid=400 comm="recovery" name="etc" dev="rootfs" ino=9503 scontext=u:r:recovery:s0 tcontext=u:object_r:rootfs:s0 tclass=dir permissive=1
2806
2807<5>[ 4.090398] audit: type=1400 audit(1298630.989:8): avc: denied { add_name } for pid=400 comm="recovery" name="mtab" scontext=u:r:recovery:s0 tcontext=u:object_r:rootfs:s0 tclass=dir permissive=1
2808
2809<5>[ 4.090416] audit: type=1400 audit(1298630.989:9): avc: denied { create } for pid=400 comm="recovery" name="mtab" scontext=u:r:recovery:s0 tcontext=u:object_r:rootfs:s0 tclass=lnk_file permissive=1
2810
2811<5>[ 4.090875] audit: type=1400 audit(1298630.989:10): avc: denied { create } for pid=400 comm="recovery" name="persist" scontext=u:r:recovery:s0 tcontext=u:object_r:rootfs:s0 tclass=dir permissive=1
2812
2813<6>[ 4.099960] F2FS-fs (sda9): Magic Mismatch, valid(0xf2f52010) - read(0xa0c82518)
2814
2815<3>[ 4.099970] F2FS-fs (sda9): Can't find valid F2FS filesystem in 1th superblock
2816
2817<6>[ 4.100106] F2FS-fs (sda9): Magic Mismatch, valid(0xf2f52010) - read(0x1d64e32)
2818
2819<3>[ 4.100111] F2FS-fs (sda9): Can't find valid F2FS filesystem in 2th superblock
2820
2821<6>[ 4.100117] F2FS-fs (sda9): Magic Mismatch, valid(0xf2f52010) - read(0xa0c82518)
2822
2823<3>[ 4.100121] F2FS-fs (sda9): Can't find valid F2FS filesystem in 1th superblock
2824
2825<6>[ 4.100124] F2FS-fs (sda9): Magic Mismatch, valid(0xf2f52010) - read(0x1d64e32)
2826
2827<3>[ 4.100128] F2FS-fs (sda9): Can't find valid F2FS filesystem in 2th superblock
2828
2829<6>[ 4.100313] F2FS-fs (sda9): Magic Mismatch, valid(0xf2f52010) - read(0xa0c82518)
2830
2831<3>[ 4.100317] F2FS-fs (sda9): Can't find valid F2FS filesystem in 1th superblock
2832
2833<6>[ 4.100449] F2FS-fs (sda9): Magic Mismatch, valid(0xf2f52010) - read(0x1d64e32)
2834
2835<3>[ 4.100453] F2FS-fs (sda9): Can't find valid F2FS filesystem in 2th superblock
2836
2837<6>[ 4.100458] F2FS-fs (sda9): Magic Mismatch, valid(0xf2f52010) - read(0xa0c82518)
2838
2839<3>[ 4.100461] F2FS-fs (sda9): Can't find valid F2FS filesystem in 1th superblock
2840
2841<6>[ 4.100464] F2FS-fs (sda9): Magic Mismatch, valid(0xf2f52010) - read(0x1d64e32)
2842
2843<3>[ 4.100468] F2FS-fs (sda9): Can't find valid F2FS filesystem in 2th superblock
2844
2845<6>[ 4.107852] F2FS-fs (sda9): Magic Mismatch, valid(0xf2f52010) - read(0xa0c82518)
2846
2847<3>[ 4.107860] F2FS-fs (sda9): Can't find valid F2FS filesystem in 1th superblock
2848
2849<6>[ 4.107994] F2FS-fs (sda9): Magic Mismatch, valid(0xf2f52010) - read(0x1d64e32)
2850
2851<3>[ 4.107998] F2FS-fs (sda9): Can't find valid F2FS filesystem in 2th superblock
2852
2853<6>[ 4.108003] F2FS-fs (sda9): Magic Mismatch, valid(0xf2f52010) - read(0xa0c82518)
2854
2855<3>[ 4.108006] F2FS-fs (sda9): Can't find valid F2FS filesystem in 1th superblock
2856
2857<6>[ 4.108010] F2FS-fs (sda9): Magic Mismatch, valid(0xf2f52010) - read(0x1d64e32)
2858
2859<3>[ 4.108013] F2FS-fs (sda9): Can't find valid F2FS filesystem in 2th superblock
2860
2861<6>[ 4.108185] F2FS-fs (sda9): Magic Mismatch, valid(0xf2f52010) - read(0xa0c82518)
2862
2863<3>[ 4.108189] F2FS-fs (sda9): Can't find valid F2FS filesystem in 1th superblock
2864
2865<6>[ 4.108320] F2FS-fs (sda9): Magic Mismatch, valid(0xf2f52010) - read(0x1d64e32)
2866
2867<3>[ 4.108324] F2FS-fs (sda9): Can't find valid F2FS filesystem in 2th superblock
2868
2869<6>[ 4.108328] F2FS-fs (sda9): Magic Mismatch, valid(0xf2f52010) - read(0xa0c82518)
2870
2871<3>[ 4.108331] F2FS-fs (sda9): Can't find valid F2FS filesystem in 1th superblock
2872
2873<6>[ 4.108334] F2FS-fs (sda9): Magic Mismatch, valid(0xf2f52010) - read(0x1d64e32)
2874
2875<3>[ 4.108337] F2FS-fs (sda9): Can't find valid F2FS filesystem in 2th superblock
2876
2877<6>[ 4.121084] EXT4-fs (sda2): 1 orphan inode deleted
2878
2879<6>[ 4.121093] EXT4-fs (sda2): recovery complete
2880
2881<6>[ 4.124112] EXT4-fs (sda2): mounted filesystem with ordered data mode. Opts:
2882
2883<7>[ 4.124132] SELinux: initialized (dev sda2, type ext4), uses xattr
2884
2885<11>[ 4.125278] init: avc: denied { set } for property=crypto.state scontext=u:r:recovery:s0 tcontext=u:object_r:vold_prop:s0 tclass=property_service
2886
2887<13>[ 4.125497] init: Starting service 'qseecomd'...
2888
2889<6>[ 4.133816] capability: warning: `qseecomd' uses 32-bit capabilities (legacy support in use)
2890
2891<11>[ 4.139566] init: avc: denied { set } for property=sys.listeners.registered scontext=u:r:recovery:s0 tcontext=u:object_r:system_prop:s0 tclass=property_service
2892
2893<4>[ 4.190105] synaptics_rmi4_resume: HW reset end!
2894
2895<4>[ 4.191746] synaptics_rmi4_irq_enable_zte:enable_irq---rmi4_data->irq_enabled=1
2896
2897<4>[ 4.192208] synaptics_rmi4_glove_mode_enable: disable glove mode successfully!
2898
2899<4>[ 4.192234] synaptics_rmi4_resume:hall_state = 0
2900
2901<4>[ 4.192255] synaptics_rmi4_resume: end!
2902
2903<4>[ 4.330184] Syna--fwu_start_reflash--loop time is valid
2904
2905<5>[ 4.330218] fwu_start_reflash: Start of reflash process
2906
2907<4>[ 4.330247] syna---fwu_start_reflash:fwu->image =NULL!
2908
2909<4>[ 4.330267] syna---enter fwu_do_read_config
2910
2911<4>[ 4.330285] syna---fwu->config_area=PM_CONFIG_AREA!
2912
2913<5>[ 4.333048] synaptics_rmi4_sensor_report: spontaneous reset detected
2914
2915<4>[ 4.360135] syna---enter fwu_do_read_config
2916
2917<4>[ 4.360166] syna---fwu->config_area=PM_CONFIG_AREA!
2918
2919<4>[ 4.375688] syna---fwu_start_reflash:customer_ID_1st=A2PRO4801 customer_ID_2nd=A2PRO4801
2920
2921<4>[ 4.375720] syna---fwu_start_reflash:fwu->image_name=synaptics/startup_fw_update_key.img
2922
2923<4>[ 4.376621] pzh:get_configID_addr=0x13
2924
2925<4>[ 4.376647] fwu_go_nogo: syna_config_id =0x0037, syna_version_id =0x0039
2926
2927<4>[ 4.376666] syna---fwu_go_nogo:with key!
2928
2929<6>[ 4.376697] synaptics_dsx_i2c 12-0020: fwu_go_nogo: Device firmware ID = 2310741
2930
2931<6>[ 4.376725] synaptics_dsx_i2c 12-0020: fwu_go_nogo: Image firmware ID = 2310741
2932
2933<4>[ 4.377757] pzh:fwu_get_device_config_id---f34_fd.ctrl_base_addr=0x13
2934
2935<4>[ 4.377783] syna_fwu->img.ui_config.data[0]=0x50,fwu->config_id[0]=0x50
2936
2937<4>[ 4.377806] syna_fwu->img.ui_config.data[1]=0x48,fwu->config_id[1]=0x48
2938
2939<4>[ 4.377826] syna_fwu->img.ui_config.data[2]=0x37,fwu->config_id[2]=0x37
2940
2941<4>[ 4.377845] syna_fwu->img.ui_config.data[3]=0x39,fwu->config_id[3]=0x39
2942
2943<4>[ 4.377864] syna_fwu->img.ui_config.data[4]=0x0,fwu->config_id[4]=0x0
2944
2945<4>[ 4.377883] syna_fwu->img.ui_config.data[5]=0x0,fwu->config_id[5]=0x0
2946
2947<4>[ 4.377901] syna_fwu->img.ui_config.data[6]=0x0,fwu->config_id[6]=0x0
2948
2949<4>[ 4.377921] syna_fwu->img.ui_config.data[7]=0x0,fwu->config_id[7]=0x0
2950
2951<4>[ 4.377939] syna_fwu->img.ui_config.data[8]=0x0,fwu->config_id[8]=0x0
2952
2953<4>[ 4.377957] syna_fwu->img.ui_config.data[9]=0x0,fwu->config_id[9]=0x0
2954
2955<4>[ 4.377976] syna_fwu->img.ui_config.data[10]=0x0,fwu->config_id[10]=0x0
2956
2957<4>[ 4.377994] syna_fwu->img.ui_config.data[11]=0x0,fwu->config_id[11]=0x0
2958
2959<4>[ 4.378013] syna_fwu->img.ui_config.data[12]=0x0,fwu->config_id[12]=0x0
2960
2961<4>[ 4.378031] syna_fwu->img.ui_config.data[13]=0x0,fwu->config_id[13]=0x0
2962
2963<4>[ 4.378049] syna_fwu->img.ui_config.data[14]=0x0,fwu->config_id[14]=0x0
2964
2965<4>[ 4.378068] syna_fwu->img.ui_config.data[15]=0x0,fwu->config_id[15]=0x0
2966
2967<4>[ 4.378086] syna_fwu->img.ui_config.data[16]=0x0,fwu->config_id[16]=0x0
2968
2969<4>[ 4.378104] syna_fwu->img.ui_config.data[17]=0x0,fwu->config_id[17]=0x0
2970
2971<4>[ 4.378123] syna_fwu->img.ui_config.data[18]=0x0,fwu->config_id[18]=0x0
2972
2973<4>[ 4.378141] syna_fwu->img.ui_config.data[19]=0x0,fwu->config_id[19]=0x0
2974
2975<4>[ 4.378159] syna_fwu->img.ui_config.data[20]=0x0,fwu->config_id[20]=0x0
2976
2977<4>[ 4.378178] syna_fwu->img.ui_config.data[21]=0x0,fwu->config_id[21]=0x0
2978
2979<4>[ 4.378196] syna_fwu->img.ui_config.data[22]=0x0,fwu->config_id[22]=0x0
2980
2981<4>[ 4.378214] syna_fwu->img.ui_config.data[23]=0x0,fwu->config_id[23]=0x0
2982
2983<4>[ 4.378232] syna_fwu->img.ui_config.data[24]=0x0,fwu->config_id[24]=0x0
2984
2985<4>[ 4.378250] syna_fwu->img.ui_config.data[25]=0x0,fwu->config_id[25]=0x0
2986
2987<4>[ 4.378268] syna_fwu->img.ui_config.data[26]=0x0,fwu->config_id[26]=0x0
2988
2989<4>[ 4.378286] syna_fwu->img.ui_config.data[27]=0x0,fwu->config_id[27]=0x0
2990
2991<4>[ 4.378304] syna_fwu->img.ui_config.data[28]=0x0,fwu->config_id[28]=0x0
2992
2993<4>[ 4.378322] syna_fwu->img.ui_config.data[29]=0x0,fwu->config_id[29]=0x0
2994
2995<4>[ 4.378340] syna_fwu->img.ui_config.data[30]=0x0,fwu->config_id[30]=0x0
2996
2997<4>[ 4.378358] syna_fwu->img.ui_config.data[31]=0x0,fwu->config_id[31]=0x0
2998
2999<4>[ 4.378373] syna_flash_area=0
3000
3001<6>[ 4.378398] synaptics_dsx_i2c 12-0020: fwu_go_nogo: No need to do reflash
3002
3003<4>[ 4.378455] syna---fwu_start_reflash---nothing to update
3004
3005<4>[ 4.378474] syna---fwu_start_reflash: End of reflash process
3006
3007<6>[ 4.378493] synaptics_fw_updater: update success
3008
3009<6>[ 4.520163] SMBCHG: smbchg_parallel_usb_en_work: AICL at 1700
3010
3011<6>[ 4.520226] SMBCHG: smbchg_is_parallel_usb_ok: Not in fast charge, skipping
3012
3013<5>[ 4.607296] random: nonblocking pool is initialized
3014
3015<6>[ 5.560234] of_batterydata_get_best_profile: ZTE_BATTERY_DATA_ID_1 found
3016
3017<4>[ 5.577286] [zte]psy change, func fg_batt_profile_init,line 5980,psy name: bms
3018
3019<6>[ 5.577735] FG: fg_batt_profile_init: Battery SOC: 84, V: 4203924uV
3020
3021<6>[ 5.579145] SMBCHG: smbchg_cc_esr_wa_check: Not in fast charge, skipping
3022
3023<6>[ 5.579281] of_batterydata_get_best_profile: ZTE_BATTERY_DATA_ID_1 found
3024
3025<6>[ 5.579318] SMBCHG: smbchg_external_power_changed: usb type = SDP current_limit = 900
3026
3027<6>[ 5.579323] SMBCHG: smbchg_vfloat_adjust_check: Starting vfloat adjustments
3028
3029<4>[ 5.579328] [zte]psy change, func smbchg_external_power_changed,line 3861,psy name: battery
3030
3031<6>[ 5.579412] SMBCHG: smbchg_vfloat_adjust_work: Stopping vfloat adj taper=0 parallel_ma = 0
3032
3033<6>[ 5.581423] SMBCHG: smbchg_calc_max_flash_current: avail_iflash=3004600, ocv=4190344, ibat=-6900, rbatt=171228
3034
3035<6>[ 5.582804] SMBCHG: smbchg_shipmode_get: get shipmode_test is 1
3036
3037<6>[ 5.660868] SMBCHG: fastchg_handler: p2f triggered
3038
3039<4>[ 5.660887] [zte]psy change, func fastchg_handler,line 6332,psy name: battery
3040
3041<6>[ 5.660892] SMBCHG: smbchg_vfloat_adjust_check: Starting vfloat adjustments
3042
3043<6>[ 5.661040] SMBCHG: smbchg_vfloat_adjust_work: Stopping vfloat adj taper=0 parallel_ma = 0
3044
3045<6>[ 5.662408] SMBCHG: smbchg_calc_max_flash_current: avail_iflash=3034500, ocv=4190344, ibat=-51750, rbatt=171228
3046
3047<4>[ 5.663348] [zte]psy change, func fg_vbatt_low_handler,line 4624,psy name: bms
3048
3049<6>[ 5.663974] SMBCHG: smbchg_shipmode_get: get shipmode_test is 1
3050
3051<6>[ 5.665379] SMBCHG: smbchg_external_power_changed: usb type = SDP current_limit = 900
3052
3053<6>[ 5.665482] SMBCHG: smbchg_vfloat_adjust_check: Starting vfloat adjustments
3054
3055<4>[ 5.665508] [zte]psy change, func smbchg_external_power_changed,line 3861,psy name: battery
3056
3057<6>[ 5.665723] SMBCHG: smbchg_vfloat_adjust_work: Stopping vfloat adj taper=0 parallel_ma = 0
3058
3059<6>[ 5.667362] SMBCHG: smbchg_calc_max_flash_current: avail_iflash=3034500, ocv=4190344, ibat=-51750, rbatt=171228
3060
3061<6>[ 5.669439] SMBCHG: smbchg_shipmode_get: get shipmode_test is 1
3062
3063<6>[ 6.170100] SMBCHG: smbchg_parallel_usb_en_work: AICL at 1700
3064
3065<6>[ 6.170136] SMBCHG: smbchg_is_parallel_usb_ok: SDP adapter, skipping
3066
3067<3>[ 7.809547] QSEECOM: __qseecom_process_incomplete_cmd: fail:resp res= -65,app_id = 0,lstr = 12288
3068
3069<6>[ 7.809557] get_ice_device_from_storage_type: found ice device ffffffc0759e6200
3070
3071<3>[ 7.933599] QSEECOM: __qseecom_process_incomplete_cmd: fail:resp res= -71,app_id = 0,lstr = 12288
3072
3073<3>[ 7.933605] QSEECOM: __qseecom_set_clear_ce_key: process_incomplete_cmd FAILED, resp.result -71
3074
3075<6>[ 7.933610] get_ice_device_from_storage_type: found ice device ffffffc0759e6200
3076
3077<3>[ 7.934124] QSEECOM: qseecom_create_key: Failed to create key: pipe 2, ce 0: -22
3078
3079<3>[ 7.934129] QSEECOM: qseecom_ioctl: failed to create encryption key: -22
3080
3081<3>[ 11.489088] scm_call failed: func id 0x72000501, arginfo: 0x22, args: 0x1762b7000, 0x1000, 0x0, 0x0, ret: -2, syscall returns: 0xffffffffffffffbf, 0x0, 0x0
3082
3083<6>[ 11.489100] get_ice_device_from_storage_type: found ice device ffffffc0759e6200
3084
3085<6>[ 11.616891] get_ice_device_from_storage_type: found ice device ffffffc0759e6200
3086
3087<3>[ 11.617413] QSEECOM: qseecom_create_key: Set the key successfully
3088
3089<4>[ 11.617566] audit_printk_skb: 27 callbacks suppressed
3090
3091<5>[ 11.617571] audit: type=1400 audit(1298638.509:20): avc: denied { read write } for pid=400 comm="recovery" name="device-mapper" dev="tmpfs" ino=11444 scontext=u:r:recovery:s0 tcontext=u:object_r:dm_device:s0 tclass=chr_file permissive=1
3092
3093<5>[ 11.617588] audit: type=1400 audit(1298638.509:21): avc: denied { open } for pid=400 comm="recovery" path="/dev/device-mapper" dev="tmpfs" ino=11444 scontext=u:r:recovery:s0 tcontext=u:object_r:dm_device:s0 tclass=chr_file permissive=1
3094
3095<5>[ 11.617613] audit: type=1400 audit(1298638.509:22): avc: denied { ioctl } for pid=400 comm="recovery" path="/dev/device-mapper" dev="tmpfs" ino=11444 ioctlcmd=fd03 scontext=u:r:recovery:s0 tcontext=u:object_r:dm_device:s0 tclass=chr_file permissive=1
3096
3097<6>[ 11.618212] device-mapper: req-crypt: req_crypt_ctr: Mapping block_device /dev/block/sda9 to dm-req-crypt ok!
3098
3099<6>[ 11.618212]
3100
3101<4>[ 11.618444] device-mapper: table: 254:0: adding target device sda9 caused an alignment inconsistency: physical_block_size=16384, logical_block_size=4096, alignment_offset=0, start=0
3102
3103<4>[ 11.618452] device-mapper: table: 254:0: adding target device sda9 caused an alignment inconsistency: physical_block_size=16384, logical_block_size=4096, alignment_offset=0, start=0
3104
3105<7>[ 13.228983] SELinux: initialized (dev dm-0, type f2fs), uses xattr
3106
3107<5>[ 13.229494] audit: type=1400 audit(1298640.119:23): avc: denied { getattr } for pid=400 comm="recovery" path="/data/media" dev="dm-0" ino=127130 scontext=u:r:recovery:s0 tcontext=u:object_r:media_rw_data_file:s0 tclass=dir permissive=1
3108
3109<6>[ 13.325528] EXT4-fs (sde13): INFO: recovery required on readonly filesystem
3110
3111<6>[ 13.325539] EXT4-fs (sde13): write access will be enabled during recovery
3112
3113<6>[ 13.329879] EXT4-fs (sde13): recovery complete
3114
3115<6>[ 13.330974] EXT4-fs (sde13): mounted filesystem with ordered data mode. Opts:
3116
3117<7>[ 13.331033] SELinux: initialized (dev sde13, type ext4), uses xattr
3118
3119<7>[ 13.586538] SELinux: initialized (dev dm-0, type f2fs), uses xattr
3120
3121<5>[ 13.638099] audit: type=1400 audit(1298640.529:24): avc: denied { read } for pid=400 comm="recovery" name="/" dev="dm-0" ino=3 scontext=u:r:recovery:s0 tcontext=u:object_r:system_data_file:s0 tclass=dir permissive=1
3122
3123<5>[ 13.638128] audit: type=1400 audit(1298640.529:25): avc: denied { open } for pid=400 comm="recovery" path="/data" dev="dm-0" ino=3 scontext=u:r:recovery:s0 tcontext=u:object_r:system_data_file:s0 tclass=dir permissive=1
3124
3125<5>[ 13.640541] audit: type=1400 audit(1298640.539:26): avc: denied { getattr } for pid=400 comm="recovery" path="/data/bootchart" dev="dm-0" ino=147590 scontext=u:r:recovery:s0 tcontext=u:object_r:bootchart_data_file:s0 tclass=dir permissive=1
3126
3127<5>[ 13.640585] audit: type=1400 audit(1298640.539:27): avc: denied { read } for pid=400 comm="recovery" name="bootchart" dev="dm-0" ino=147590 scontext=u:r:recovery:s0 tcontext=u:object_r:bootchart_data_file:s0 tclass=dir permissive=1
3128
3129<5>[ 13.640604] audit: type=1400 audit(1298640.539:28): avc: denied { open } for pid=400 comm="recovery" path="/data/bootchart" dev="dm-0" ino=147590 scontext=u:r:recovery:s0 tcontext=u:object_r:bootchart_data_file:s0 tclass=dir permissive=1
3130
3131<5>[ 13.641777] audit: type=1400 audit(1298640.539:29): avc: denied { getattr } for pid=400 comm="recovery" path="/data/misc/adb" dev="dm-0" ino=147667 scontext=u:r:recovery:s0 tcontext=u:object_r:adb_keys_file:s0 tclass=dir permissive=1
3132
3133<6>[ 13.694985] SELinux: Context u:object_r:qfp-daemon_data_file:s0 is not valid (left unmapped).
3134
3135<6>[ 13.697602] SELinux: Context u:object_r:data_qsee_file:s0 is not valid (left unmapped).
3136
3137<6>[ 13.702203] SELinux: Context u:object_r:ipacm_data_file:s0 is not valid (left unmapped).
3138
3139<6>[ 13.703374] SELinux: Context u:object_r:port_bridge_data_file:s0 is not valid (left unmapped).
3140
3141<6>[ 13.710858] SELinux: Context u:object_r:display_misc_file:s0 is not valid (left unmapped).
3142
3143<6>[ 13.712053] SELinux: Context u:object_r:location_data_file:s0 is not valid (left unmapped).
3144
3145<6>[ 13.713225] SELinux: Context u:object_r:location_socket:s0 is not valid (left unmapped).
3146
3147<6>[ 13.721822] SELinux: Context u:object_r:fm_data_file:s0 is not valid (left unmapped).
3148
3149<6>[ 13.722564] SELinux: Context u:object_r:RIDL_data_file:s0 is not valid (left unmapped).
3150
3151<6>[ 13.725865] SELinux: Context u:object_r:RIDL_socket:s0 is not valid (left unmapped).
3152
3153<6>[ 13.729416] SELinux: Context u:object_r:mpctl_socket:s0 is not valid (left unmapped).
3154
3155<6>[ 13.730737] SELinux: Context u:object_r:iop_data_file:s0 is not valid (left unmapped).
3156
3157<6>[ 13.731962] SELinux: Context u:object_r:dts_data_file:s0 is not valid (left unmapped).
3158
3159<6>[ 13.732650] SELinux: Context u:object_r:tlocd_data_file:s0 is not valid (left unmapped).
3160
3161<6>[ 13.734104] SELinux: Context u:object_r:qvop_data_file:s0 is not valid (left unmapped).
3162
3163<6>[ 13.734786] SELinux: Context u:object_r:audio_pp_data_file:s0 is not valid (left unmapped).
3164
3165<6>[ 13.735882] SELinux: Context u:object_r:sensors_data_file:s0 is not valid (left unmapped).
3166
3167<6>[ 15.314977] SELinux: Context u:object_r:qtitetherservice_app_data_file:s0 is not valid (left unmapped).
3168
3169<6>[ 16.693604] SELinux: Context u:object_r:dpmd_app_data_file:s0 is not valid (left unmapped).
3170
3171<6>[ 16.712369] SELinux: Context u:object_r:location_app_data_file:s0 is not valid (left unmapped).
3172
3173<4>[ 16.741766] audit_printk_skb: 261 callbacks suppressed
3174
3175<5>[ 16.741801] audit: type=1400 audit(1298643.639:117): avc: denied { getattr } for pid=400 comm="recovery" path="/data/data/com.android.bluetooth/lib" dev="dm-0" ino=185354 scontext=u:r:recovery:s0 tcontext=u:object_r:bluetooth_data_file:s0 tclass=lnk_file permissive=1
3176
3177<6>[ 32.483042] SELinux: Context u:object_r:qsee_svc_app_data_file:s0 is not valid (left unmapped).
3178
3179<5>[ 33.249637] audit: type=1400 audit(1298660.139:118): avc: denied { getattr } for pid=400 comm="recovery" path="/data/data/com.android.nfc" dev="dm-0" ino=209236 scontext=u:r:recovery:s0 tcontext=u:object_r:nfc_data_file:s0 tclass=dir permissive=1
3180
3181<5>[ 33.249802] audit: type=1400 audit(1298660.139:119): avc: denied { read } for pid=400 comm="recovery" name="com.android.nfc" dev="dm-0" ino=209236 scontext=u:r:recovery:s0 tcontext=u:object_r:nfc_data_file:s0 tclass=dir permissive=1
3182
3183<5>[ 33.249898] audit: type=1400 audit(1298660.139:120): avc: denied { open } for pid=400 comm="recovery" path="/data/data/com.android.nfc" dev="dm-0" ino=209236 scontext=u:r:recovery:s0 tcontext=u:object_r:nfc_data_file:s0 tclass=dir permissive=1
3184
3185<5>[ 33.254634] audit: type=1400 audit(1298660.149:121): avc: denied { getattr } for pid=400 comm="recovery" path="/data/data/com.android.nfc/files/dynamic_apduservice.xml" dev="dm-0" ino=168511 scontext=u:r:recovery:s0 tcontext=u:object_r:nfc_data_file:s0 tclass=file permissive=1
3186
3187<5>[ 42.202899] audit: type=1400 audit(1298669.099:122): avc: denied { getattr } for pid=400 comm="recovery" path="/data/data/me.calebjones.spacelaunchnow/files/default.realm.management/access_control.new_commit.cv" dev="dm-0" ino=268689 scontext=u:r:recovery:s0 tcontext=u:object_r:app_data_file:s0:c512,c768 tclass=fifo_file permissive=1
3188
3189<5>[ 53.901772] audit: type=1400 audit(1298680.799:123): avc: denied { getattr } for pid=400 comm="recovery" path="/data/data/eu.chainfire.supersu/requests" dev="dm-0" ino=260694 scontext=u:r:recovery:s0 tcontext=u:object_r:app_data_file:s0 tclass=dir permissive=1
3190
3191<5>[ 53.901896] audit: type=1400 audit(1298680.799:124): avc: denied { read } for pid=400 comm="recovery" name="requests" dev="dm-0" ino=260694 scontext=u:r:recovery:s0 tcontext=u:object_r:app_data_file:s0 tclass=dir permissive=1
3192
3193<5>[ 53.901967] audit: type=1400 audit(1298680.799:125): avc: denied { open } for pid=400 comm="recovery" path="/data/data/eu.chainfire.supersu/requests" dev="dm-0" ino=260694 scontext=u:r:recovery:s0 tcontext=u:object_r:app_data_file:s0 tclass=dir permissive=1
3194
3195<5>[ 53.904003] audit: type=1400 audit(1298680.799:126): avc: denied { getattr } for pid=400 comm="recovery" path="/data/data/eu.chainfire.supersu/logs/L14835465580000.GRANTED.com.corner23.android.rootswitch" dev="dm-0" ino=264929 scontext=u:r:recovery:s0 tcontext=u:object_r:app_data_file:s0 tclass=file permissive=1
3196
3197<5>[ 53.953247] audit: type=1400 audit(1298680.849:127): avc: denied { getattr } for pid=400 comm="recovery" path="/data/data/ru.meefik.busybox/files/bin/[" dev="dm-0" ino=260882 scontext=u:r:recovery:s0 tcontext=u:object_r:app_data_file:s0:c512,c768 tclass=lnk_file permissive=1
3198
3199<5>[ 54.516684] audit: type=1400 audit(1298681.409:128): avc: denied { getattr } for pid=400 comm="recovery" path="/data/app-private" dev="dm-0" ino=262211 scontext=u:r:recovery:s0 tcontext=u:object_r:apk_private_data_file:s0 tclass=dir permissive=1
3200
3201<5>[ 54.516809] audit: type=1400 audit(1298681.409:129): avc: denied { read } for pid=400 comm="recovery" name="app-private" dev="dm-0" ino=262211 scontext=u:r:recovery:s0 tcontext=u:object_r:apk_private_data_file:s0 tclass=dir permissive=1
3202
3203<5>[ 54.516876] audit: type=1400 audit(1298681.409:130): avc: denied { open } for pid=400 comm="recovery" path="/data/app-private" dev="dm-0" ino=262211 scontext=u:r:recovery:s0 tcontext=u:object_r:apk_private_data_file:s0 tclass=dir permissive=1
3204
3205<5>[ 54.518058] audit: type=1400 audit(1298681.409:131): avc: denied { getattr } for pid=400 comm="recovery" path="/data/app-asec" dev="dm-0" ino=262213 scontext=u:r:recovery:s0 tcontext=u:object_r:asec_image_file:s0 tclass=dir permissive=1
3206
3207<6>[ 57.039048] SELinux: Context u:object_r:mpctl_data_file:s0 is not valid (left unmapped).
3208
3209<6>[ 57.041213] SELinux: Context u:object_r:gx_fpd_data_file:s0 is not valid (left unmapped).
3210
3211<6>[ 57.521736] SELinux: Context u:object_r:cnd_data_file:s0 is not valid (left unmapped).
3212
3213<6>[ 57.524692] SELinux: Context u:object_r:dpmd_data_file:s0 is not valid (left unmapped).
3214
3215<6>[ 57.529670] SELinux: Context u:object_r:time_data_file:s0 is not valid (left unmapped).
3216
3217<6>[ 57.536473] SELinux: Context u:object_r:output_sample_file:s0 is not valid (left unmapped).
3218
3219<6>[ 57.542020] SELinux: Context u:object_r:usf_data_file:s0 is not valid (left unmapped).
3220
3221<6>[ 58.159758] EXT4-fs (sdf5): recovery complete
3222
3223<6>[ 58.160907] EXT4-fs (sdf5): mounted filesystem with ordered data mode. Opts:
3224
3225<7>[ 58.160931] SELinux: initialized (dev sdf5, type ext4), uses xattr
3226
3227<6>[ 58.160951] SELinux: Context u:object_r:persist_file:s0 is not valid (left unmapped).
3228
3229<4>[ 58.310848] FAT-fs (mmcblk0p1): Volume was not properly unmounted. Some data may be corrupt. Please run fsck.
3230
3231<7>[ 58.310961] SELinux: initialized (dev mmcblk0p1, type vfat), uses genfs_contexts
3232
3233<7>[ 58.851967] SELinux: initialized (dev dm-0, type f2fs), uses xattr
3234
3235<6>[ 58.896818] EXT4-fs (sde13): mounted filesystem with ordered data mode. Opts:
3236
3237<7>[ 58.896851] SELinux: initialized (dev sde13, type ext4), uses xattr
3238
3239<4>[ 62.992526] get_prop_batt_status: 21 callbacks suppressed
3240
3241<6>[ 62.992566] SMBCHG: get_prop_batt_status: CHGR_STS = 0x05
3242
3243<6>[ 63.201443] SMBCHG: get_prop_batt_status: CHGR_STS = 0x05
3244
3245<6>[ 63.204603] SMBCHG: update_heartbeat: ***temp=30,vol=4261,cap=85,status=1,chg_state=3,current=-578152,present=1,usb_present=1
3246
3247<6>[ 63.204646] SMBCHG: update_heartbeat: ***present=1,usb_present=1,USBIN_V=4891,usb_current=32292,charge_type_oem=-1
3248
3249<4>[ 63.204672] [zte]psy change, func update_heartbeat,line 8340,psy name: battery
3250
3251<6>[ 63.205432] SMBCHG: get_prop_batt_status: CHGR_STS = 0x05
3252
3253<6>[ 63.206080] SMBCHG: smbchg_calc_max_flash_current: avail_iflash=3423200, ocv=4213690, ibat=-634800, rbatt=172387
3254
3255<6>[ 63.207813] SMBCHG: smbchg_shipmode_get: get shipmode_test is 1
3256
3257<6>[ 63.213157] SMBCHG: get_prop_batt_status: CHGR_STS = 0x05
3258
3259<4>[ 93.243655] [zte]psy change, func fg_soc_irq_handler,line 4741,psy name: bms
3260
3261<6>[ 93.278626] SMBCHG: smbchg_cc_esr_wa_check: ESR count is not zero, skipping
3262
3263<6>[ 93.278699] SMBCHG: smbchg_external_power_changed: usb type = SDP current_limit = 900
3264
3265<6>[ 93.278730] SMBCHG: smbchg_vfloat_adjust_check: Starting vfloat adjustments
3266
3267<4>[ 93.278757] [zte]psy change, func smbchg_external_power_changed,line 3861,psy name: battery
3268
3269<6>[ 93.279066] SMBCHG: smbchg_vfloat_adjust_work: Stopping vfloat adj taper=0 parallel_ma = 0
3270
3271<6>[ 93.281469] SMBCHG: get_prop_batt_status: CHGR_STS = 0x05
3272
3273<6>[ 93.282273] SMBCHG: smbchg_calc_max_flash_current: avail_iflash=3363400, ocv=4213690, ibat=-545100, rbatt=172387
3274
3275<6>[ 93.284094] SMBCHG: smbchg_shipmode_get: get shipmode_test is 1
3276
3277<6>[ 93.288535] SMBCHG: get_prop_batt_status: CHGR_STS = 0x05
3278
3279<6>[ 93.290843] SMBCHG: get_prop_batt_status: CHGR_STS = 0x05
3280
3281<6>[ 103.208268] EXT4-fs (sdf5): mounted filesystem with ordered data mode. Opts:
3282
3283<7>[ 103.208345] SELinux: initialized (dev sdf5, type ext4), uses xattr
3284
3285<4>[ 103.360504] FAT-fs (mmcblk0p1): Volume was not properly unmounted. Some data may be corrupt. Please run fsck.
3286
3287<7>[ 103.360593] SELinux: initialized (dev mmcblk0p1, type vfat), uses genfs_contexts
3288
3289<6>[ 104.069400] SMBCHG: get_prop_batt_status: CHGR_STS = 0x05
3290
3291<4>[ 104.127904] audit_printk_skb: 147 callbacks suppressed
3292
3293<5>[ 104.127914] audit: type=1400 audit(1298731.019:181): avc: denied { read } for pid=400 comm="recovery" name="0" dev="dm-0" ino=4 scontext=u:r:recovery:s0 tcontext=u:object_r:media_rw_data_file:s0 tclass=dir permissive=1
3294
3295<5>[ 104.127933] audit: type=1400 audit(1298731.019:182): avc: denied { open } for pid=400 comm="recovery" path="/sdcard" dev="dm-0" ino=4 scontext=u:r:recovery:s0 tcontext=u:object_r:media_rw_data_file:s0 tclass=dir permissive=1
3296
3297<5>[ 104.132511] audit: type=1400 audit(1298731.029:183): avc: denied { getattr } for pid=400 comm="recovery" path="/sdcard/.profig.os" dev="dm-0" ino=165 scontext=u:r:recovery:s0 tcontext=u:object_r:media_rw_data_file:s0 tclass=file permissive=1
3298
3299<5>[ 104.769965] audit: type=1400 audit(1298731.659:184): avc: denied { remove_name } for pid=400 comm="recovery" name="file_contexts" dev="rootfs" ino=9506 scontext=u:r:recovery:s0 tcontext=u:object_r:rootfs:s0 tclass=dir permissive=1
3300
3301<5>[ 104.769984] audit: type=1400 audit(1298731.659:185): avc: denied { rename } for pid=400 comm="recovery" name="file_contexts" dev="rootfs" ino=9506 scontext=u:r:recovery:s0 tcontext=u:object_r:rootfs:s0 tclass=file permissive=1
3302
3303<5>[ 104.848493] audit: type=1400 audit(1298731.739:186): avc: denied { read } for pid=400 comm="recovery" name=".twrps" dev="dm-0" ino=24380 scontext=u:r:recovery:s0 tcontext=u:object_r:media_rw_data_file:s0 tclass=file permissive=1
3304
3305<5>[ 104.848515] audit: type=1400 audit(1298731.739:187): avc: denied { open } for pid=400 comm="recovery" path="/data/media/0/TWRP/.twrps" dev="dm-0" ino=24380 scontext=u:r:recovery:s0 tcontext=u:object_r:media_rw_data_file:s0 tclass=file permissive=1
3306
3307<4>[ 104.900357] FAT-fs (mmcblk0p1): Volume was not properly unmounted. Some data may be corrupt. Please run fsck.
3308
3309<7>[ 104.900420] SELinux: initialized (dev mmcblk0p1, type vfat), uses genfs_contexts
3310
3311<5>[ 105.236982] audit: type=1400 audit(1298732.129:188): avc: denied { sys_time } for pid=400 comm="recovery" capability=25 scontext=u:r:recovery:s0 tcontext=u:r:recovery:s0 tclass=capability permissive=1
3312
3313<6>[ 105.259307] EXT4-fs (sde13): mounted filesystem with ordered data mode. Opts:
3314
3315<7>[ 105.259366] SELinux: initialized (dev sde13, type ext4), uses xattr
3316
3317<6>[ 105.263207] SMBCHG: get_prop_batt_status: CHGR_STS = 0x05
3318
3319<5>[ 105.263527] audit: type=1400 audit(1483566424.728:189): avc: denied { create } for pid=400 comm="recovery" name="orsin" scontext=u:r:recovery:s0 tcontext=u:object_r:rootfs:s0 tclass=fifo_file permissive=1
3320
3321<5>[ 105.263647] audit: type=1400 audit(1483566424.728:190): avc: denied { read } for pid=400 comm="recovery" name="orsin" dev="rootfs" ino=336 scontext=u:r:recovery:s0 tcontext=u:object_r:rootfs:s0 tclass=fifo_file permissive=1
3322
3323<6>[ 106.048670] mtp_open
3324
3325<3>[ 111.859455] clk_enabled
3326
3327<3>[ 111.976080] clk_disable
3328
3329<6>[ 120.160114] zte_dump wakesource 6a00000.ssusb is active
3330
3331<6>[ 122.993594] SMBCHG: get_prop_batt_status: CHGR_STS = 0x05
3332
3333<6>[ 123.041330] SMBCHG: get_prop_batt_status: CHGR_STS = 0x05
3334
3335<3>[ 125.472484] clk_enabled
3336
3337<3>[ 125.595131] clk_disable
3338
3339<3>[ 132.003381] clk_enabled
3340
3341<3>[ 132.126424] clk_disable
3342
3343<4>[ 132.506638] audit_printk_skb: 21 callbacks suppressed
3344
3345<5>[ 132.506647] audit: type=1400 audit(1483566451.968:198): avc: denied { read } for pid=452 comm="recovery" name="ailsa_ii_xda_safetynet_kcal-f2fs-1.2-20170104.zip" dev="mmcblk0p1" ino=79 scontext=u:r:recovery:s0 tcontext=u:object_r:vfat:s0 tclass=file permissive=1
3346
3347<5>[ 132.506667] audit: type=1400 audit(1483566451.968:199): avc: denied { open } for pid=452 comm="recovery" path="/external_sd/ailsa_ii_xda_safetynet_kcal-f2fs-1.2-20170104.zip" dev="mmcblk0p1" ino=79 scontext=u:r:recovery:s0 tcontext=u:object_r:vfat:s0 tclass=file permissive=1
3348
3349<5>[ 132.615297] audit: type=1400 audit(1483566452.078:200): avc: denied { write } for pid=452 comm="recovery" name="/" dev="tmpfs" ino=11106 scontext=u:r:recovery:s0 tcontext=u:object_r:device:s0 tclass=dir permissive=1
3350
3351<5>[ 132.615393] audit: type=1400 audit(1483566452.078:201): avc: denied { add_name } for pid=452 comm="recovery" name="__legacy_properties__" scontext=u:r:recovery:s0 tcontext=u:object_r:device:s0 tclass=dir permissive=1
3352
3353<5>[ 132.615523] audit: type=1400 audit(1483566452.078:202): avc: denied { create } for pid=452 comm="recovery" name="__legacy_properties__" scontext=u:r:recovery:s0 tcontext=u:object_r:device:s0 tclass=file permissive=1
3354
3355<5>[ 132.615651] audit: type=1400 audit(1483566452.078:203): avc: denied { write open } for pid=452 comm="recovery" path="/dev/__legacy_properties__" dev="tmpfs" ino=3578 scontext=u:r:recovery:s0 tcontext=u:object_r:device:s0 tclass=file permissive=1
3356
3357<5>[ 132.615831] audit: type=1400 audit(1483566452.078:204): avc: denied { remove_name } for pid=452 comm="recovery" name="__legacy_properties__" dev="tmpfs" ino=3578 scontext=u:r:recovery:s0 tcontext=u:object_r:device:s0 tclass=dir permissive=1
3358
3359<5>[ 132.615904] audit: type=1400 audit(1483566452.078:205): avc: denied { unlink } for pid=452 comm="recovery" name="__legacy_properties__" dev="tmpfs" ino=3578 scontext=u:r:recovery:s0 tcontext=u:object_r:device:s0 tclass=file permissive=1
3360
3361<5>[ 132.617166] audit: type=1400 audit(1483566452.078:206): avc: denied { rename } for pid=452 comm="recovery" name="__properties__" dev="tmpfs" ino=7521 scontext=u:r:recovery:s0 tcontext=u:object_r:properties_device:s0 tclass=file permissive=1
3362
3363<5>[ 132.631355] audit: type=1400 audit(1483566452.098:207): avc: denied { getattr } for pid=453 comm="updater" path=2F6465762F5F5F6C65676163795F70726F706572746965735F5F202864656C6574656429 dev="tmpfs" ino=3578 scontext=u:r:recovery:s0 tcontext=u:object_r:device:s0 tclass=file permissive=1
3364
3365<6>[ 132.959304] EXT4-fs (sde13): mounted filesystem with ordered data mode. Opts: (null)
3366
3367<7>[ 132.959330] SELinux: initialized (dev sde13, type ext4), uses xattr
3368
3369<6>[ 138.989726] EXT4-fs (sde13): mounted filesystem with ordered data mode. Opts:
3370
3371<7>[ 138.989792] SELinux: initialized (dev sde13, type ext4), uses xattr
3372
3373<6>[ 139.342375] EXT4-fs (sdf5): mounted filesystem with ordered data mode. Opts:
3374
3375<7>[ 139.342401] SELinux: initialized (dev sdf5, type ext4), uses xattr
3376
3377<3>[ 145.930161] clk_enabled
3378
3379<3>[ 146.052899] clk_disable
3380
3381<3>[ 150.363331] clk_enabled
3382
3383<3>[ 150.485921] clk_disable
3384
3385<3>[ 155.709132] clk_enabled
3386
3387<3>[ 155.831733] clk_disable
3388
3389<3>[ 163.121027] clk_enabled
3390
3391<3>[ 163.243646] clk_disable
3392
3393<6>[ 165.746156] SMBCHG: get_prop_batt_status: CHGR_STS = 0x05
3394
3395<3>[ 177.665323] clk_enabled
3396
3397<3>[ 177.782471] clk_disable
3398
3399<3>[ 181.364853] clk_enabled
3400
3401<3>[ 181.487496] clk_disable
3402
3403<3>[ 182.558757] clk_enabled
3404
3405<3>[ 182.681058] clk_disable
3406
3407<6>[ 182.992764] SMBCHG: get_prop_batt_status: CHGR_STS = 0x05
3408
3409<6>[ 183.201248] SMBCHG: get_prop_batt_status: CHGR_STS = 0x05
3410
3411<6>[ 183.204188] SMBCHG: update_heartbeat: ***temp=31,vol=4271,cap=85,status=1,chg_state=3,current=-684505,present=1,usb_present=1
3412
3413<6>[ 183.204221] SMBCHG: update_heartbeat: ***present=1,usb_present=1,USBIN_V=4893,usb_current=32292,charge_type_oem=-1
3414
3415<4>[ 183.204245] [zte]psy change, func update_heartbeat,line 8340,psy name: battery
3416
3417<6>[ 183.204919] SMBCHG: get_prop_batt_status: CHGR_STS = 0x05
3418
3419<6>[ 183.205572] SMBCHG: smbchg_calc_max_flash_current: avail_iflash=3393300, ocv=4221471, ibat=-589950, rbatt=171411
3420
3421<6>[ 183.207141] SMBCHG: smbchg_shipmode_get: get shipmode_test is 1
3422
3423<6>[ 183.214048] SMBCHG: get_prop_batt_status: CHGR_STS = 0x05
3424
3425<3>[ 189.690265] clk_enabled
3426
3427<3>[ 189.780012] clk_disable
3428
3429<3>[ 190.983517] clk_enabled
3430
3431<3>[ 191.106204] clk_disable
3432
3433<3>[ 192.164653] clk_enabled
3434
3435<3>[ 192.287296] clk_disable
3436
3437<6>[ 240.480155] zte_dump wakesource 6a00000.ssusb is active
3438
3439<6>[ 242.992885] SMBCHG: get_prop_batt_status: CHGR_STS = 0x05
3440
3441<6>[ 243.041265] SMBCHG: get_prop_batt_status: CHGR_STS = 0x05
3442
3443<6>[ 253.433055] DBG fb_blank, lcd_status=0, blank=4, Start
3444
3445<4>[ 253.637108] LCD 3v_power GPIO(vsp):40 , Enable:0
3446
3447<4>[ 253.650501] LCD 3v_power GPIO(vsp):40 , Enable:0
3448
3449<6>[ 253.673284] ZTE_PM turn LCD OFF
3450
3451<4>[ 253.673821] synaptics_rmi4_suspend: start!
3452
3453<4>[ 253.673829] synaptics_rmi4_suspend---wakeup gesture diabled!
3454
3455<4>[ 253.673846] synaptics_rmi4_irq_enable_zte:disable_irq---rmi4_data->irq_enabled=0
3456
3457<4>[ 253.700264] synaptics_rmi4_enable_reg : disable regulator of pwr_reg successfully!
3458
3459<4>[ 253.700305] synaptics_rmi4_enable_reg : disable regulator of bus_reg successfully!---retval==0
3460
3461<4>[ 253.700312] synaptics_rmi4_suspend: disable regulator succeed!
3462
3463<4>[ 253.700337] synaptics_rmi4_suspend: end!
3464
3465<4>[ 253.700404] synaptics_rmi4_fb_notifier_cb: ret=97, HZ=100
3466
3467<6>[ 253.700414] DBG fb_blank, lcd_status=4, blank=4, End
3468
3469<4>[ 293.375983] [zte]psy change, func fg_soc_irq_handler,line 4741,psy name: bms
3470
3471<6>[ 293.403442] SMBCHG: smbchg_cc_esr_wa_check: ESR count is not zero, skipping
3472
3473<6>[ 293.403503] SMBCHG: smbchg_external_power_changed: usb type = SDP current_limit = 900
3474
3475<6>[ 293.403526] SMBCHG: smbchg_vfloat_adjust_check: Starting vfloat adjustments
3476
3477<4>[ 293.403545] [zte]psy change, func smbchg_external_power_changed,line 3861,psy name: battery
3478
3479<6>[ 293.403766] SMBCHG: smbchg_vfloat_adjust_work: Stopping vfloat adj taper=0 parallel_ma = 0
3480
3481<6>[ 293.407102] SMBCHG: get_prop_batt_status: CHGR_STS = 0x05
3482
3483<6>[ 293.408472] SMBCHG: get_prop_batt_status: CHGR_STS = 0x05
3484
3485<6>[ 293.409193] SMBCHG: smbchg_calc_max_flash_current: avail_iflash=3512900, ocv=4225439, ibat=-769350, rbatt=170922
3486
3487<6>[ 293.410867] SMBCHG: smbchg_shipmode_get: get shipmode_test is 1
3488
3489<6>[ 293.412908] SMBCHG: get_prop_batt_status: CHGR_STS = 0x05
3490
3491<6>[ 302.992837] SMBCHG: get_prop_batt_status: CHGR_STS = 0x05
3492
3493<6>[ 303.201509] SMBCHG: get_prop_batt_status: CHGR_STS = 0x05
3494
3495<6>[ 303.204533] SMBCHG: update_heartbeat: ***temp=31,vol=4290,cap=86,status=1,chg_state=3,current=-762477,present=1,usb_present=1
3496
3497<6>[ 303.204568] SMBCHG: update_heartbeat: ***present=1,usb_present=1,USBIN_V=4891,usb_current=32639,charge_type_oem=-1
3498
3499<4>[ 303.204593] [zte]psy change, func update_heartbeat,line 8340,psy name: battery
3500
3501<6>[ 303.205272] SMBCHG: get_prop_batt_status: CHGR_STS = 0x05
3502
3503<6>[ 303.205924] SMBCHG: smbchg_calc_max_flash_current: avail_iflash=3512900, ocv=4225439, ibat=-769350, rbatt=170922
3504
3505<6>[ 303.207500] SMBCHG: smbchg_shipmode_get: get shipmode_test is 1
3506
3507<6>[ 303.214691] SMBCHG: get_prop_batt_status: CHGR_STS = 0x05
3508
3509<6>[ 360.800132] zte_dump wakesource 6a00000.ssusb is active
3510
3511<6>[ 362.992972] SMBCHG: get_prop_batt_status: CHGR_STS = 0x05
3512
3513<6>[ 363.041231] SMBCHG: get_prop_batt_status: CHGR_STS = 0x05
3514
3515<6>[ 363.044266] SMBCHG: update_heartbeat: ***temp=30,vol=4296,cap=86,status=1,chg_state=3,current=-762935,present=1,usb_present=1
3516
3517<6>[ 363.044300] SMBCHG: update_heartbeat: ***present=1,usb_present=1,USBIN_V=4893,usb_current=32639,charge_type_oem=-1
3518
3519<4>[ 363.044327] [zte]psy change, func update_heartbeat,line 8340,psy name: battery
3520
3521<6>[ 363.045030] SMBCHG: get_prop_batt_status: CHGR_STS = 0x05
3522
3523<6>[ 363.045694] SMBCHG: smbchg_calc_max_flash_current: avail_iflash=3512900, ocv=4229406, ibat=-769350, rbatt=169824
3524
3525<6>[ 363.047288] SMBCHG: smbchg_shipmode_get: get shipmode_test is 1
3526
3527<6>[ 363.054466] SMBCHG: get_prop_batt_status: CHGR_STS = 0x05
3528
3529<6>[ 422.992919] SMBCHG: get_prop_batt_status: CHGR_STS = 0x05
3530
3531<6>[ 423.201301] SMBCHG: get_prop_batt_status: CHGR_STS = 0x05
3532
3533<4>[ 429.167501] [zte]psy change, func fg_soc_irq_handler,line 4741,psy name: bms
3534
3535<6>[ 429.193216] SMBCHG: smbchg_cc_esr_wa_check: ESR count is not zero, skipping
3536
3537<6>[ 429.193281] SMBCHG: smbchg_external_power_changed: usb type = SDP current_limit = 900
3538
3539<6>[ 429.193304] SMBCHG: smbchg_vfloat_adjust_check: Starting vfloat adjustments
3540
3541<4>[ 429.193324] [zte]psy change, func smbchg_external_power_changed,line 3861,psy name: battery
3542
3543<6>[ 429.193547] SMBCHG: smbchg_vfloat_adjust_work: Stopping vfloat adj taper=0 parallel_ma = 0
3544
3545<6>[ 429.196875] SMBCHG: get_prop_batt_status: CHGR_STS = 0x05
3546
3547<6>[ 429.198242] SMBCHG: get_prop_batt_status: CHGR_STS = 0x05
3548
3549<6>[ 429.199012] SMBCHG: smbchg_calc_max_flash_current: avail_iflash=3512900, ocv=4233221, ibat=-769350, rbatt=171228
3550
3551<6>[ 429.200676] SMBCHG: smbchg_shipmode_get: get shipmode_test is 1
3552
3553<6>[ 429.202714] SMBCHG: get_prop_batt_status: CHGR_STS = 0x05
3554
3555<6>[ 481.120125] zte_dump wakesource 6a00000.ssusb is active
3556
3557<3>[ 482.453504] F2FS-fs (dm-0): Unrecognized mount option "inline_dentry" or missing value
3558
3559<6>[ 482.992902] SMBCHG: get_prop_batt_status: CHGR_STS = 0x05
3560
3561<6>[ 483.041265] SMBCHG: get_prop_batt_status: CHGR_STS = 0x05
3562
3563<6>[ 483.044298] SMBCHG: update_heartbeat: ***temp=30,vol=4308,cap=87,status=1,chg_state=3,current=-761561,present=1,usb_present=1
3564
3565<6>[ 483.044333] SMBCHG: update_heartbeat: ***present=1,usb_present=1,USBIN_V=4893,usb_current=32292,charge_type_oem=-1
3566
3567<4>[ 483.044358] [zte]psy change, func update_heartbeat,line 8340,psy name: battery
3568
3569<6>[ 483.045052] SMBCHG: get_prop_batt_status: CHGR_STS = 0x05
3570
3571<6>[ 483.045713] SMBCHG: smbchg_calc_max_flash_current: avail_iflash=3542800, ocv=4237188, ibat=-814200, rbatt=170312
3572
3573<6>[ 483.047301] SMBCHG: smbchg_shipmode_get: get shipmode_test is 1
3574
3575<6>[ 483.054531] SMBCHG: get_prop_batt_status: CHGR_STS = 0x05
3576
3577<6>[ 543.021220] SMBCHG: get_prop_batt_status: CHGR_STS = 0x05
3578
3579<6>[ 543.201248] SMBCHG: get_prop_batt_status: CHGR_STS = 0x05
3580
3581<4>[ 563.452330] [zte]psy change, func fg_soc_irq_handler,line 4741,psy name: bms
3582
3583<6>[ 563.453280] SMBCHG: smbchg_external_power_changed: usb type = SDP current_limit = 900
3584
3585<6>[ 563.453315] SMBCHG: smbchg_vfloat_adjust_check: Starting vfloat adjustments
3586
3587<4>[ 563.453342] [zte]psy change, func smbchg_external_power_changed,line 3861,psy name: battery
3588
3589<6>[ 563.455207] SMBCHG: smbchg_vfloat_adjust_work: Stopping vfloat adj taper=0 parallel_ma = 0
3590
3591<6>[ 563.466213] SMBCHG: get_prop_batt_status: CHGR_STS = 0x05
3592
3593<6>[ 563.468354] SMBCHG: smbchg_calc_max_flash_current: avail_iflash=3483000, ocv=4241003, ibat=-724500, rbatt=169946
3594
3595<6>[ 563.468836] SMBCHG: get_prop_batt_status: CHGR_STS = 0x05
3596
3597<6>[ 563.470361] SMBCHG: smbchg_shipmode_get: get shipmode_test is 1
3598
3599<6>[ 563.477369] SMBCHG: get_prop_batt_status: CHGR_STS = 0x05
3600
3601<3>[ 597.757268] F2FS-fs (dm-0): Unrecognized mount option "inline_dentry" or missing value
3602
3603<6>[ 601.440162] zte_dump wakesource 6a00000.ssusb is active
3604
3605<6>[ 602.992847] SMBCHG: get_prop_batt_status: CHGR_STS = 0x05
3606
3607<6>[ 603.041257] SMBCHG: get_prop_batt_status: CHGR_STS = 0x05
3608
3609<6>[ 662.992837] SMBCHG: get_prop_batt_status: CHGR_STS = 0x05
3610
3611<6>[ 663.201285] SMBCHG: get_prop_batt_status: CHGR_STS = 0x05
3612
3613<6>[ 663.204321] SMBCHG: update_heartbeat: ***temp=30,vol=4326,cap=88,status=1,chg_state=3,current=-759578,present=1,usb_present=1
3614
3615<6>[ 663.204356] SMBCHG: update_heartbeat: ***present=1,usb_present=1,USBIN_V=4893,usb_current=32292,charge_type_oem=-1
3616
3617<4>[ 663.204382] [zte]psy change, func update_heartbeat,line 8340,psy name: battery
3618
3619<6>[ 663.205084] SMBCHG: get_prop_batt_status: CHGR_STS = 0x05
3620
3621<6>[ 663.205757] SMBCHG: smbchg_calc_max_flash_current: avail_iflash=3512900, ocv=4248937, ibat=-769350, rbatt=169091
3622
3623<6>[ 663.207343] SMBCHG: smbchg_shipmode_get: get shipmode_test is 1
3624
3625<6>[ 663.214448] SMBCHG: get_prop_batt_status: CHGR_STS = 0x05
3626
3627<4>[ 694.790399] [zte]psy change, func fg_soc_irq_handler,line 4741,psy name: bms
3628
3629<6>[ 694.818755] SMBCHG: smbchg_cc_esr_wa_check: ESR count is not zero, skipping
3630
3631<6>[ 694.818830] SMBCHG: smbchg_external_power_changed: usb type = SDP current_limit = 900
3632
3633<6>[ 694.818862] SMBCHG: smbchg_vfloat_adjust_check: Starting vfloat adjustments
3634
3635<4>[ 694.818887] [zte]psy change, func smbchg_external_power_changed,line 3861,psy name: battery
3636
3637<6>[ 694.819147] SMBCHG: smbchg_vfloat_adjust_work: Stopping vfloat adj taper=0 parallel_ma = 0
3638
3639<6>[ 694.822607] SMBCHG: get_prop_batt_status: CHGR_STS = 0x05
3640
3641<6>[ 694.824200] SMBCHG: get_prop_batt_status: CHGR_STS = 0x05
3642
3643<6>[ 694.824933] SMBCHG: smbchg_calc_max_flash_current: avail_iflash=3512900, ocv=4248937, ibat=-769350, rbatt=169091
3644
3645<6>[ 694.826592] SMBCHG: smbchg_shipmode_get: get shipmode_test is 1
3646
3647<6>[ 694.828711] SMBCHG: get_prop_batt_status: CHGR_STS = 0x05
3648
3649<6>[ 721.760082] zte_dump wakesource 6a00000.ssusb is active
3650
3651<6>[ 722.992888] SMBCHG: get_prop_batt_status: CHGR_STS = 0x05
3652
3653<6>[ 723.041627] SMBCHG: get_prop_batt_status: CHGR_STS = 0x05
3654
3655<6>[ 782.992873] SMBCHG: get_prop_batt_status: CHGR_STS = 0x05
3656
3657<6>[ 783.201228] SMBCHG: get_prop_batt_status: CHGR_STS = 0x05
3658
3659<6>[ 783.204269] SMBCHG: update_heartbeat: ***temp=30,vol=4338,cap=89,status=1,chg_state=3,current=-758052,present=1,usb_present=1
3660
3661<6>[ 783.204304] SMBCHG: update_heartbeat: ***present=1,usb_present=1,USBIN_V=4893,usb_current=32292,charge_type_oem=-1
3662
3663<4>[ 783.204330] [zte]psy change, func update_heartbeat,line 8340,psy name: battery
3664
3665<6>[ 783.205035] SMBCHG: get_prop_batt_status: CHGR_STS = 0x05
3666
3667<6>[ 783.205710] SMBCHG: smbchg_calc_max_flash_current: avail_iflash=3512900, ocv=4256719, ibat=-769350, rbatt=170129
3668
3669<6>[ 783.207290] SMBCHG: smbchg_shipmode_get: get shipmode_test is 1
3670
3671<6>[ 783.214405] SMBCHG: get_prop_batt_status: CHGR_STS = 0x05
3672
3673<4>[ 820.271167] [zte]psy change, func fg_soc_irq_handler,line 4741,psy name: bms
3674
3675<6>[ 820.297782] SMBCHG: smbchg_cc_esr_wa_check: Lowering charge current for ESR pulse
3676
3677<6>[ 820.297871] SMBCHG: smbchg_set_fastchg_current_raw: fastcharge current requested 557, set to 500
3678
3679<6>[ 820.800220] SMBCHG: smbchg_parallel_usb_en_work: AICL at 1700
3680
3681<6>[ 820.800290] SMBCHG: smbchg_is_parallel_usb_ok: SDP adapter, skipping
3682
3683<6>[ 821.800170] SMBCHG: smbchg_cc_esr_wa_check: Raising charge current for ESR pulse
3684
3685<6>[ 821.800278] SMBCHG: smbchg_set_fastchg_current_raw: fastcharge current requested 3000, set to 3000
3686
3687<6>[ 821.801363] SMBCHG: smbchg_external_power_changed: usb type = SDP current_limit = 900
3688
3689<6>[ 821.801394] SMBCHG: smbchg_vfloat_adjust_check: Starting vfloat adjustments
3690
3691<4>[ 821.801422] [zte]psy change, func smbchg_external_power_changed,line 3861,psy name: battery
3692
3693<6>[ 821.801705] SMBCHG: smbchg_vfloat_adjust_work: Stopping vfloat adj taper=0 parallel_ma = 0
3694
3695<6>[ 821.802894] SMBCHG: get_prop_batt_status: CHGR_STS = 0x05
3696
3697<6>[ 821.803694] SMBCHG: smbchg_calc_max_flash_current: avail_iflash=3512900, ocv=4260534, ibat=-769350, rbatt=170129
3698
3699<6>[ 821.805950] SMBCHG: smbchg_shipmode_get: get shipmode_test is 1
3700
3701<6>[ 821.807705] SMBCHG: get_prop_batt_status: CHGR_STS = 0x05
3702
3703<6>[ 821.810816] SMBCHG: get_prop_batt_status: CHGR_STS = 0x05
3704
3705<6>[ 822.310229] SMBCHG: smbchg_parallel_usb_en_work: AICL at 1700
3706
3707<6>[ 822.310301] SMBCHG: smbchg_is_parallel_usb_ok: SDP adapter, skipping
3708
3709<6>[ 842.080125] zte_dump wakesource 6a00000.ssusb is active
3710
3711<6>[ 843.005330] SMBCHG: get_prop_batt_status: CHGR_STS = 0x05
3712
3713<6>[ 843.041240] SMBCHG: get_prop_batt_status: CHGR_STS = 0x05
3714
3715<6>[ 843.044274] SMBCHG: update_heartbeat: ***temp=29,vol=4343,cap=89,status=1,chg_state=3,current=-757441,present=1,usb_present=1
3716
3717<6>[ 843.044308] SMBCHG: update_heartbeat: ***present=1,usb_present=1,USBIN_V=4893,usb_current=32292,charge_type_oem=-1
3718
3719<4>[ 843.044333] [zte]psy change, func update_heartbeat,line 8340,psy name: battery
3720
3721<6>[ 843.045039] SMBCHG: get_prop_batt_status: CHGR_STS = 0x05
3722
3723<6>[ 843.045703] SMBCHG: smbchg_calc_max_flash_current: avail_iflash=3512900, ocv=4260534, ibat=-769350, rbatt=171411
3724
3725<6>[ 843.047281] SMBCHG: smbchg_shipmode_get: get shipmode_test is 1
3726
3727<6>[ 843.054774] SMBCHG: get_prop_batt_status: CHGR_STS = 0x05