· 10 years ago · Jun 16, 2016, 01:48 PM
1Buildfile: /home/pooky/env/builds/global.xml
2 [typedef] Could not load definitions from resource org/tigris/subversion/svnant/svnantlib.xml. It could not be found.
3 [echo] Running in ZIELONA GORA on builder37.zg.adbgroup.pl (ip 192.168.5.157)
4 [echo] Operating system is Linux Ubuntu 14.04 x86_64 with 8 CPUs and 32061MB of RAM
5 [echo] Build requested on 2016-06-16 12:47:12 UTC
6 [echo] Loading build scenario from GVS/12.04/build.xml
7 [echo] / GIT / Gerrit / GVS / / Verify patchset / wicem-biot
8 [echo] POOKY_enableParser name="Ant job parser"
9 [echo] Building slug 'quality_ggg_gvs_verify_patchset_12_04_wicem_biot' with run id #3937465
10
11fetch:
12
13post_fetch:
14
15configure:
16 [echo] POOKY_linkJobResult name="Gerrit change" url="http://gerrit.adbgroup.pl/104043"
17 [echo] worker_Arch=x86_64
18
19configurex:
20
21verify:
22 [echo] POOKY_git repository="wicem" branch="master" to="/home/pooky/env/build_dir/wicem" date="" revision=""
23 [echo] git clone ... ssh://gerrit.adbgroup.pl:29418/wicem.git /home/pooky/env/build_dir/wicem
24 [exec] Total 22704 (delta 8082), reused 22346 (delta 8082)
25 [exec] Fetching wicem
26 [exec] From ssh://gerrit.adbgroup.pl:29418/wicem
27 [exec] * [new branch] 20150701-status-checker-parallel -> wicem/20150701-status-checker-parallel
28 [exec] * [new branch] 20151116-admin-api -> wicem/20151116-admin-api
29 [exec] * [new branch] 20151204-appliances-abstraction -> wicem/20151204-appliances-abstraction
30 [exec] * [new branch] 20160120-catalog-abstraction -> wicem/20160120-catalog-abstraction
31 [exec] * [new branch] 20160120-merge-appliances-abstraction-into-catalog-abstraction -> wicem/20160120-merge-appliances-abstraction-into-catalog-abstraction
32 [exec] * [new branch] iot-registration -> wicem/iot-registration
33 [exec] * [new branch] master -> wicem/master
34 [exec] * [new branch] stable-1.0 -> wicem/stable-1.0
35 [echo] POOKY_internal_git: repository=wicem, branch=master, to=/home/pooky/env/build_dir/wicem, date='2016-06-16 12:47:12', (rev: ef8de915f9c3708c2e3e69fe81391ee6c01938e5)
36 [echo] in /home/pooky/env/build_dir/wicem: git checkout ... ef8de915f9c3708c2e3e69fe81391ee6c01938e5
37 [echo] POOKY TIMER[GIT]: 1683
38 [echo]
39 [exec] Total 40 (delta 11), reused 37 (delta 11)
40 [echo] Checking if change is already merged to wicem/master..
41 [echo] change is not merged yet.. applying cherry-pick..
42 [exec] [detached HEAD da32dca] [F] Added subtenant code and device code
43 [exec] Author: Stefano Altavilla <s.altavilla@ext.adbglobal.com>
44 [exec] 16 files changed, 2020 insertions(+), 745 deletions(-)
45 [exec] rename iot-db-scripts/src/main/resources/db/migration/{V020__inventory_inventory-schema.sql => V0002__inventory_inventory-schema.sql} (100%)
46 [exec] rename iot-db-scripts/src/main/resources/db/migration/{V023__inventory_triggers.sql => V0003__inventory_triggers.sql} (100%)
47 [exec] rename iot-db-scripts/src/main/resources/db/migration/{V025__postgres_copy-countries.sql => V0004__postgres_copy-countries.sql} (100%)
48 [exec] rename iot-db-scripts/src/main/resources/db/migration/{V030__inventory_init-data.sql => V0005__inventory_init-data.sql} (100%)
49 [exec] rename iot-db-scripts/src/main/resources/db/migration/{V209__device_type.sql => V0006__device_type.sql} (100%)
50 [exec] rename iot-db-scripts/src/main/resources/db/migration/{V210__inventory_inventorydb_tenant-subtenant.sql => V0007__inventory_inventorydb_tenant-subtenant.sql} (100%)
51 [exec] create mode 100644 iot-db-scripts/src/main/resources/db/migration/V0008__device-uuid.sql
52 [exec] create mode 100644 iot-db-scripts/src/main/resources/db/upgrades/20160525-user-device-subtenant-code.sql
53 [exec] create mode 100644 iot-db-scripts/src/main/resources/db/upgrades/20160606-device-deleted-column.sql
54 [exec] create mode 100644 iot-db-scripts/src/main/resources/db/upgrades/20160608-site-audit.sql
55 [exec] create mode 100644 iot-db-scripts/src/main/resources/db/upgrades/20160614-device-uuid.sql
56 [exec] create mode 100644 scripts/database/postgresql/020_inventory_inventory-schema.sql
57 [echo] Updating submodules..
58 [exec] Result: 1
59 [echo] #### wicem-biot ####
60 [mkdir] Created dir: /home/pooky/.m2
61 [echo] Show Maven repository usage
62 [exec] 398M /home/pooky/.persistent/filestore/biot_repository
63 [echo] Setup maven persistent repository
64 [echo] POOKY_make dir="wicem" cmd="./gvs.sh" output="" append="false"
65 [exec] Reading package lists...
66 [exec] Building dependency tree...
67 [exec] Reading state information...
68 [exec] wget is already the newest version.
69 [exec] The following packages were automatically installed and are no longer required:
70 [exec] firefox-locale-en libnss3-1d python-chardet python-colorama python-distlib
71 [exec] python-html5lib python-requests python-urllib3
72 [exec] Use 'apt-get autoremove' to remove them.
73 [exec] 0 upgraded, 0 newly installed, 0 to remove and 12 not upgraded.
74 [exec] OK
75 [exec] Ign http://ald.adbgroup.pl trusty InRelease
76 [exec] Hit http://ald.adbgroup.pl trusty-updates InRelease
77 [exec] Ign http://ald.adbgroup.pl trusty InRelease
78 [exec] Hit http://ald.adbgroup.pl trusty Release.gpg
79 [exec] Get:1 http://ald.adbgroup.pl trusty Release.gpg [490 B]
80 [exec] Hit http://ald.adbgroup.pl trusty Release
81 [exec] Hit http://ald.adbgroup.pl trusty Release
82 [exec] Hit http://ald.adbgroup.pl trusty-updates/main amd64 Packages
83 [exec] Ign http://ald.adbgroup.pl trusty Release
84 [exec] Hit http://ald.adbgroup.pl trusty-updates/restricted amd64 Packages
85 [exec] Hit http://ald.adbgroup.pl trusty-updates/universe amd64 Packages
86 [exec] Hit http://ald.adbgroup.pl trusty-updates/multiverse amd64 Packages
87 [exec] Hit http://ald.adbgroup.pl trusty-updates/main i386 Packages
88 [exec] Hit http://ald.adbgroup.pl trusty-updates/restricted i386 Packages
89 [exec] Hit http://ald.adbgroup.pl trusty-updates/universe i386 Packages
90 [exec] Hit http://ald.adbgroup.pl trusty-updates/multiverse i386 Packages
91 [exec] Hit http://ald.adbgroup.pl trusty-updates/main Translation-en
92 [exec] Hit http://ald.adbgroup.pl trusty-updates/multiverse Translation-en
93 [exec] Hit http://ald.adbgroup.pl trusty-updates/restricted Translation-en
94 [exec] Hit http://ald.adbgroup.pl trusty-updates/universe Translation-en
95 [exec] Hit http://ald.adbgroup.pl trusty/main amd64 Packages
96 [exec] Hit http://ald.adbgroup.pl trusty/restricted amd64 Packages
97 [exec] Hit http://ald.adbgroup.pl trusty/universe amd64 Packages
98 [exec] Hit http://ald.adbgroup.pl trusty/multiverse amd64 Packages
99 [exec] Hit http://ald.adbgroup.pl trusty/main i386 Packages
100 [exec] Hit http://ald.adbgroup.pl trusty/restricted i386 Packages
101 [exec] Hit http://ald.adbgroup.pl trusty/universe i386 Packages
102 [exec] Hit http://ald.adbgroup.pl trusty/multiverse i386 Packages
103 [exec] Hit http://ald.adbgroup.pl trusty/main Translation-en
104 [exec] Hit http://ald.adbgroup.pl trusty/multiverse Translation-en
105 [exec] Hit http://ald.adbgroup.pl trusty/restricted Translation-en
106 [exec] Hit http://ald.adbgroup.pl trusty/universe Translation-en
107 [exec] Ign http://ald.adbgroup.pl trusty/non-free amd64 Packages/DiffIndex
108 [exec] Ign http://ald.adbgroup.pl trusty/non-free i386 Packages/DiffIndex
109 [exec] Hit http://ald.adbgroup.pl trusty/non-free amd64 Packages
110 [exec] Hit http://ald.adbgroup.pl trusty/non-free i386 Packages
111 [exec] Ign http://ald.adbgroup.pl trusty/non-free Translation-en
112 [exec] Get:2 http://ppa.launchpad.net trusty InRelease [15.5 kB]
113 [exec] Ign http://ppa.launchpad.net trusty InRelease
114 [exec] Hit http://ppa.launchpad.net trusty InRelease
115 [exec] Ign http://ppa.launchpad.net trusty/main amd64 Packages/DiffIndex
116 [exec] Ign http://ppa.launchpad.net trusty/main i386 Packages/DiffIndex
117 [exec] Hit http://ppa.launchpad.net trusty/main Translation-en
118 [exec] Get:3 http://apt.postgresql.org trusty-pgdg InRelease [33.8 kB]
119 [exec] Hit http://ppa.launchpad.net trusty/main amd64 Packages
120 [exec] Hit http://ppa.launchpad.net trusty/main i386 Packages
121 [exec] Hit http://ppa.launchpad.net trusty/main Translation-en
122 [exec] Get:4 http://apt.postgresql.org trusty-pgdg/main amd64 Packages [59.6 kB]
123 [exec] Hit http://ppa.launchpad.net trusty/main amd64 Packages
124 [exec] Hit http://ppa.launchpad.net trusty/main i386 Packages
125 [exec] Get:5 http://apt.postgresql.org trusty-pgdg/main i386 Packages [59.3 kB]
126 [exec] Ign http://apt.postgresql.org trusty-pgdg/main Translation-en
127 [exec] Fetched 169 kB in 1s (124 kB/s)
128 [exec] W: GPG error: http://ald.adbgroup.pl trusty Release: The following signatures couldn't be verified because the public key is not available: NO_PUBKEY EBC8A71C451F6F31
129 [exec] W: GPG error: http://ppa.launchpad.net trusty InRelease: The following signatures couldn't be verified because the public key is not available: NO_PUBKEY EB9B1D8886F44E2A
130 [exec] Reading package lists...
131 [exec] Reading package lists...
132 [exec] Building dependency tree...
133 [exec] Reading state information...
134 [exec] The following packages were automatically installed and are no longer required:
135 [exec] firefox-locale-en libnss3-1d python-chardet python-colorama python-distlib
136 [exec] python-html5lib python-requests python-urllib3
137 [exec] Use 'apt-get autoremove' to remove them.
138 [exec] The following extra packages will be installed:
139 [exec] libpq-dev libpq5 pgdg-keyring postgresql postgresql-9.5
140 [exec] postgresql-client-9.5 postgresql-client-common postgresql-common
141 [exec] Suggested packages:
142 [exec] postgresql-doc-9.5 postgresql-doc locales-all
143 [exec] Recommended packages:
144 [exec] postgresql-contrib-9.5 sysstat
145 [exec] The following packages will be REMOVED:
146 [exec] postgresql-9.3
147 [exec] The following NEW packages will be installed:
148 [exec] pgdg-keyring postgresql-9.5 postgresql-client-9.5
149 [exec] The following packages will be upgraded:
150 [exec] libpq-dev libpq5 postgresql postgresql-client-common postgresql-common
151 [exec] Preconfiguring packages ...
152 [exec] 5 upgraded, 3 newly installed, 1 to remove and 13 not upgraded.
153 [exec] Need to get 0 B/5727 kB of archives.
154 [exec] After this operation, 12.3 MB of additional disk space will be used.
155 [exec] (Reading database ... 115515 files and directories currently installed.)
156 [exec] Preparing to unpack .../libpq-dev_9.5.3-1.pgdg14.04+1_amd64.deb ...
157 [exec] Unpacking libpq-dev (9.5.3-1.pgdg14.04+1) over (9.3.13-0ubuntu0.14.04) ...
158 [exec] Preparing to unpack .../libpq5_9.5.3-1.pgdg14.04+1_amd64.deb ...
159 [exec] Unpacking libpq5:amd64 (9.5.3-1.pgdg14.04+1) over (9.3.13-0ubuntu0.14.04) ...
160 [exec] Selecting previously unselected package pgdg-keyring.
161 [exec] Preparing to unpack .../pgdg-keyring_2014.1_all.deb ...
162 [exec] Unpacking pgdg-keyring (2014.1) ...
163 [exec] Preparing to unpack .../postgresql-client-common_174.pgdg14.04+1_all.deb ...
164 [exec] Unpacking postgresql-client-common (174.pgdg14.04+1) over (154ubuntu1) ...
165 [exec] Selecting previously unselected package postgresql-client-9.5.
166 [exec] Preparing to unpack .../postgresql-client-9.5_9.5.3-1.pgdg14.04+1_amd64.deb ...
167 [exec] Unpacking postgresql-client-9.5 (9.5.3-1.pgdg14.04+1) ...
168 [exec] Preparing to unpack .../postgresql-common_174.pgdg14.04+1_all.deb ...
169 [exec] Leaving 'diversion of /usr/bin/pg_config to /usr/bin/pg_config.libpq-dev by postgresql-common'
170 [exec] Unpacking postgresql-common (174.pgdg14.04+1) over (154ubuntu1) ...
171 [exec] Selecting previously unselected package postgresql-9.5.
172 [exec] Preparing to unpack .../postgresql-9.5_9.5.3-1.pgdg14.04+1_amd64.deb ...
173 [exec] Unpacking postgresql-9.5 (9.5.3-1.pgdg14.04+1) ...
174 [exec] Preparing to unpack .../postgresql_9.5+174.pgdg14.04+1_all.deb ...
175 [exec] Unpacking postgresql (9.5+174.pgdg14.04+1) over (9.3+154ubuntu1) ...
176 [exec] Processing triggers for ureadahead (0.100.0-16) ...
177 [exec] (Reading database ... 116039 files and directories currently installed.)
178 [exec] Removing postgresql-9.3 (9.3.13-0ubuntu0.14.04) ...
179 [exec] * Stopping PostgreSQL 9.3 database server
180 [exec] ...done.
181 [exec] Setting up libpq5:amd64 (9.5.3-1.pgdg14.04+1) ...
182 [exec] Setting up libpq-dev (9.5.3-1.pgdg14.04+1) ...
183 [exec] Setting up pgdg-keyring (2014.1) ...
184 [exec] Removing apt.postgresql.org key from trusted.gpg: OK
185 [exec] Importing apt.postgresql.org key: OK
186 [exec] Setting up postgresql-client-common (174.pgdg14.04+1) ...
187 [exec] Setting up postgresql-client-9.5 (9.5.3-1.pgdg14.04+1) ...
188 [exec] update-alternatives: using /usr/share/postgresql/9.5/man/man1/psql.1.gz to provide /usr/share/man/man1/psql.1.gz (psql.1.gz) in auto mode
189 [exec] Setting up postgresql-common (174.pgdg14.04+1) ...
190 [exec] Installing new version of config file /etc/init.d/postgresql ...
191 [exec] Processing triggers for ureadahead (0.100.0-16) ...
192 [exec] Setting up postgresql-9.5 (9.5.3-1.pgdg14.04+1) ...
193 [exec] Creating new cluster 9.5/main ...
194 [exec] config /etc/postgresql/9.5/main
195 [exec] data /var/lib/postgresql/9.5/main
196 [exec] locale C
197 [exec] socket /var/run/postgresql
198 [exec] port 5433
199 [exec] update-alternatives: using /usr/share/postgresql/9.5/man/man1/postmaster.1.gz to provide /usr/share/man/man1/postmaster.1.gz (postmaster.1.gz) in auto mode
200 [exec] * Starting PostgreSQL 9.5 database server
201 [exec] ...done.
202 [exec] Setting up postgresql (9.5+174.pgdg14.04+1) ...
203 [exec] Processing triggers for libc-bin (2.19-0ubuntu6.9) ...
204 [exec] Reading package lists...
205 [exec] Building dependency tree...
206 [exec] Reading state information...
207 [exec] postgresql-9.5 is already the newest version.
208 [exec] postgresql-9.5 set to manually installed.
209 [exec] The following packages were automatically installed and are no longer required:
210 [exec] firefox-locale-en libnss3-1d python-chardet python-colorama python-distlib
211 [exec] python-html5lib python-requests python-urllib3
212 [exec] Use 'apt-get autoremove' to remove them.
213 [exec] 0 upgraded, 0 newly installed, 0 to remove and 13 not upgraded.
214 [exec] * Restarting PostgreSQL 9.5 database server
215 [exec] ...done.
216 [exec] CREATE ROLE
217 [exec] CREATE DATABASE
218 [exec] GRANT
219 [exec] CREATE ROLE
220 [exec] CREATE DATABASE
221 [exec] GRANT
222 [exec] json
223 [exec] ---------
224 [exec] [1,2,3]
225 [exec] (1 row)
226 [exec]
227 [exec] psql (PostgreSQL) 9.5.3
228 [exec] ALTER ROLE
229 [exec] CREATE ROLE
230 [exec] CREATE ROLE
231 [exec] --2016-06-16 12:47:52-- https://repo1.maven.org/maven2/org/flywaydb/flyway-commandline/4.0.1/flyway-commandline-4.0.1.zip
232 [exec] CREATE DATABASE
233 [exec] Resolving repo1.maven.org (repo1.maven.org)... 185.31.17.209
234 [exec] Connecting to repo1.maven.org (repo1.maven.org)|185.31.17.209|:443... connected.
235 [exec] HTTP request sent, awaiting response... 200 OK
236 [exec] Length: 11883353 (11M) [application/zip]
237 [exec] Saving to: 'flyway-commandline-4.0.1.zip'
238 [exec]
239 [exec] 0K .......... .......... .......... .......... .......... 0% 822K 14s
240 [exec] 50K .......... .......... .......... .......... .......... 0% 1.69M 10s
241 [exec] 100K .......... .......... .......... .......... .......... 1% 11.4M 7s
242 [exec] 150K .......... .......... .......... .......... .......... 1% 1.97M 7s
243 [exec] 200K .......... .......... .......... .......... .......... 2% 11.5M 6s
244 [exec] 250K .......... .......... .......... .......... .......... 2% 11.5M 5s
245 [exec] 300K .......... .......... .......... .......... .......... 3% 11.5M 4s
246 [exec] 350K .......... .......... .......... .......... .......... 3% 2.91M 4s
247 [exec] 400K .......... .......... .......... .......... .......... 3% 8.54M 4s
248 [exec] 450K .......... .......... .......... .......... .......... 4% 12.3M 4s
249 [exec] 500K .......... .......... .......... .......... .......... 4% 10.9M 3s
250 [exec] 550K .......... .......... .......... .......... .......... 5% 1.42M 4s
251 [exec] 600K .......... .......... .......... .......... .......... 5% 24.5M 3s
252 [exec] 650K .......... .......... .......... .......... .......... 6% 7.78M 3s
253 [exec] 700K .......... .......... .......... .......... .......... 6% 62.1M 3s
254 [exec] 750K .......... .......... .......... .......... .......... 6% 792M 3s
255 [exec] 800K .......... .......... .......... .......... .......... 7% 626M 3s
256 [exec] 850K .......... .......... .......... .......... .......... 7% 732M 2s
257 [exec] 900K .......... .......... .......... .......... .......... 8% 793M 2s
258 [exec] 950K .......... .......... .......... .......... .......... 8% 9.73M 2s
259 [exec] 1000K .......... .......... .......... .......... .......... 9% 9.42M 2s
260 [exec] 1050K .......... .......... .......... .......... .......... 9% 11.5M 2s
261 [exec] 1100K .......... .......... .......... .......... .......... 9% 11.5M 2s
262 [exec] 1150K .......... .......... .......... .......... .......... 10% 11.5M 2s
263 [exec] 1200K .......... .......... .......... .......... .......... 10% 4.15M 2s
264 [exec] 1250K .......... .......... .......... .......... .......... 11% 10.2M 2s
265 [exec] 1300K .......... .......... .......... .......... .......... 11% 9.79M 2s
266 [exec] 1350K .......... .......... .......... .......... .......... 12% 11.5M 2s
267 [exec] 1400K .......... .......... .......... .......... .......... 12% 11.5M 2s
268 [exec] 1450K .......... .......... .......... .......... .......... 12% 5.39M 2s
269 [exec] 1500K .......... .......... .......... .......... .......... 13% 8.99M 2s
270 [exec] 1550K .......... .......... .......... .......... .......... 13% 9.63M 2s
271 [exec] 1600K .......... .......... .......... .......... .......... 14% 8.54M 2s
272 [exec] 1650K .......... .......... .......... .......... .......... 14% 7.17M 2s
273 [exec] 1700K .......... .......... .......... .......... .......... 15% 8.19M 2s
274 [exec] 1750K .......... .......... .......... .......... .......... 15% 8.41M 2s
275 [exec] 1800K .......... .......... .......... .......... .......... 15% 9.96M 2s
276 [exec] 1850K .......... .......... .......... .......... .......... 16% 11.5M 2s
277 [exec] 1900K .......... .......... .......... .......... .......... 16% 7.43M 2s
278 [exec] 1950K .......... .......... .......... .......... .......... 17% 8.08M 2s
279 [exec] 2000K .......... .......... .......... .......... .......... 17% 5.11M 2s
280 [exec] 2050K .......... .......... .......... .......... .......... 18% 11.5M 2s
281 [exec] 2100K .......... .......... .......... .......... .......... 18% 11.5M 2s
282 [exec] 2150K .......... .......... .......... .......... .......... 18% 9.19M 1s
283 [exec] 2200K .......... .......... .......... .......... .......... 19% 8.83M 1s
284 [exec] 2250K .......... .......... .......... .......... .......... 19% 5.73M 1s
285 [exec] 2300K .......... .......... .......... .......... .......... 20% 11.5M 1s
286 [exec] 2350K .......... .......... .......... .......... .......... 20% 6.92M 1s
287 [exec] 2400K .......... .......... .......... .......... .......... 21% 8.54M 1s
288 [exec] 2450K .......... .......... .......... .......... .......... 21% 11.5M 1s
289 [exec] 2500K .......... .......... .......... .......... .......... 21% 6.53M 1s
290 [exec] 2550K .......... .......... .......... .......... .......... 22% 10.9M 1s
291 [exec] 2600K .......... .......... .......... .......... .......... 22% 8.69M 1s
292 [exec] 2650K .......... .......... .......... .......... .......... 23% 8.50M 1s
293 [exec] 2700K .......... .......... .......... .......... .......... 23% 10.9M 1s
294 [exec] 2750K .......... .......... .......... .......... .......... 24% 10.9M 1s
295 [exec] 2800K .......... .......... .......... .......... .......... 24% 5.83M 1s
296 [exec] 2850K .......... .......... .......... .......... .......... 24% 9.11M 1s
297 [exec] 2900K .......... .......... .......... .......... .......... 25% 8.12M 1s
298 [exec] 2950K .......... .......... .......... .......... .......... 25% 10.3M 1s
299 [exec] 3000K .......... .......... .......... .......... .......... 26% 11.5M 1s
300 [exec] 3050K .......... .......... .......... .......... .......... 26% 7.04M 1s
301 [exec] 3100K .......... .......... .......... .......... .......... 27% 11.5M 1s
302 [exec] 3150K .......... .......... .......... .......... .......... 27% 6.87M 1s
303 [exec] 3200K .......... .......... .......... .......... .......... 28% 8.18M 1s
304 [exec] 3250K .......... .......... .......... .......... .......... 28% 10.9M 1s
305 [exec] 3300K .......... .......... .......... .......... .......... 28% 7.69M 1s
306 [exec] 3350K .......... .......... .......... .......... .......... 29% 10.2M 1s
307 [exec] 3400K .......... .......... .......... .......... .......... 29% 9.01M 1s
308 [exec] 3450K .......... .......... .......... .......... .......... 30% 8.40M 1s
309 [exec] 3500K .......... .......... .......... .......... .......... 30% 7.41M 1s
310 [exec] 3550K .......... .......... .......... .......... .......... 31% 11.5M 1s
311 [exec] 3600K .......... .......... .......... .......... .......... 31% 7.60M 1s
312 [exec] 3650K .......... .......... .......... .......... .......... 31% 11.5M 1s
313 [exec] 3700K .......... .......... .......... .......... .......... 32% 6.98M 1s
314 [exec] 3750K .......... .......... .......... .......... .......... 32% 7.45M 1s
315 [exec] 3800K .......... .......... .......... .......... .......... 33% 11.5M 1s
316 [exec] 3850K .......... .......... .......... .......... .......... 33% 10.9M 1s
317 [exec] 3900K .......... .......... .......... .......... .......... 34% 10.9M 1s
318 [exec] 3950K .......... .......... .......... .......... .......... 34% 9.05M 1s
319 [exec] 4000K .......... .......... .......... .......... .......... 34% 5.94M 1s
320 [exec] 4050K .......... .......... .......... .......... .......... 35% 8.75M 1s
321 [exec] 4100K .......... .......... .......... .......... .......... 35% 11.5M 1s
322 [exec] 4150K .......... .......... .......... .......... .......... 36% 10.3M 1s
323 [exec] 4200K .......... .......... .......... .......... .......... 36% 9.00M 1s
324 [exec] 4250K .......... .......... .......... .......... .......... 37% 8.71M 1s
325 [exec] 4300K .......... .......... .......... .......... .......... 37% 7.18M 1s
326 [exec] 4350K .......... .......... .......... .......... .......... 37% 12.3M 1s
327 [exec] 4400K .......... .......... .......... .......... .......... 38% 8.18M 1s
328 [exec] 4450K .......... .......... .......... .......... .......... 38% 10.9M 1s
329 [exec] 4500K .......... .......... .......... .......... .......... 39% 7.50M 1s
330 [exec] 4550K .......... .......... .......... .......... .......... 39% 8.80M 1s
331 [exec] 4600K .......... .......... .......... .......... .......... 40% 8.98M 1s
332 [exec] 4650K .......... .......... .......... .......... .......... 40% 10.9M 1s
333 [exec] 4700K .......... .......... .......... .......... .......... 40% 9.75M 1s
334 [exec] 4750K .......... .......... .......... .......... .......... 41% 11.5M 1s
335 [exec] 4800K .......... .......... .......... .......... .......... 41% 6.45M 1s
336 [exec] 4850K .......... .......... .......... .......... .......... 42% 7.27M 1s
337 [exec] 4900K .......... .......... .......... .......... .......... 42% 11.5M 1s
338 [exec] 4950K .......... .......... .......... .......... .......... 43% 10.9M 1s
339 [exec] 5000K .......... .......... .......... .......... .......... 43% 10.3M 1s
340 [exec] 5050K .......... .......... .......... .......... .......... 43% 8.60M 1s
341 [exec] 5100K .......... .......... .......... .......... .......... 44% 8.78M 1s
342 [exec] 5150K .......... .......... .......... .......... .......... 44% 8.03M 1s
343 [exec] 5200K .......... .......... .......... .......... .......... 45% 8.93M 1s
344 [exec] 5250K .......... .......... .......... .......... .......... 45% 9.89M 1s
345 [exec] 5300K .......... .......... .......... .......... .......... 46% 11.5M 1s
346 [exec] 5350K .......... .......... .......... .......... .......... 46% 8.21M 1s
347 [exec] 5400K .......... .......... .......... .......... .......... 46% 7.32M 1s
348 [exec] 5450K .......... .......... .......... .......... .......... 47% 10.9M 1s
349 [exec] 5500K .......... .......... .......... .......... .......... 47% 11.5M 1s
350 [exec] 5550K .......... .......... .......... .......... .......... 48% 10.2M 1s
351 [exec] 5600K .......... .......... .......... .......... .......... 48% 6.83M 1s
352 [exec] 5650K .......... .......... .......... .......... .......... 49% 8.89M 1s
353 [exec] 5700K .......... .......... .......... .......... .......... 49% 8.13M 1s
354 [exec] 5750K .......... .......... .......... .......... .......... 49% 11.5M 1s
355 [exec] 5800K .......... .......... .......... .......... .......... 50% 10.9M 1s
356 [exec] 5850K .......... .......... .......... .......... .......... 50% 11.5M 1s
357 [exec] 5900K .......... .......... .......... .......... .......... 51% 8.38M 1s
358 [exec] 5950K .......... .......... .......... .......... .......... 51% 9.43M 1s
359 [exec] 6000K .......... .......... .......... .......... .......... 52% 6.32M 1s
360 [exec] 6050K .......... .......... .......... .......... .......... 52% 10.9M 1s
361 [exec] 6100K .......... .......... .......... .......... .......... 52% 11.5M 1s
362 [exec] 6150K .......... .......... .......... .......... .......... 53% 9.81M 1s
363 [exec] 6200K .......... .......... .......... .......... .......... 53% 8.79M 1s
364 [exec] 6250K .......... .......... .......... .......... .......... 54% 7.82M 1s
365 [exec] 6300K .......... .......... .......... .......... .......... 54% 9.81M 1s
366 [exec] 6350K .......... .......... .......... .......... .......... 55% 11.5M 1s
367 [exec] 6400K .......... .......... .......... .......... .......... 55% 8.92M 1s
368 [exec] 6450K .......... .......... .......... .......... .......... 56% 8.60M 1s
369 [exec] 6500K .......... .......... .......... .......... .......... 56% 8.48M 1s
370 [exec] 6550K .......... .......... .......... .......... .......... 56% 9.06M 1s
371 [exec] 6600K .......... .......... .......... .......... .......... 57% 10.3M 1s
372 [exec] 6650K .......... .......... .......... .......... .......... 57% 10.6M 1s
373 [exec] 6700K .......... .......... .......... .......... .......... 58% 11.6M 1s
374 [exec] 6750K .......... .......... .......... .......... .......... 58% 9.29M 1s
375 [exec] 6800K .......... .......... .......... .......... .......... 59% 5.77M 1s
376 [exec] 6850K .......... .......... .......... .......... .......... 59% 10.9M 1s
377 [exec] 6900K .......... .......... .......... .......... .......... 59% 10.8M 1s
378 [exec] 6950K .......... .......... .......... .......... .......... 60% 10.9M 1s
379 [exec] 7000K .......... .......... .......... .......... .......... 60% 12.2M 1s
380 [exec] 7050K .......... .......... .......... .......... .......... 61% 9.30M 1s
381 [exec] 7100K .......... .......... .......... .......... .......... 61% 6.94M 1s
382 [exec] 7150K .......... .......... .......... .......... .......... 62% 10.7M 1s
383 [exec] 7200K .......... .......... .......... .......... .......... 62% 8.18M 1s
384 [exec] 7250K .......... .......... .......... .......... .......... 62% 11.5M 1s
385 [exec] 7300K .......... .......... .......... .......... .......... 63% 9.90M 1s
386 [exec] 7350K .......... .......... .......... .......... .......... 63% 9.64M 1s
387 [exec] 7400K .......... .......... .......... .......... .......... 64% 7.81M 1s
388 [exec] 7450K .......... .......... .......... .......... .......... 64% 10.8M 1s
389 [exec] 7500K .......... .......... .......... .......... .......... 65% 10.3M 0s
390 [exec] 7550K .......... .......... .......... .......... .......... 65% 11.5M 0s
391 [exec] 7600K .......... .......... .......... .......... .......... 65% 7.51M 0s
392 [exec] 7650K .......... .......... .......... .......... .......... 66% 9.80M 0s
393 [exec] 7700K .......... .......... .......... .......... .......... 66% 7.27M 0s
394 [exec] 7750K .......... .......... .......... .......... .......... 67% 12.3M 0s
395 [exec] 7800K .......... .......... .......... .......... .......... 67% 10.8M 0s
396 [exec] 7850K .......... .......... .......... .......... .......... 68% 10.3M 0s
397 [exec] 7900K .......... .......... .......... .......... .......... 68% 10.9M 0s
398 [exec] 7950K .......... .......... .......... .......... .......... 68% 9.24M 0s
399 [exec] 8000K .......... .......... .......... .......... .......... 69% 6.43M 0s
400 [exec] 8050K .......... .......... .......... .......... .......... 69% 11.5M 0s
401 [exec] 8100K .......... .......... .......... .......... .......... 70% 10.3M 0s
402 [exec] 8150K .......... .......... .......... .......... .......... 70% 11.5M 0s
403 [exec] 8200K .......... .......... .......... .......... .......... 71% 10.3M 0s
404 [exec] 8250K .......... .......... .......... .......... .......... 71% 8.25M 0s
405 [exec] 8300K .......... .......... .......... .......... .......... 71% 8.67M 0s
406 [exec] 8350K .......... .......... .......... .......... .......... 72% 11.3M 0s
407 [exec] 8400K .......... .......... .......... .......... .......... 72% 8.54M 0s
408 [exec] 8450K .......... .......... .......... .......... .......... 73% 5.91M 0s
409 [exec] 8500K .......... .......... .......... .......... .......... 73% 11.5M 0s
410 [exec] 8550K .......... .......... .......... .......... .......... 74% 12.3M 0s
411 [exec] 8600K .......... .......... .......... .......... .......... 74% 8.07M 0s
412 [exec] 8650K .......... .......... .......... .......... .......... 74% 11.6M 0s
413 [exec] 8700K .......... .......... .......... .......... .......... 75% 12.2M 0s
414 [exec] 8750K .......... .......... .......... .......... .......... 75% 8.03M 0s
415 [exec] 8800K .......... .......... .......... .......... .......... 76% 8.01M 0s
416 [exec] 8850K .......... .......... .......... .......... .......... 76% 11.5M 0s
417 [exec] 8900K .......... .......... .......... .......... .......... 77% 8.26M 0s
418 [exec] 8950K .......... .......... .......... .......... .......... 77% 11.5M 0s
419 [exec] 9000K .......... .......... .......... .......... .......... 77% 11.5M 0s
420 [exec] 9050K .......... .......... .......... .......... .......... 78% 8.15M 0s
421 [exec] 9100K .......... .......... .......... .......... .......... 78% 10.9M 0s
422 [exec] 9150K .......... .......... .......... .......... .......... 79% 9.40M 0s
423 [exec] 9200K .......... .......... .......... .......... .......... 79% 7.84M 0s
424 [exec] 9250K .......... .......... .......... .......... .......... 80% 11.5M 0s
425 [exec] 9300K .......... .......... .......... .......... .......... 80% 11.5M 0s
426 [exec] 9350K .......... .......... .......... .......... .......... 81% 7.14M 0s
427 [exec] 9400K .......... .......... .......... .......... .......... 81% 11.5M 0s
428 [exec] 9450K .......... .......... .......... .......... .......... 81% 10.5M 0s
429 [exec] 9500K .......... .......... .......... .......... .......... 82% 10.1M 0s
430 [exec] 9550K .......... .......... .......... .......... .......... 82% 11.5M 0s
431 [exec] 9600K .......... .......... .......... .......... .......... 83% 8.93M 0s
432 [exec] 9650K .......... .......... .......... .......... .......... 83% 7.14M 0s
433 [exec] 9700K .......... .......... .......... .......... .......... 84% 10.9M 0s
434 [exec] 9750K .......... .......... .......... .......... .......... 84% 10.9M 0s
435 [exec] 9800K .......... .......... .......... .......... .......... 84% 10.9M 0s
436 [exec] 9850K .......... .......... .......... .......... .......... 85% 10.9M 0s
437 [exec] 9900K .......... .......... .......... .......... .......... 85% 10.9M 0s
438 [exec] 9950K .......... .......... .......... .......... .......... 86% 8.20M 0s
439 [exec] 10000K .......... .......... .......... .......... .......... 86% 7.71M 0s
440 [exec] 10050K .......... .......... .......... .......... .......... 87% 1.05M 0s
441 [exec] 10100K .......... .......... .......... .......... .......... 87% 672M 0s
442 [exec] 10150K .......... .......... .......... .......... .......... 87% 737M 0s
443 [exec] 10200K .......... .......... .......... .......... .......... 88% 656M 0s
444 [exec] 10250K .......... .......... .......... .......... .......... 88% 3.30M 0s
445 [exec] 10300K .......... .......... .......... .......... .......... 89% 722M 0s
446 [exec] 10350K .......... .......... .......... .......... .......... 89% 703M 0s
447 [exec] 10400K .......... .......... .......... .......... .......... 90% 541M 0s
448 [exec] 10450K .......... .......... .......... .......... .......... 90% 11.5M 0s
449 [exec] 10500K .......... .......... .......... .......... .......... 90% 7.85M 0s
450 [exec] 10550K .......... .......... .......... .......... .......... 91% 6.33M 0s
451 [exec] 10600K .......... .......... .......... .......... .......... 91% 10.9M 0s
452 [exec] 10650K .......... .......... .......... .......... .......... 92% 8.01M 0s
453 [exec] 10700K .......... .......... .......... .......... .......... 92% 5.24M 0s
454 [exec] 10750K .......... .......... .......... .......... .......... 93% 6.06M 0s
455 [exec] 10800K .......... .......... .......... .......... .......... 93% 8.54M 0s
456 [exec] 10850K .......... .......... .......... .......... .......... 93% 8.66M 0s
457 [exec] 10900K .......... .......... .......... .......... .......... 94% 4.76M 0s
458 [exec] 10950K .......... .......... .......... .......... .......... 94% 6.45M 0s
459 [exec] 11000K .......... .......... .......... .......... .......... 95% 10.9M 0s
460 [exec] 11050K .......... .......... .......... .......... .......... 95% 8.55M 0s
461 [exec] 11100K .......... .......... .......... .......... .......... 96% 6.50M 0s
462 [exec] Archive: flyway-commandline-4.0.1.zip
463 [exec] creating: flyway-4.0.1/
464 [exec] creating: flyway-4.0.1/drivers/
465 [exec] creating: flyway-4.0.1/conf/
466 [exec] creating: flyway-4.0.1/sql/
467 [exec] creating: flyway-4.0.1/jars/
468 [exec] creating: flyway-4.0.1/lib/
469 [exec] inflating: flyway-4.0.1/flyway.cmd
470 [exec] inflating: flyway-4.0.1/README.txt
471 [exec] inflating: flyway-4.0.1/drivers/jtds-1.3.1.jar
472 [exec] inflating: flyway-4.0.1/drivers/sqlite-jdbc-3.7.15-M1.jar
473 [exec] inflating: flyway-4.0.1/flyway
474 [exec] inflating: flyway-4.0.1/lib/flyway-core-4.0.1.jar
475 [exec] inflating: flyway-4.0.1/drivers/put-your-jdbc-drivers-here.txt
476 [exec] inflating: flyway-4.0.1/lib/flyway-commandline-4.0.1.jar
477 [exec] inflating: flyway-4.0.1/drivers/postgresql-9.4.1208.jre6.jar
478 [exec] inflating: flyway-4.0.1/conf/flyway.conf
479 [exec] inflating: flyway-4.0.1/drivers/derby-10.12.1.1.jar
480 [exec] inflating: flyway-4.0.1/sql/put-your-sql-migrations-here.txt
481 [exec] inflating: flyway-4.0.1/drivers/derbyclient-10.12.1.1.jar
482 [exec] inflating: flyway-4.0.1/jars/put-your-java-migration-jars-here.txt
483 [exec] 11150K .......... .......... .......... .......... .......... 96% 7.29M 0s
484 [exec] 11200K .......... .......... .......... .......... .......... 96% 5.54M 0s
485 [exec] 11250K .......... .......... .......... .......... .......... 97% 8.36M 0s
486 [exec] 11300K .......... .......... .......... .......... .......... 97% 6.70M 0s
487 [exec] 11350K .......... .......... .......... .......... .......... 98% 7.22M 0s
488 [exec] 11400K .......... .......... .......... .......... .......... 98% 6.41M 0s
489 [exec] 11450K .......... .......... .......... .......... .......... 99% 11.5M 0s
490 [exec] 11500K .......... .......... .......... .......... .......... 99% 7.86M 0s
491 [exec] 11550K .......... .......... .......... .......... .......... 99% 5.27M 0s
492 [exec] 11600K .... 100% 19.8M=1.4s
493 [exec]
494 [exec] 2016-06-16 12:47:54 (8.10 MB/s) - 'flyway-commandline-4.0.1.zip' saved [11883353/11883353]
495 [exec]
496 [exec] inflating: flyway-4.0.1/drivers/h2-1.4.191.jar
497 [exec] inflating: flyway-4.0.1/LICENSES-THIRD-PARTY.txt
498 [exec] inflating: flyway-4.0.1/drivers/hsqldb-2.3.3.jar
499 [exec] inflating: flyway-4.0.1/LICENSE.txt
500 [exec] inflating: flyway-4.0.1/drivers/mariadb-java-client-1.3.6.jar
501 [exec] [INFO] Scanning for projects...
502 [exec] [INFO]
503 [exec] [INFO] ------------------------------------------------------------------------
504 [exec] [INFO] Building IotDbScripts 1.0.0
505 [exec] [INFO] ------------------------------------------------------------------------
506 [exec] [INFO]
507 [exec] [INFO] --- maven-clean-plugin:2.5:clean (default-clean) @ iot-db-scripts ---
508 [exec] [INFO]
509 [exec] [INFO] --- buildnumber-maven-plugin:1.4:create (default) @ iot-db-scripts ---
510 [exec] [INFO] Executing: /bin/sh -c cd '/home/pooky/env/build_dir/wicem/iot-db-scripts' && 'git' 'rev-parse' '--verify' 'HEAD'
511 [exec] [INFO] Working directory: /home/pooky/env/build_dir/wicem/iot-db-scripts
512 [exec] [INFO] Storing buildNumber: da32dca677cc99ec3297f3d4231f359fa1383f46 at timestamp: 1466081275700
513 [exec] [WARNING] Cannot get the branch information from the git repository:
514 [exec] Detecting the current branch failed: fatal: ref HEAD is not a symbolic ref
515 [exec]
516 [exec] [INFO] Executing: /bin/sh -c cd '/home/pooky/env/build_dir/wicem/iot-db-scripts' && 'git' 'rev-parse' '--verify' 'HEAD'
517 [exec] [INFO] Working directory: /home/pooky/env/build_dir/wicem/iot-db-scripts
518 [exec] [INFO] Storing buildScmBranch: UNKNOWN
519 [exec] [INFO]
520 [exec] [INFO] --- maven-resources-plugin:2.3:resources (default-resources) @ iot-db-scripts ---
521 [exec] [INFO] Using 'UTF-8' encoding to copy filtered resources.
522 [exec] [INFO] Copying 61 resources
523 [exec] [INFO]
524 [exec] [INFO] --- maven-compiler-plugin:3.3:compile (default-compile) @ iot-db-scripts ---
525 [exec] [INFO] No sources to compile
526 [exec] [INFO]
527 [exec] [INFO] --- maven-resources-plugin:2.3:testResources (default-testResources) @ iot-db-scripts ---
528 [exec] [INFO] Using 'UTF-8' encoding to copy filtered resources.
529 [exec] [INFO] skip non existing resourceDirectory /home/pooky/env/build_dir/wicem/iot-db-scripts/src/test/resources
530 [exec] [INFO]
531 [exec] [INFO] --- maven-compiler-plugin:3.3:testCompile (default-testCompile) @ iot-db-scripts ---
532 [exec] [INFO] No sources to compile
533 [exec] [INFO]
534 [exec] [INFO] --- maven-surefire-plugin:2.10:test (default-test) @ iot-db-scripts ---
535 [exec] [INFO] No tests to run.
536 [exec] [INFO] Surefire report directory: /home/pooky/env/build_dir/wicem/iot-db-scripts/target/surefire-reports
537 [exec]
538 [exec] -------------------------------------------------------
539 [exec] T E S T S
540 [exec] -------------------------------------------------------
541 [exec]
542 [exec] Results :
543 [exec]
544 [exec] Tests run: 0, Failures: 0, Errors: 0, Skipped: 0
545 [exec]
546 [exec] [INFO]
547 [exec] [INFO] --- maven-jar-plugin:2.6:jar (default-jar) @ iot-db-scripts ---
548 [exec] [INFO] Building jar: /home/pooky/env/build_dir/wicem/iot-db-scripts/target/iot-db-scripts.jar
549 [exec] [INFO] ------------------------------------------------------------------------
550 [exec] [INFO] BUILD SUCCESS
551 [exec] [INFO] ------------------------------------------------------------------------
552 [exec] [INFO] Total time: 0.978s
553 [exec] [INFO] Finished at: Thu Jun 16 12:47:56 UTC 2016
554 [exec] [INFO] Final Memory: 12M/481M
555 [exec] [INFO] ------------------------------------------------------------------------
556 [exec] total 76
557 [exec] drwxr-xr-x 4 root root 100 Jun 16 12:47 ./
558 [exec] drwxr-xr-x 4 root root 140 Jun 16 12:47 ../
559 [exec] drwxr-xr-x 3 root root 60 Jun 16 12:47 classes/
560 [exec] -rw-r--r-- 1 root root 77349 Jun 16 12:47 iot-db-scripts.jar
561 [exec] drwxr-xr-x 2 root root 40 Jun 16 12:47 surefire/
562 [exec] Archive: ./target/iot-db-scripts.jar
563 [exec] testing: META-INF/ OK
564 [exec] testing: META-INF/MANIFEST.MF OK
565 [exec] testing: db/ OK
566 [exec] testing: db/flyway_incompatible/ OK
567 [exec] testing: db/migration/ OK
568 [exec] testing: db/upgrades/ OK
569 [exec] testing: db/upgrades/archived/ OK
570 [exec] testing: db/utils/ OK
571 [exec] testing: db/flyway_incompatible/010_postgres_inventorydb.sql OK
572 [exec] testing: db/flyway_incompatible/022_inventory_views.sql OK
573 [exec] testing: db/flyway_incompatible/110_postgres_inventorydb_adm-users.sql OK
574 [exec] testing: db/flyway_incompatible/120_adm_inventorydb_schemaobjects.sql OK
575 [exec] testing: db/flyway_incompatible/130_adm_inventorydb_init-data.sql OK
576 [exec] testing: db/migration/R__inventory_views.sql OK
577 [exec] testing: db/migration/countries.txt OK
578 [exec] testing: db/migration/timezones.txt OK
579 [exec] testing: db/migration/vagrant-wicem-create.sh OK
580 [exec] testing: db/migration/V0008__device-uuid.sql OK
581 [exec] testing: db/migration/V0007__inventory_inventorydb_tenant-subtenant.sql OK
582 [exec] testing: db/migration/V0006__device_type.sql OK
583 [exec] testing: db/migration/V0005__inventory_init-data.sql OK
584 [exec] testing: db/migration/V0004__postgres_copy-countries.sql OK
585 [exec] testing: db/migration/V0003__inventory_triggers.sql OK
586 [exec] testing: db/migration/V0002__inventory_inventory-schema.sql OK
587 [exec] testing: db/upgrades/20160106-tenant-code.sql OK
588 [exec] testing: db/upgrades/20160114-tenant-configuration.sql OK
589 [exec] testing: db/upgrades/20160121-user-passwords.sql OK
590 [exec] testing: db/upgrades/20160124-keycloak-realm-config.sql OK
591 [exec] testing: db/upgrades/20160131-subtenant-code-index.sql OK
592 [exec] testing: db/upgrades/20160204-whirlpool-base-urls-table-migration.sql OK
593 [exec] testing: db/upgrades/20160205-user-and-dev-extension-generalization.sql OK
594 [exec] testing: db/upgrades/20160213-supported-country.sql OK
595 [exec] testing: db/upgrades/20160222-user-attribute.sql OK
596 [exec] testing: db/upgrades/20160228-management-technology.sql OK
597 [exec] testing: db/upgrades/20160303-1-alignment-columns-removal.sql OK
598 [exec] testing: db/upgrades/20160303-2-whirlpool-urls-dropping.sql OK
599 [exec] testing: db/upgrades/20160304-device-repository.sql OK
600 [exec] testing: db/upgrades/20160308-iot-user-extension.sql OK
601 [exec] testing: db/upgrades/20160312-ids-hashing.sql OK
602 [exec] testing: db/upgrades/20160313-device-type.sql OK
603 [exec] testing: db/upgrades/20160318-device-type-in-device.sql OK
604 [exec] testing: db/upgrades/20160319-device-attribute.sql OK
605 [exec] testing: db/upgrades/20160321-catalog-entry.sql OK
606 [exec] testing: db/upgrades/20160324-physical-device-id.sql OK
607 [exec] testing: db/upgrades/20160329-1-appliance-state-cache-migration.sql OK
608 [exec] testing: db/upgrades/20160329-2-load-catalog-whp-fridge.sql OK
609 [exec] testing: db/upgrades/20160329-3-load-catalog-bau-fridge.sql OK
610 [exec] testing: db/upgrades/20160329-4-load-catalog-whp-dishwasher.sql OK
611 [exec] testing: db/upgrades/20160329-5-load-catalog-bau-dishwasher.sql OK
612 [exec] testing: db/upgrades/20160402-keycloak-user-id.sql OK
613 [exec] testing: db/upgrades/20160413-devicerepository-fwrev.sql OK
614 [exec] testing: db/upgrades/20160427-subtenant-api-parameters.sql OK
615 [exec] testing: db/upgrades/20160519-site_fulltext_support.sql OK
616 [exec] testing: db/upgrades/20160607-iot_user_fulltext_support.sql OK
617 [exec] testing: db/upgrades/archived/20151116-tenant-subtenant.sql OK
618 [exec] testing: db/upgrades/archived/20160106-tenant-code.sql OK
619 [exec] testing: db/upgrades/20160525-user-device-subtenant-code.sql OK
620 [exec] testing: db/upgrades/20160606-device-deleted-column.sql OK
621 [exec] testing: db/upgrades/20160608-site-audit.sql OK
622 [exec] testing: db/upgrades/20160614-device-uuid.sql OK
623 [exec] testing: db/utils/add_tenant.sql OK
624 [exec] testing: db/utils/device-list.sql OK
625 [exec] testing: db/utils/exportDevices.sql OK
626 [exec] testing: db/utils/exportUsers.sql OK
627 [exec] testing: db/utils/m2m-1.sql OK
628 [exec] testing: db/utils/m2m-2.sql OK
629 [exec] testing: db/utils/m2m-3.sql OK
630 [exec] testing: db/utils/m2m-4.sql OK
631 [exec] testing: db/utils/m2m.sh OK
632 [exec] No errors detected in compressed data of ./target/iot-db-scripts.jar.
633 [exec] Flyway 4.0.1 by Boxfuse
634 [exec]
635 [exec] Database: jdbc:postgresql://localhost/inventorydbtest (PostgreSQL 9.5)
636 [exec] Successfully validated 8 migrations (execution time 00:00.025s)
637 [exec] Creating Metadata table: "public"."schema_version"
638 [exec] Current version of schema "public": << Empty Schema >>
639 [exec] Migrating schema "public" to version 0002 - inventory inventory-schema
640 [exec] Migrating schema "public" to version 0003 - inventory triggers
641 [exec] Migrating schema "public" to version 0004 - postgres copy-countries
642 [exec] Migrating schema "public" to version 0005 - inventory init-data
643 [exec] Migrating schema "public" to version 0006 - device type
644 [exec] Migrating schema "public" to version 0007 - inventory inventorydb tenant-subtenant
645 [exec] Migrating schema "public" to version 0008 - device-uuid
646 [exec] Migrating schema "public" with repeatable migration inventory views
647 [exec] Successfully applied 8 migrations to schema "public" (execution time 00:00.375s).
648 [exec] [INFO] Scanning for projects...
649 [exec] [INFO] ------------------------------------------------------------------------
650 [exec] [INFO] Reactor Build Order:
651 [exec] [INFO]
652 [exec] [INFO] Business IoT
653 [exec] [INFO] IotDbScripts
654 [exec] [INFO] IotDbScriptsScenarios
655 [exec] [INFO] IoTCommon
656 [exec] [INFO] SmartApplianceModel
657 [exec] [INFO] BigDataLogger
658 [exec] [INFO] WicemApi
659 [exec] [INFO] KeycloakTokenProtocolMapper
660 [exec] [INFO] KeycloakRestApiClient
661 [exec] [INFO] Integration
662 [exec] [INFO] ArrayentIntegration
663 [exec] [INFO] WinOnlineIntegration
664 [exec] [INFO] KeycloakBIoTService
665 [exec] [INFO] IoTCache
666 [exec] [INFO] TenantCache
667 [exec] [INFO] WebLayerCommons
668 [exec] [INFO] Registration
669 [exec] [INFO] WicemRestApi
670 [exec] [INFO] status-checker
671 [exec] [INFO] status-manager
672 [exec] [INFO] polling-engine
673 [exec] [INFO] Device management
674 [exec] [INFO] model
675 [exec] [INFO] mdl-base
676 [exec] [INFO] mdl-dm
677 [exec] [INFO] mdl-dm-api
678 [exec] [INFO] AbstractManagementLayer
679 [exec] [INFO] AbstractManagementLayerInterface
680 [exec] [INFO] base
681 [exec] [INFO] mdl-tss
682 [exec] [INFO] mdl-tss-cache
683 [exec] [INFO] test
684 [exec] [INFO] manager
685 [exec] [INFO] mgr-policy
686 [exec] [INFO] mgr-firmware
687 [exec] [INFO] mgr-devices
688 [exec] [INFO] mgr-groups
689 [exec] [INFO] mgr-tasks
690 [exec] [INFO] mgr-activity
691 [exec] [INFO] task-execution-engine
692 [exec] [INFO] device-management-api-ejb
693 [exec] [INFO] administration
694 [exec] [INFO] AdministrationAPI
695 [exec] [INFO] AdministrationConsole
696 [exec] [INFO] device-api
697 [exec] [INFO] eventmessage
698 [exec] [INFO] mqtt
699 [exec] [INFO] messagerouter
700 [exec] [INFO] device-proxy: EJB Module
701 [exec] [INFO] IoTRestAPI
702 [exec] [INFO] PasswordReset
703 [exec] [INFO] device-management-proxy-ejb
704 [exec] [INFO] device-provisioning-campaign-management
705 [exec] [INFO] device-maintenance-operation
706 [exec] [INFO] ArrayentManagementLayer
707 [exec] [INFO] WhirlpoolUserManagementLayer
708 [exec] [INFO] WhirlpoolManagementLayer
709 [exec] [INFO] MQTTManagementLayer
710 [exec] [INFO] ArrayentDeviceManagementLayer
711 [exec] [INFO] ADBMQTTDeviceManagementLayer
712 [exec] [INFO] binaryparser
713 [exec] [INFO] deployments
714 [exec] [INFO] iot-admin
715 [exec] [INFO] iot-core
716 [exec] [INFO] m2m-mqtt
717 [exec] [INFO] m2m-arrayent
718 [exec] [INFO] keycloak
719 [exec] [INFO]
720 [exec] [INFO] ------------------------------------------------------------------------
721 [exec] [INFO] Building Business IoT 1.0.0
722 [exec] [INFO] ------------------------------------------------------------------------
723 [exec] [INFO]
724 [exec] [INFO] --- maven-clean-plugin:2.5:clean (default-clean) @ root ---
725 [exec] [INFO]
726 [exec] [INFO] --- buildnumber-maven-plugin:1.4:create (default) @ root ---
727 [exec] [INFO] Executing: /bin/sh -c cd '/home/pooky/env/build_dir/wicem' && 'git' 'rev-parse' '--verify' 'HEAD'
728 [exec] [INFO] Working directory: /home/pooky/env/build_dir/wicem
729 [exec] [INFO] Storing buildNumber: da32dca677cc99ec3297f3d4231f359fa1383f46 at timestamp: 1466081277985
730 [exec] [WARNING] Cannot get the branch information from the git repository:
731 [exec] Detecting the current branch failed: fatal: ref HEAD is not a symbolic ref
732 [exec]
733 [exec] [INFO] Executing: /bin/sh -c cd '/home/pooky/env/build_dir/wicem' && 'git' 'rev-parse' '--verify' 'HEAD'
734 [exec] [INFO] Working directory: /home/pooky/env/build_dir/wicem
735 [exec] [INFO] Storing buildScmBranch: UNKNOWN
736 [exec] [INFO]
737 [exec] [INFO] --- maven-install-plugin:2.5.2:install (default-install) @ root ---
738 [exec] [INFO] Installing /home/pooky/env/build_dir/wicem/pom.xml to /home/pooky/.persistent/filestore/biot_repository/com/adbglobal/iot/root/1.0.0/root-1.0.0.pom
739 [exec] [INFO]
740 [exec] [INFO] ------------------------------------------------------------------------
741 [exec] [INFO] Building IotDbScripts 1.0.0
742 [exec] [INFO] ------------------------------------------------------------------------
743 [exec] [INFO]
744 [exec] [INFO] --- maven-clean-plugin:2.5:clean (default-clean) @ iot-db-scripts ---
745 [exec] [INFO] Deleting /home/pooky/env/build_dir/wicem/iot-db-scripts/target
746 [exec] [INFO]
747 [exec] [INFO] --- buildnumber-maven-plugin:1.4:create (default) @ iot-db-scripts ---
748 [exec] [INFO] Executing: /bin/sh -c cd '/home/pooky/env/build_dir/wicem/iot-db-scripts' && 'git' 'rev-parse' '--verify' 'HEAD'
749 [exec] [INFO] Working directory: /home/pooky/env/build_dir/wicem/iot-db-scripts
750 [exec] [INFO] Storing buildNumber: da32dca677cc99ec3297f3d4231f359fa1383f46 at timestamp: 1466081278153
751 [exec] [WARNING] Cannot get the branch information from the git repository:
752 [exec] Detecting the current branch failed: fatal: ref HEAD is not a symbolic ref
753 [exec]
754 [exec] [INFO] Executing: /bin/sh -c cd '/home/pooky/env/build_dir/wicem/iot-db-scripts' && 'git' 'rev-parse' '--verify' 'HEAD'
755 [exec] [INFO] Working directory: /home/pooky/env/build_dir/wicem/iot-db-scripts
756 [exec] [INFO] Storing buildScmBranch: UNKNOWN
757 [exec] [INFO]
758 [exec] [INFO] --- maven-resources-plugin:2.3:resources (default-resources) @ iot-db-scripts ---
759 [exec] [INFO] Using 'UTF-8' encoding to copy filtered resources.
760 [exec] [INFO] Copying 61 resources
761 [exec] [INFO]
762 [exec] [INFO] --- maven-compiler-plugin:3.3:compile (default-compile) @ iot-db-scripts ---
763 [exec] [INFO] No sources to compile
764 [exec] [INFO]
765 [exec] [INFO] --- maven-resources-plugin:2.3:testResources (default-testResources) @ iot-db-scripts ---
766 [exec] [INFO] Using 'UTF-8' encoding to copy filtered resources.
767 [exec] [INFO] skip non existing resourceDirectory /home/pooky/env/build_dir/wicem/iot-db-scripts/src/test/resources
768 [exec] [INFO]
769 [exec] [INFO] --- maven-compiler-plugin:3.3:testCompile (default-testCompile) @ iot-db-scripts ---
770 [exec] [INFO] No sources to compile
771 [exec] [INFO]
772 [exec] [INFO] --- maven-surefire-plugin:2.10:test (default-test) @ iot-db-scripts ---
773 [exec] [INFO] No tests to run.
774 [exec] [INFO] Surefire report directory: /home/pooky/env/build_dir/wicem/iot-db-scripts/target/surefire-reports
775 [exec]
776 [exec] -------------------------------------------------------
777 [exec] T E S T S
778 [exec] -------------------------------------------------------
779 [exec]
780 [exec] Results :
781 [exec]
782 [exec] Tests run: 0, Failures: 0, Errors: 0, Skipped: 0
783 [exec]
784 [exec] [INFO]
785 [exec] [INFO] --- maven-jar-plugin:2.6:jar (default-jar) @ iot-db-scripts ---
786 [exec] [INFO] Building jar: /home/pooky/env/build_dir/wicem/iot-db-scripts/target/iot-db-scripts.jar
787 [exec] [INFO]
788 [exec] [INFO] --- maven-install-plugin:2.5.2:install (default-install) @ iot-db-scripts ---
789 [exec] [INFO] Installing /home/pooky/env/build_dir/wicem/iot-db-scripts/target/iot-db-scripts.jar to /home/pooky/.persistent/filestore/biot_repository/com/adbglobal/iot/iot-db-scripts/1.0.0/iot-db-scripts-1.0.0.jar
790 [exec] [INFO] Installing /home/pooky/env/build_dir/wicem/iot-db-scripts/pom.xml to /home/pooky/.persistent/filestore/biot_repository/com/adbglobal/iot/iot-db-scripts/1.0.0/iot-db-scripts-1.0.0.pom
791 [exec] [INFO]
792 [exec] [INFO] ------------------------------------------------------------------------
793 [exec] [INFO] Building IotDbScriptsScenarios 1.0.0
794 [exec] [INFO] ------------------------------------------------------------------------
795 [exec] [INFO]
796 [exec] [INFO] --- maven-clean-plugin:2.5:clean (default-clean) @ iot-db-scripts-scenarios ---
797 [exec] [INFO]
798 [exec] [INFO] --- buildnumber-maven-plugin:1.4:create (default) @ iot-db-scripts-scenarios ---
799 [exec] [INFO] Executing: /bin/sh -c cd '/home/pooky/env/build_dir/wicem/iot-db-scripts-scenarios' && 'git' 'rev-parse' '--verify' 'HEAD'
800 [exec] [INFO] Working directory: /home/pooky/env/build_dir/wicem/iot-db-scripts-scenarios
801 [exec] [INFO] Storing buildNumber: da32dca677cc99ec3297f3d4231f359fa1383f46 at timestamp: 1466081278597
802 [exec] [WARNING] Cannot get the branch information from the git repository:
803 [exec] Detecting the current branch failed: fatal: ref HEAD is not a symbolic ref
804 [exec]
805 [exec] [INFO] Executing: /bin/sh -c cd '/home/pooky/env/build_dir/wicem/iot-db-scripts-scenarios' && 'git' 'rev-parse' '--verify' 'HEAD'
806 [exec] [INFO] Working directory: /home/pooky/env/build_dir/wicem/iot-db-scripts-scenarios
807 [exec] [INFO] Storing buildScmBranch: UNKNOWN
808 [exec] [INFO]
809 [exec] [INFO] --- maven-resources-plugin:2.3:resources (default-resources) @ iot-db-scripts-scenarios ---
810 [exec] [INFO] Using 'UTF-8' encoding to copy filtered resources.
811 [exec] [INFO] Copying 20 resources
812 [exec] [INFO]
813 [exec] [INFO] --- maven-compiler-plugin:3.3:compile (default-compile) @ iot-db-scripts-scenarios ---
814 [exec] [INFO] No sources to compile
815 [exec] [INFO]
816 [exec] [INFO] --- maven-resources-plugin:2.3:testResources (default-testResources) @ iot-db-scripts-scenarios ---
817 [exec] [INFO] Using 'UTF-8' encoding to copy filtered resources.
818 [exec] [INFO] skip non existing resourceDirectory /home/pooky/env/build_dir/wicem/iot-db-scripts-scenarios/src/test/resources
819 [exec] [INFO]
820 [exec] [INFO] --- maven-compiler-plugin:3.3:testCompile (default-testCompile) @ iot-db-scripts-scenarios ---
821 [exec] [INFO] No sources to compile
822 [exec] [INFO]
823 [exec] [INFO] --- maven-surefire-plugin:2.10:test (default-test) @ iot-db-scripts-scenarios ---
824 [exec] [INFO] No tests to run.
825 [exec] [INFO] Surefire report directory: /home/pooky/env/build_dir/wicem/iot-db-scripts-scenarios/target/surefire-reports
826 [exec]
827 [exec] -------------------------------------------------------
828 [exec] T E S T S
829 [exec] -------------------------------------------------------
830 [exec]
831 [exec] Results :
832 [exec]
833 [exec] Tests run: 0, Failures: 0, Errors: 0, Skipped: 0
834 [exec]
835 [exec] [INFO]
836 [exec] [INFO] --- maven-jar-plugin:2.6:jar (default-jar) @ iot-db-scripts-scenarios ---
837 [exec] [INFO] Building jar: /home/pooky/env/build_dir/wicem/iot-db-scripts-scenarios/target/iot-db-scripts-scenarios.jar
838 [exec] [INFO]
839 [exec] [INFO] --- maven-install-plugin:2.5.2:install (default-install) @ iot-db-scripts-scenarios ---
840 [exec] [INFO] Installing /home/pooky/env/build_dir/wicem/iot-db-scripts-scenarios/target/iot-db-scripts-scenarios.jar to /home/pooky/.persistent/filestore/biot_repository/com/adbglobal/iot/iot-db-scripts-scenarios/1.0.0/iot-db-scripts-scenarios-1.0.0.jar
841 [exec] [INFO] Installing /home/pooky/env/build_dir/wicem/iot-db-scripts-scenarios/pom.xml to /home/pooky/.persistent/filestore/biot_repository/com/adbglobal/iot/iot-db-scripts-scenarios/1.0.0/iot-db-scripts-scenarios-1.0.0.pom
842 [exec] [INFO]
843 [exec] [INFO] ------------------------------------------------------------------------
844 [exec] [INFO] Building IoTCommon 1.0.0
845 [exec] [INFO] ------------------------------------------------------------------------
846 [exec] [INFO]
847 [exec] [INFO] --- maven-clean-plugin:2.5:clean (default-clean) @ iot-common ---
848 [exec] [INFO]
849 [exec] [INFO] --- buildnumber-maven-plugin:1.4:create (default) @ iot-common ---
850 [exec] [INFO] Executing: /bin/sh -c cd '/home/pooky/env/build_dir/wicem/iot-common' && 'git' 'rev-parse' '--verify' 'HEAD'
851 [exec] [INFO] Working directory: /home/pooky/env/build_dir/wicem/iot-common
852 [exec] [INFO] Storing buildNumber: da32dca677cc99ec3297f3d4231f359fa1383f46 at timestamp: 1466081278742
853 [exec] [WARNING] Cannot get the branch information from the git repository:
854 [exec] Detecting the current branch failed: fatal: ref HEAD is not a symbolic ref
855 [exec]
856 [exec] [INFO] Executing: /bin/sh -c cd '/home/pooky/env/build_dir/wicem/iot-common' && 'git' 'rev-parse' '--verify' 'HEAD'
857 [exec] [INFO] Working directory: /home/pooky/env/build_dir/wicem/iot-common
858 [exec] [INFO] Storing buildScmBranch: UNKNOWN
859 [exec] [INFO]
860 [exec] [INFO] --- maven-resources-plugin:2.3:resources (default-resources) @ iot-common ---
861 [exec] [INFO] Using 'UTF-8' encoding to copy filtered resources.
862 [exec] [INFO] skip non existing resourceDirectory /home/pooky/env/build_dir/wicem/iot-common/src/main/resources
863 [exec] [INFO]
864 [exec] [INFO] --- maven-compiler-plugin:3.3:compile (default-compile) @ iot-common ---
865 [exec] [INFO] Changes detected - recompiling the module!
866 [exec] [INFO] Compiling 10 source files to /home/pooky/env/build_dir/wicem/iot-common/target/classes
867 [exec] [INFO]
868 [exec] [INFO] --- maven-resources-plugin:2.3:testResources (default-testResources) @ iot-common ---
869 [exec] [INFO] Using 'UTF-8' encoding to copy filtered resources.
870 [exec] [INFO] Copying 1 resource
871 [exec] [INFO]
872 [exec] [INFO] --- maven-compiler-plugin:3.3:testCompile (default-testCompile) @ iot-common ---
873 [exec] [INFO] Changes detected - recompiling the module!
874 [exec] [INFO] Compiling 1 source file to /home/pooky/env/build_dir/wicem/iot-common/target/test-classes
875 [exec] [INFO]
876 [exec] [INFO] --- maven-surefire-plugin:2.10:test (default-test) @ iot-common ---
877 [exec] [INFO] Surefire report directory: /home/pooky/env/build_dir/wicem/iot-common/target/surefire-reports
878 [exec]
879 [exec] -------------------------------------------------------
880 [exec] T E S T S
881 [exec] -------------------------------------------------------
882 [exec] Running com.adbglobal.iot.utils.SimpleFlywayTest
883 [exec]
884 [exec]
885 [exec] ***************************************
886 [exec] *** START OF FLYWAY CONFIGURATION ***
887 [exec] ***************************************
888 [exec] scenario name is: testflyway
889 [exec] migration root path is: classpath:db/migration/
890 [exec] migration scenario root path is: classpath:junit_tests
891 [exec] Flyway registered path: classpath:db/migration/
892 [exec] Flyway registered path: classpath:junit_tests/testflyway
893 [exec] ***************************************
894 [exec] *** END OF FLYWAY CONFIGURATION ***
895 [exec] ***************************************
896 [exec]
897 [exec]
898 [exec] found placeholder from system properties: migrationCopyFolder
899 [exec] Jun 16, 2016 12:47:59 PM org.flywaydb.core.internal.util.VersionPrinter printVersion
900 [exec] INFO: Flyway 4.0 by Boxfuse
901 [exec] Jun 16, 2016 12:47:59 PM org.flywaydb.core.internal.dbsupport.DbSupportFactory createDbSupport
902 [exec] INFO: Database: jdbc:postgresql://localhost/inventorydbtest (PostgreSQL 9.5)
903 [exec] Jun 16, 2016 12:47:59 PM org.flywaydb.core.internal.command.DbClean cleanSchema
904 [exec] INFO: Successfully cleaned schema "public" (execution time 00:00.042s)
905 [exec] Jun 16, 2016 12:47:59 PM org.flywaydb.core.internal.metadatatable.MetaDataTableImpl createIfNotExists
906 [exec] INFO: Creating Metadata table: "public"."schema_version"
907 [exec] Jun 16, 2016 12:47:59 PM org.flywaydb.core.internal.command.DbBaseline baseline
908 [exec] INFO: Successfully baselined schema with version: 1
909 [exec] Jun 16, 2016 12:47:59 PM org.flywaydb.core.internal.command.DbValidate validate
910 [exec] INFO: Successfully validated 10 migrations (execution time 00:00.033s)
911 [exec] Jun 16, 2016 12:47:59 PM org.flywaydb.core.internal.command.DbMigrate migrate
912 [exec] INFO: Current version of schema "public": 1
913 [exec] Jun 16, 2016 12:47:59 PM org.flywaydb.core.internal.command.DbMigrate applyMigration
914 [exec] INFO: Migrating schema "public" to version 0002 - inventory inventory-schema
915 [exec] Jun 16, 2016 12:47:59 PM org.flywaydb.core.internal.command.DbMigrate applyMigration
916 [exec] INFO: Migrating schema "public" to version 0003 - inventory triggers
917 [exec] Jun 16, 2016 12:47:59 PM org.flywaydb.core.internal.command.DbMigrate applyMigration
918 [exec] INFO: Migrating schema "public" to version 0004 - postgres copy-countries
919 [exec] Jun 16, 2016 12:47:59 PM org.flywaydb.core.internal.command.DbMigrate applyMigration
920 [exec] INFO: Migrating schema "public" to version 0005 - inventory init-data
921 [exec] Jun 16, 2016 12:47:59 PM org.flywaydb.core.internal.command.DbMigrate applyMigration
922 [exec] INFO: Migrating schema "public" to version 0006 - device type
923 [exec] Jun 16, 2016 12:47:59 PM org.flywaydb.core.internal.command.DbMigrate applyMigration
924 [exec] INFO: Migrating schema "public" to version 0007 - inventory inventorydb tenant-subtenant
925 [exec] Jun 16, 2016 12:48:00 PM org.flywaydb.core.internal.command.DbMigrate applyMigration
926 [exec] INFO: Migrating schema "public" to version 0008 - device-uuid
927 [exec] Jun 16, 2016 12:48:00 PM org.flywaydb.core.internal.command.DbMigrate applyMigration
928 [exec] INFO: Migrating schema "public" to version 210 - inventory inventorydb tenant-subtenant
929 [exec] Jun 16, 2016 12:48:00 PM org.flywaydb.core.internal.command.DbMigrate applyMigration
930 [exec] SEVERE: Migration of schema "public" to version 210 - inventory inventorydb tenant-subtenant failed! Changes successfully rolled back.
931 [exec] Error during Flyway Script
932 [exec] : statement: INSERT INTO TENANT
933 [exec] (tenant_id,
934 [exec] tenant_type_id,
935 [exec] tenant_name,
936 [exec] country_id,
937 [exec] city,
938 [exec] tenant_code)
939 [exec] VALUES (NEXTVAL( 's_tenant' ),
940 [exec] 'EAP',
941 [exec] 'Whirlpool',
942 [exec] 'DE',
943 [exec] 'Berlin',
944 [exec] 'WHP')
945 [exec] line number: 2
946 [exec] localized message:
947 [exec] Migration V210__inventory_inventorydb_tenant-subtenant.sql failed
948 [exec] -----------------------------------------------------------------
949 [exec] SQL State : 23505
950 [exec] Error Code : 0
951 [exec] Message : ERROR: duplicate key value violates unique constraint "uidx_tenant_code"
952 [exec] Detail: Key (lower(tenant_code::text))=(whp) already exists.
953 [exec] Location : junit_tests/testflyway/V210__inventory_inventorydb_tenant-subtenant.sql (/home/pooky/env/build_dir/wicem/iot-common/file:/home/pooky/env/build_dir/wicem/iot-db-scripts-scenarios/target/iot-db-scripts-scenarios.jar!/junit_tests/testflyway/V210__inventory_inventorydb_tenant-subtenant.sql)
954 [exec] Line : 2
955 [exec] Statement : INSERT INTO TENANT
956 [exec] (tenant_id,
957 [exec] tenant_type_id,
958 [exec] tenant_name,
959 [exec] country_id,
960 [exec] city,
961 [exec] tenant_code)
962 [exec] VALUES (NEXTVAL( 's_tenant' ),
963 [exec] 'EAP',
964 [exec] 'Whirlpool',
965 [exec] 'DE',
966 [exec] 'Berlin',
967 [exec] 'WHP')
968 [exec]
969 [exec] Tests run: 1, Failures: 0, Errors: 1, Skipped: 0, Time elapsed: 0.688 sec <<< FAILURE!
970 [exec]
971 [exec] Results :
972 [exec]
973 [exec] Tests in error:
974 [exec] TestFlyway(com.adbglobal.iot.utils.SimpleFlywayTest):
975 [exec]
976 [exec] Tests run: 1, Failures: 0, Errors: 1, Skipped: 0
977 [exec]
978 [exec] [INFO] ------------------------------------------------------------------------
979 [exec] [INFO] Reactor Summary:
980 [exec] [INFO]
981 [exec] [INFO] Business IoT ...................................... SUCCESS [0.377s]
982 [exec] [INFO] IotDbScripts ...................................... SUCCESS [0.479s]
983 [exec] [INFO] IotDbScriptsScenarios ............................. SUCCESS [0.126s]
984 [exec] [INFO] IoTCommon ......................................... FAILURE [1.347s]
985 [exec] [INFO] SmartApplianceModel ............................... SKIPPED
986 [exec] [INFO] BigDataLogger ..................................... SKIPPED
987 [exec] [INFO] WicemApi .......................................... SKIPPED
988 [exec] [INFO] KeycloakTokenProtocolMapper ....................... SKIPPED
989 [exec] [INFO] KeycloakRestApiClient ............................. SKIPPED
990 [exec] [INFO] Integration ....................................... SKIPPED
991 [exec] [INFO] ArrayentIntegration ............................... SKIPPED
992 [exec] [INFO] WinOnlineIntegration .............................. SKIPPED
993 [exec] [INFO] KeycloakBIoTService ............................... SKIPPED
994 [exec] [INFO] IoTCache .......................................... SKIPPED
995 [exec] [INFO] TenantCache ....................................... SKIPPED
996 [exec] [INFO] WebLayerCommons ................................... SKIPPED
997 [exec] [INFO] Registration ...................................... SKIPPED
998 [exec] [INFO] WicemRestApi ...................................... SKIPPED
999 [exec] [INFO] status-checker .................................... SKIPPED
1000 [exec] [INFO] status-manager .................................... SKIPPED
1001 [exec] [INFO] polling-engine .................................... SKIPPED
1002 [exec] [INFO] Device management ................................. SKIPPED
1003 [exec] [INFO] model ............................................. SKIPPED
1004 [exec] [INFO] mdl-base .......................................... SKIPPED
1005 [exec] [INFO] mdl-dm ............................................ SKIPPED
1006 [exec] [INFO] mdl-dm-api ........................................ SKIPPED
1007 [exec] [INFO] AbstractManagementLayer ........................... SKIPPED
1008 [exec] [INFO] AbstractManagementLayerInterface .................. SKIPPED
1009 [exec] [INFO] base .............................................. SKIPPED
1010 [exec] [INFO] mdl-tss ........................................... SKIPPED
1011 [exec] [INFO] mdl-tss-cache ..................................... SKIPPED
1012 [exec] [INFO] test .............................................. SKIPPED
1013 [exec] [INFO] manager ........................................... SKIPPED
1014 [exec] [INFO] mgr-policy ........................................ SKIPPED
1015 [exec] [INFO] mgr-firmware ...................................... SKIPPED
1016 [exec] [INFO] mgr-devices ....................................... SKIPPED
1017 [exec] [INFO] mgr-groups ........................................ SKIPPED
1018 [exec] [INFO] mgr-tasks ......................................... SKIPPED
1019 [exec] [INFO] mgr-activity ...................................... SKIPPED
1020 [exec] [INFO] task-execution-engine ............................. SKIPPED
1021 [exec] [INFO] device-management-api-ejb ......................... SKIPPED
1022 [exec] [INFO] administration .................................... SKIPPED
1023 [exec] [INFO] AdministrationAPI ................................. SKIPPED
1024 [exec] [INFO] AdministrationConsole ............................. SKIPPED
1025 [exec] [INFO] device-api ........................................ SKIPPED
1026 [exec] [INFO] eventmessage ...................................... SKIPPED
1027 [exec] [INFO] mqtt .............................................. SKIPPED
1028 [exec] [INFO] messagerouter ..................................... SKIPPED
1029 [exec] [INFO] device-proxy: EJB Module .......................... SKIPPED
1030 [exec] [INFO] IoTRestAPI ........................................ SKIPPED
1031 [exec] [INFO] PasswordReset ..................................... SKIPPED
1032 [exec] [INFO] device-management-proxy-ejb ....................... SKIPPED
1033 [exec] [INFO] device-provisioning-campaign-management ........... SKIPPED
1034 [exec] [INFO] device-maintenance-operation ...................... SKIPPED
1035 [exec] [INFO] ArrayentManagementLayer ........................... SKIPPED
1036 [exec] [INFO] WhirlpoolUserManagementLayer ...................... SKIPPED
1037 [exec] [INFO] WhirlpoolManagementLayer .......................... SKIPPED
1038 [exec] [INFO] MQTTManagementLayer ............................... SKIPPED
1039 [exec] [INFO] ArrayentDeviceManagementLayer ..................... SKIPPED
1040 [exec] [INFO] ADBMQTTDeviceManagementLayer ...................... SKIPPED
1041 [exec] [INFO] binaryparser ...................................... SKIPPED
1042 [exec] [INFO] deployments ....................................... SKIPPED
1043 [exec] [INFO] iot-admin ......................................... SKIPPED
1044 [exec] [INFO] iot-core .......................................... SKIPPED
1045 [exec] [INFO] m2m-mqtt .......................................... SKIPPED
1046 [exec] [INFO] m2m-arrayent ...................................... SKIPPED
1047 [exec] [INFO] keycloak .......................................... SKIPPED
1048 [exec] [INFO] ------------------------------------------------------------------------
1049 [exec] [INFO] BUILD FAILURE
1050 [exec] [INFO] ------------------------------------------------------------------------
1051 [exec] [INFO] Total time: 2.680s
1052 [exec] [INFO] Finished at: Thu Jun 16 12:48:00 UTC 2016
1053 [exec] [INFO] Final Memory: 30M/598M
1054 [exec] [INFO] ------------------------------------------------------------------------
1055 [exec] [ERROR] Failed to execute goal org.apache.maven.plugins:maven-surefire-plugin:2.10:test (default-test) on project iot-common: There are test failures.
1056 [exec] [ERROR]
1057 [exec] [ERROR] Please refer to /home/pooky/env/build_dir/wicem/iot-common/target/surefire-reports for the individual test results.
1058 [exec] [ERROR] -> [Help 1]
1059 [exec] [ERROR]
1060 [exec] [ERROR] To see the full stack trace of the errors, re-run Maven with the -e switch.
1061 [exec] [ERROR] Re-run Maven using the -X switch to enable full debug logging.
1062 [exec] [ERROR]
1063 [exec] [ERROR] For more information about the errors and possible solutions, please read the following articles:
1064 [exec] [ERROR] [Help 1] http://cwiki.apache.org/confluence/display/MAVEN/MojoFailureException
1065 [exec] [ERROR]
1066 [exec] [ERROR] After correcting the problems, you can resume the build with the command
1067 [exec] [ERROR] mvn <goals> -rf :iot-common
1068
1069BUILD FAILED
1070/home/pooky/env/builds/GVS/12.04/scenarios/wicem-biot/build.xml:26: The following error occurred while executing this line:
1071/home/pooky/env/builds/macros.xml:443: The following error occurred while executing this line:
1072/home/pooky/env/builds/macros_internal.xml:1078: The following error occurred while executing this line:
1073/home/pooky/env/builds/macros_internal.xml:1101: exec returned: 1
1074
1075Total time: 21 seconds