· 9 years ago · Jan 21, 2017, 06:24 AM
1<6>[ 0.000000]@0 Initializing cgroup subsys cpu
2<6>[ 0.000000]@0 Initializing cgroup subsys cpuacct
3<5>[ 0.000000]@0 Linux version 3.18.31-twrp-3.0 (jc@westerley) (gcc version 6.2.1 20161016 (Linaro GCC 6.2-2016.11) ) #1 SMP PREEMPT Sat Jan 21 00:54:44 EST 2017
4<4>[ 0.000000]@0 CPU: AArch64 Processor [512f2011] revision 1
5<6>[ 0.000000]@0 alternatives: detected feature GIC system register CPU interface
6<6>[ 0.000000]@0 Machine: Qualcomm Technologies, Inc. MSM 8996pro + PMI8996 MTP
7<6>[ 0.000000]@0 efi: Getting EFI parameters from FDT:
8<6>[ 0.000000]@0 efi: UEFI not found.
9<6>[ 0.000000]@0 Reserved memory: reserved region for node 'removed_regions@85800000': base 0x0000000085800000, size 48 MiB
10<6>[ 0.000000]@0 Reserved memory: reserved region for node 'peripheral_region@8ea00000': base 0x000000008ea00000, size 45 MiB
11<6>[ 0.000000]@0 Reserved memory: reserved region for node 'modem_region@88800000': base 0x0000000088800000, size 98 MiB
12<6>[ 0.000000]@0 Reserved memory: reserved region for node 'dfps_data_mem@83400000': base 0x0000000083400000, size 0 MiB
13<6>[ 0.000000]@0 Reserved memory: reserved region for node 'cont_splash_mem@83401000': base 0x0000000083401000, size 35 MiB
14<6>[ 0.000000]@0 Reserved memory: reserved region for node 'ramoops_mem@ac000000': base 0x00000000ac000000, size 2 MiB
15<6>[ 0.000000]@0 Reserved memory: reserved region for node 'param_mem@ac200000': base 0x00000000ac200000, size 1 MiB
16<6>[ 0.000000]@0 Reserved memory: reserved region for node 'bootloader_log_mem@ac300000': base 0x00000000ac300000, size 1 MiB
17<6>[ 0.000000]@0 Reserved memory: reserved region for node 'mtp_mem@ac400000': base 0x00000000ac400000, size 1 MiB
18<6>[ 0.000000]@0 Reserved memory: reserved region for node 'cont_splash_mem_hdmi@b1c00000': base 0x00000000b1c00000, size 35 MiB
19<6>[ 0.000000]@0 Removed memory: created DMA memory pool at 0x0000000085800000, size 48 MiB
20<6>[ 0.000000]@0 Reserved memory: initialized node removed_regions@85800000, compatible id removed-dma-pool
21<6>[ 0.000000]@0 Removed memory: created DMA memory pool at 0x000000008ea00000, size 45 MiB
22<6>[ 0.000000]@0 Reserved memory: initialized node peripheral_region@8ea00000, compatible id removed-dma-pool
23<6>[ 0.000000]@0 Reserved memory: allocated memory for 'adsp_region' node: base 0x00000000ff800000, size 4 MiB
24<6>[ 0.000000]@0 Reserved memory: created CMA memory pool at 0x00000000ff800000, size 4 MiB
25<6>[ 0.000000]@0 Reserved memory: initialized node adsp_region, compatible id shared-dma-pool
26<6>[ 0.000000]@0 Reserved memory: allocated memory for 'qseecom_region' node: base 0x00000000fe400000, size 20 MiB
27<6>[ 0.000000]@0 Reserved memory: created CMA memory pool at 0x00000000fe400000, size 20 MiB
28<6>[ 0.000000]@0 Reserved memory: initialized node qseecom_region, compatible id shared-dma-pool
29<6>[ 0.000000]@0 Reserved memory: allocated memory for 'secure_region' node: base 0x00000000f8800000, size 92 MiB
30<6>[ 0.000000]@0 Reserved memory: created CMA memory pool at 0x00000000f8800000, size 92 MiB
31<6>[ 0.000000]@0 Reserved memory: initialized node secure_region, compatible id shared-dma-pool
32<6>[ 0.000000]@0 Removed memory: created DMA memory pool at 0x0000000088800000, size 98 MiB
33<6>[ 0.000000]@0 Reserved memory: initialized node modem_region@88800000, compatible id removed-dma-pool
34<6>[ 0.000000]@0 cma: Reserved 32 MiB at 0x00000000f6800000
35<7>[ 0.000000]@0 On node 0 totalpages: 1514064
36<7>[ 0.000000]@0 DMA zone: 11524 pages used for memmap
37<7>[ 0.000000]@0 DMA zone: 0 pages reserved
38<7>[ 0.000000]@0 DMA zone: 737536 pages, LIFO batch:31
39<7>[ 0.000000]@0 Normal zone: 12134 pages used for memmap
40<7>[ 0.000000]@0 Normal zone: 776528 pages, LIFO batch:31
41<6>[ 0.000000]@0 psci: probing for conduit method from DT.
42<6>[ 0.000000]@0 psci: PSCIv1.0 detected in firmware.
43<6>[ 0.000000]@0 psci: Using standard PSCI v0.2 function IDs
44<6>[ 0.000000]@0 psci: Initializing psci_cpu_init
45<6>[ 0.000000]@0 psci: Initializing psci_cpu_init
46<6>[ 0.000000]@0 psci: Initializing psci_cpu_init
47<6>[ 0.000000]@0 PERCPU: Embedded 13 pages/cpu @ffffffc17d717000 s22656 r0 d30592 u53248
48<7>[ 0.000000]@0 pcpu-alloc: s22656 r0 d30592 u53248 alloc=13*4096
49<7>[ 0.000000]@0 pcpu-alloc: [0] 0 [0] 1 [0] 2 [0] 3
50<4>[ 0.000000]@0 Built 1 zonelists in Zone order, mobility grouping on. Total pages: 1490406
51<5>[ 0.000000]@0 Kernel command line: sched_enable_hmp=1 sched_enable_power_aware=1 console=ttyHSL0,115200,n8 androidboot.console=ttyHSL0 androidboot.hardware=qcom androidboot.bootdevice=624000.ufshc androidboot.selinux=permissive user_debug=31 msm_rtb.filter=0x237 ehci-hcd.park=3 lpm_levels.sleep_disabled=1 cma=32M@0-0xffffffff enforcing=0 androidboot.bootdevice=624000.ufshc androidboot.verifiedbootstate=orange androidboot.veritymode=logging androidboot.serialno=51f752ea gpt androidboot.baseband=msm mdss_mdp.panel=1:dsi:0:qcom,mdss_dsi_samsung_s6e3fa5_1080p_cmd:1:none:cfg:single_dsi fpsimd.fpsimd_settings=0 app_setting.use_app_setting=0 androidboot.mode=recovery androidboot.ftm_mode=ftm_recovery androidboot.project_name=15811 androidboot.selinux=permissive androidboot.rf_version=32 androidboot.hw_version=28 ddr_manufacture_info=Samsung ddr_row0_info=16 androidboot.pcba_number=001581306C11032000005876 androidboot.enable_dm_verity=1 androidboot.secboot=enabled androidboot.angel<6>PID hash table entries: 4096 (order: 3, 32768 bytes)
52<6>[ 0.000000]@0 Dentry cache hash table entries: 1048576 (order: 11, 8388608 bytes)
53<6>[ 0.000000]@0 Inode-cache hash table entries: 524288 (order: 10, 4194304 bytes)
54<4>[ 0.000000]@0 Memory: 5687748K/6056256K available (8620K kernel code, 1119K rwdata, 2080K rodata, 396K init, 3616K bss, 368508K reserved)
55<5>[ 0.000000]@0 Virtual kernel memory layout:
56<5> vmalloc : 0xffffff8000000000 - 0xffffffbdbfff0000 ( 246 GB)
57<5> vmemmap : 0xffffffbdc0000000 - 0xffffffbfc0000000 ( 8 GB maximum)
58<5> 0xffffffbdc0000000 - 0xffffffbdc5f65400 ( 95 MB actual)
59<5> PCI I/O : 0xffffffbffa000000 - 0xffffffbffb000000 ( 16 MB)
60<5> fixed : 0xffffffbffbdfd000 - 0xffffffbffbdff000 ( 8 KB)
61<5> modules : 0xffffffbffc000000 - 0xffffffc000000000 ( 64 MB)
62<5> memory : 0xffffffc000000000 - 0xffffffc17d950000 ( 6105 MB)
63<5> .init : 0xffffffc000af6000 - 0xffffffc000b59000 ( 396 KB)
64<5> .text : 0xffffffc000080000 - 0xffffffc000af5384 ( 10709 KB)
65<5> .data : 0xffffffc000b71000 - 0xffffffc000c88c00 ( 1119 KB)
66<6>[ 0.000000]@0 SLUB: HWalign=128, Order=0-3, MinObjects=0, CPUs=4, Nodes=1
67<6>[ 0.000000]@0 HMP scheduling enabled.
68<6>[ 0.000000]@0 Preemptible hierarchical RCU implementation.
69<6>[ 0.000000]@0 RCU dyntick-idle grace-period acceleration is enabled.
70<6>[ 0.000000]@0 NR_IRQS:64 nr_irqs:64 0
71<6>[ 0.000000]@0 CPU0: found redistributor 0 region 0:0x0000000009c00000
72<4>[ 0.000000]@0 mpm_init_irq_domain(): Cannot find irq controller for qcom,gpio-parent
73<3>[ 0.000000]@0 MPM 1 irq mapping errored -517
74<6>[ 0.000000]@0 Offload RCU callbacks from all CPUs
75<6>[ 0.000000]@0 Offload RCU callbacks from CPUs: 0-3.
76<6>[ 0.000000]@0 Architected cp15 and mmio timer(s) running at 19.20MHz (virt/virt).
77<6>[ 0.000000]@0 sched_clock: 56 bits at 19MHz, resolution 52ns, wraps every 3579139424256ns
78<6>[ 0.000015]@0 Switched to clocksource arch_sys_counter
79<6>[ 0.000623]@0 Calibrating delay loop (skipped), value calculated using timer frequency.. 38.40 BogoMIPS (lpj=192000)
80<6>[ 0.000638]@0 pid_max: default: 32768 minimum: 301
81<6>[ 0.000696]@0 Security Framework initialized
82<6>[ 0.000710]@0 SELinux: Initializing.
83<7>[ 0.000732]@0 SELinux: Starting in permissive mode
84<6>[ 0.000764]@0 Mount-cache hash table entries: 16384 (order: 5, 131072 bytes)
85<6>[ 0.000773]@0 Mountpoint-cache hash table entries: 16384 (order: 5, 131072 bytes)
86<6>[ 0.001231]@0 Initializing cgroup subsys freezer
87<4>[ 0.001491]@0 /cpus/cpu@0: Unknown CPU type
88<4>[ 0.001501]@0 /cpus/cpu@1: Unknown CPU type
89<4>[ 0.001509]@0 /cpus/cpu@100: Unknown CPU type
90<4>[ 0.001518]@0 /cpus/cpu@101: Unknown CPU type
91<6>[ 0.001526]@0 hw perfevents: enabled with arm/armv8-pmuv3 PMU driver, 9 counters available
92<6>[ 0.001542]@0 EFI services will not be available.
93<4>[ 0.009254]@0 NOHZ: local_softirq_pending 02
94<4>[ 0.010853]@0
95<4>**********************************************************
96<4>[ 0.010863]@0 ** NOTICE NOTICE NOTICE NOTICE NOTICE NOTICE NOTICE **
97<4>[ 0.010868]@0 ** **
98<4>[ 0.010872]@0 ** trace_printk() being used. Allocating extra memory. **
99<4>[ 0.010876]@0 ** **
100<4>[ 0.010880]@0 ** This means that this is a DEBUG kernel and it is **
101<4>[ 0.010884]@0 ** unsafe for produciton use. **
102<4>[ 0.010888]@0 ** **
103<4>[ 0.010892]@0 ** If you see this message and you are not debugging **
104<4>[ 0.010896]@0 ** the kernel, report this immediately to your vendor! **
105<4>[ 0.010900]@0 ** **
106<4>[ 0.010904]@0 ** NOTICE NOTICE NOTICE NOTICE NOTICE NOTICE NOTICE **
107<4>[ 0.010908]@0 **********************************************************
108<6>[ 0.012548]@0 MSM Memory Dump base table set up
109<6>[ 0.012573]@0 MSM Memory Dump apps data table set up
110<3>[ 0.012583]@0 hyp_assign_table is not functional as qcom_secure_mem is not allocated.
111<6>[ 0.012798]@0 clock-cpu-8996: configuring clocks for the perf cluster
112<6>[ 0.012936]@0 cpu_clock_8996_early_init: finished CPU clock configuration
113<6>[ 0.015436]@1 CPU1: found redistributor 1 region 0:0x0000000009c40000
114<6>[ 0.017951]@2 CPU2: found redistributor 100 region 0:0x0000000009c80000
115<6>[ 0.020288]@3 CPU3: found redistributor 101 region 0:0x0000000009cc0000
116<6>[ 0.020425]@0 Brought up 4 CPUs
117<6>[ 0.020443]@0 SMP: Total of 4 processors activated.
118<6>[ 0.023555]@0 DMI not present or invalid.
119<6>[ 0.030433]@1 pinctrl core: initialized pinctrl subsystem
120<6>[ 0.030782]@1 regulator-dummy: no parameters
121<6>[ 0.083494]@1 NET: Registered protocol family 16
122<6>[ 0.100108]@1 cpuidle: using governor ladder
123<6>[ 0.120082]@1 cpuidle: using governor menu
124<6>[ 0.140094]@1 cpuidle: using governor qcom
125<6>[ 0.140783]@1 vdso: 2 pages (1 code @ ffffffc000b79000, 1 data @ ffffffc000b78000)
126<6>[ 0.141258]@1 software IO TLB [mem 0xffc00000-0x100000000] (4MB) mapped at [ffffffc0bfc00000-ffffffc0bfffffff]
127<6>[ 0.142023]@1 DMA: preallocated 256 KiB pool for atomic allocations
128<6>[ 0.144623]@1 kernel boot_mode = normal[0]
129<6>[ 0.155882]@1 sps:sps is ready.
130<6>[ 0.156537]@1 i2c-msm-v2 75ba000.i2c: could not find pctldev for node /soc/pinctrl@01010000/i2c_12/i2c_12_active, deferring probe
131<6>[ 0.157376]@1 i2c-msm-v2 757a000.i2c: could not find pctldev for node /soc/pinctrl@01010000/i2c_6/i2c_6_active, deferring probe
132<6>[ 0.157796]@1 i2c-msm-v2 75b5000.i2c: could not find pctldev for node /soc/pinctrl@01010000/i2c_7/i2c_7_active, deferring probe
133<6>[ 0.158229]@1 i2c-msm-v2 7577000.i2c: could not find pctldev for node /soc/pinctrl@01010000/i2c_3/i2c_3_active, deferring probe
134<6>[ 0.158655]@1 i2c-msm-v2 75b6000.i2c: could not find pctldev for node /soc/pinctrl@01010000/i2c_8/i2c_8_active, deferring probe
135<4>[ 0.159123]@1 irq: no irq domain found for /soc/pinctrl@01010000 !
136<3>[ 0.160795]@1 cpu-clock-8996 6400000.qcom,cpu-clock-8996: resources init failed
137<3>[ 0.182545]@1 smd_channel_probe_now: allocation table not initialized
138<3>[ 0.182841]@1 smd_channel_probe_now: allocation table not initialized
139<3>[ 0.183107]@1 smd_channel_probe_now: allocation table not initialized
140<3>[ 0.183380]@1 smd_channel_probe_now: allocation table not initialized
141<6>[ 0.183614]@1 msm_watchdog 9830000.qcom,wdt: wdog absent resource not present
142<6>[ 0.183897]@0 msm_watchdog 9830000.qcom,wdt: MSM Watchdog Initialized
143<6>[ 0.184664]@0 msm_rpm_dev_probe: APSS-RPM communication over GLINK
144<3>[ 0.192126]@2 spmi_pmic_arb 400f000.qcom,spmi: PMIC Arb Version-2 0x20010000
145<3>[ 0.193512]@2 spmi_pmic_arb 400f000.qcom,spmi: missing property: qcom,pmic-arb-max-periph-interrupts
146<6>[ 0.197823]@2 pmi8994_s2: 400 <--> 1065 mV at 1000 mV normal idle
147<6>[ 0.198427]@2 platform 9300000.qcom,lpass: assigned reserved memory node peripheral_region@8ea00000
148<6>[ 0.198684]@2 platform ce0000.qcom,venus: assigned reserved memory node peripheral_region@8ea00000
149<6>[ 0.199087]@2 platform 1c00000.qcom,ssc: assigned reserved memory node peripheral_region@8ea00000
150<6>[ 0.199417]@2 platform 2080000.qcom,mss: assigned reserved memory node modem_region@88800000
151<6>[ 0.202028]@1 msm-thermal 70000.qcom,msm-thermal: msm_thermal:Failed reading node=/soc/qcom,msm-thermal, key=qcom,rpm-phase-resource-type err=-22. KTM continues
152<6>[ 0.202054]@1 msm-thermal 70000.qcom,msm-thermal: msm_thermal:Failed reading node=/soc/qcom,msm-thermal, key=qcom,gfx-sensor-id. err=-22. KTM continues
153<6>[ 0.202071]@1 msm-thermal 70000.qcom,msm-thermal: probe_vdd_mx:Failed reading node=/soc/qcom,msm-thermal, key=qcom,mx-restriction-temp. KTM continues
154<6>[ 0.202083]@1 msm-thermal 70000.qcom,msm-thermal: probe_psm:Failed reading node=/soc/qcom,msm-thermal, key=qcom,pmic-sw-mode-temp. err=-22. KTM continues
155<6>[ 0.202194]@1 msm_thermal:vdd_restriction_reg_init Defer regulator vdd-dig probe
156<3>[ 0.202201]@1 msm_thermal:probe_vdd_rstr Err regulator init. err:-517. KTM continues.
157<6>[ 0.202210]@1 msm-thermal 70000.qcom,msm-thermal: probe_vdd_rstr:Failed reading node=/soc/qcom,msm-thermal, key=qcom,max-freq-level. err=-517. KTM continues
158<3>[ 0.202219]@1 msm_thermal:msm_thermal_dev_probe Failed reading node=/soc/qcom,msm-thermal, key=qcom,online-hotplug-core. err:-517
159<6>[ 0.206894]@1 platform soc:qcom,msm-adsprpc-mem: assigned reserved memory node adsp_region
160<3>[ 0.210729]@0 smd_channel_probe_now: allocation table not initialized
161<6>[ 0.211075]@2 msm_rpm_trans_notify_state: glink config params: transport=(null), edge=rpm, name=rpm_requests
162<6>[ 0.211940]@2 msm_cache_erp64 6500000.qcom,cache_erp64: Registering for L1 error interrupts
163<6>[ 0.212043]@2 msm_cache_erp64 6500000.qcom,cache_erp64: Registering for L2 error interrupts
164<6>[ 0.212193]@2 msm_cache_erp64 6500000.qcom,cache_erp64: Registering for L3 error interrupts
165<6>[ 0.212435]@2 msm_m4m_erp 9a40000.qcom,m4m_erp64: Registering for M4M error interrupts
166<6>[ 0.216164]@2 console [pstore-1] enabled
167<6>[ 0.216273]@2 pstore: Registered ramoops as persistent store backend
168<6>[ 0.216283]@2 ramoops: attached 0x200000@0xac000000, ecc: 0/0
169<3>[ 0.216410]@2 XCB bootloader_log_probe
170<6>[ 0.216614]@2 bootloader_log!
171<6>[ 0.217548]@2 apc0_pwrcl_mem_acc_corner: 0 <--> 0 mV
172<6>[ 0.217891]@2 apc1_perfcl_mem_acc_corner: 0 <--> 0 mV
173<6>[ 0.218215]@2 apcc_l3_mem_acc_corner: 0 <--> 0 mV
174<6>[ 0.218539]@2 gfx_mem_acc_corner: 0 <--> 0 mV
175<6>[ 0.218916]@2 kryo0-retention: 468 <--> 892 mV at 520 mV
176<6>[ 0.219119]@2 kryo0: 468 <--> 892 mV at 754 mV
177<6>[ 0.219251]@2 kryo_regulator_probe: kryo0: default LDO functional volt=754021 uV, LDO retention volt=521789 uV, Vref func=325285 + 4466*(val), cluster-num=0
178<6>[ 0.219538]@2 kryo1-retention: 468 <--> 892 mV at 520 mV
179<6>[ 0.219742]@2 kryo1: 468 <--> 892 mV at 754 mV
180<6>[ 0.219872]@2 kryo_regulator_probe: kryo1: default LDO functional volt=754021 uV, LDO retention volt=521789 uV, Vref func=325285 + 4466*(val), cluster-num=1
181<6>[ 0.224106]@2 platform soc:qcom,kgsl-hyp: assigned reserved memory node peripheral_region@8ea00000
182<3>[ 0.225372]@2 msm_mpm_dev_probe(): Cannot get clk resource for XO: -517
183<4>[ 0.243037]@1 __of_mpm_init(): MPM driver mapping exists
184<6>[ 0.245141]@1 i2c-msm-v2 75ba000.i2c: probing driver i2c-msm-v2
185<3>[ 0.245335]@1 i2c-msm-v2 75ba000.i2c: error on clk_get(core_clk):-517
186<3>[ 0.245351]@1 i2c-msm-v2 75ba000.i2c: error probe() failed with err:-517
187<6>[ 0.245870]@1 i2c-msm-v2 757a000.i2c: probing driver i2c-msm-v2
188<3>[ 0.245970]@1 i2c-msm-v2 757a000.i2c: error on clk_get(core_clk):-517
189<3>[ 0.245983]@1 i2c-msm-v2 757a000.i2c: error probe() failed with err:-517
190<6>[ 0.246437]@1 i2c-msm-v2 75b5000.i2c: probing driver i2c-msm-v2
191<3>[ 0.246531]@1 i2c-msm-v2 75b5000.i2c: error on clk_get(core_clk):-517
192<3>[ 0.246544]@1 i2c-msm-v2 75b5000.i2c: error probe() failed with err:-517
193<6>[ 0.246988]@1 i2c-msm-v2 7577000.i2c: probing driver i2c-msm-v2
194<3>[ 0.247082]@1 i2c-msm-v2 7577000.i2c: error on clk_get(core_clk):-517
195<3>[ 0.247095]@1 i2c-msm-v2 7577000.i2c: error probe() failed with err:-517
196<6>[ 0.247509]@1 i2c-msm-v2 75b6000.i2c: probing driver i2c-msm-v2
197<3>[ 0.247601]@1 i2c-msm-v2 75b6000.i2c: error on clk_get(core_clk):-517
198<3>[ 0.247613]@1 i2c-msm-v2 75b6000.i2c: error probe() failed with err:-517
199<3>[ 0.247805]@1 cpu-clock-8996 6400000.qcom,cpu-clock-8996: resources init failed
200<6>[ 0.248724]@1 pm8994_s1_corner: 0 <--> 0 mV at 0 mV normal idle
201<6>[ 0.249191]@1 pm8994_s1_floor_corner: 0 <--> 0 mV at 0 mV normal idle
202<6>[ 0.249561]@1 pm8994_s1_corner_ao: 0 <--> 0 mV at 0 mV normal idle
203<6>[ 0.250003]@1 pm8994_s2_corner: 0 <--> 0 mV at 0 mV normal idle
204<6>[ 0.250457]@1 pm8994_s2_corner_ao: 0 <--> 0 mV at 0 mV normal idle
205<6>[ 0.250895]@1 pm8994_s3: 1300 mV normal idle
206<6>[ 0.251314]@1 pm8994_s4: 1800 mV normal idle
207<6>[ 0.251737]@1 pm8994_s5: 2150 mV normal idle
208<6>[ 0.252154]@1 pm8994_s7: 800 mV normal idle
209<6>[ 0.252580]@1 pm8994_l1: 1000 mV normal idle
210<6>[ 0.253005]@1 pm8994_l2: 1250 mV normal idle
211<6>[ 0.253745]@1 pm8994_l3: 1100 mV normal idle
212<6>[ 0.254190]@1 pm8994_l4: 1225 mV normal idle
213<6>[ 0.254601]@1 pm8994_l6: 1200 mV normal idle
214<6>[ 0.255017]@1 pm8994_l8: 1800 mV normal idle
215<6>[ 0.255430]@1 pm8994_l9: 1800 mV normal idle
216<6>[ 0.255861]@1 pm8994_l10: 1800 mV normal idle
217<6>[ 0.256263]@1 pm8994_l11: 1150 mV normal idle
218<6>[ 0.256707]@1 pm8994_l12: 1800 mV normal idle
219<6>[ 0.257574]@1 pm8994_l13: 29500 <--> 2950 mV at 2950 mV normal idle
220<6>[ 0.258019]@1 pm8994_l15: 1800 mV normal idle
221<6>[ 0.258438]@1 pm8994_l16: 2700 mV normal idle
222<6>[ 0.258865]@1 pm8994_l17: 2600 mV normal idle
223<6>[ 0.259271]@1 pm8994_l18: 3300 mV normal idle
224<6>[ 0.259703]@1 pm8994_l19: 3000 mV normal idle
225<6>[ 0.260166]@1 pm8994_l20: 2950 mV normal idle
226<6>[ 0.260615]@1 pm8994_l21: 2950 mV normal idle
227<6>[ 0.261031]@1 pm8994_l22: 3000 <--> 3300 mV at 3000 mV normal idle
228<6>[ 0.261473]@1 pm8994_l23: 2800 mV normal idle
229<6>[ 0.261880]@1 pm8994_l24: 3075 mV normal idle
230<6>[ 0.262322]@1 pm8994_l25: 1200 mV normal idle
231<6>[ 0.263112]@1 pm8994_l26_corner: 0 <--> 0 mV at 0 mV normal idle
232<6>[ 0.263509]@1 pm8994_l26_floor_corner: 0 <--> 0 mV at 0 mV normal idle
233<6>[ 0.263929]@1 pm8994_l27: 1000 <--> 1200 mV at 1030 mV normal idle
234<6>[ 0.264361]@1 pm8994_l28: 925 mV normal idle
235<6>[ 0.265105]@1 pm8994_l29: 2800 mV normal idle
236<6>[ 0.265548]@1 pm8994_l30: 1800 mV normal idle
237<6>[ 0.265976]@1 pm8994_l32: 1800 mV normal idle
238<6>[ 0.266399]@1 pm8994_lvs1: no parameters
239<6>[ 0.266772]@1 pm8994_lvs2: no parameters
240<6>[ 0.267176]@1 pmi8994_s1: 1025 mV normal idle
241<6>[ 0.267589]@1 pmi8994_boost_5v: no parameters
242<3>[ 0.267746]@1 qcom,rpm-smd-regulator soc:qcom,rpm-smd:rpm-regulator-bstb:regulator-bst: Failed to find supply parent
243<3>[ 0.267854]@1 rpm_vreg_device_probe: regulator_register failed: pmi8994_boost_5v, rc=-517
244<6>[ 0.268171]@1 pmi8994_boost_pin_ctrl: no parameters
245<3>[ 0.268258]@1 qcom,rpm-smd-regulator soc:qcom,rpm-smd:rpm-regulator-bstb:regulator-bst-pin-ctrl: Failed to find supply parent
246<3>[ 0.268350]@1 rpm_vreg_device_probe: regulator_register failed: pmi8994_boost_pin_ctrl, rc=-517
247<6>[ 0.268720]@1 pmi8994_boostbypass: 3150 <--> 3600 mV at 3150 mV normal idle
248<6>[ 0.269080]@1 pm8994_s11: 470 <--> 1140 mV at 905 mV normal idle
249<6>[ 0.269288]@1 pm8994_s11_avs_limit: 470 <--> 1140 mV
250<6>[ 0.269403]@1 spm_regulator_probe: name=pm8994_s11, range=LV, voltage=905000 uV, mode=AUTO, step rate=2400 uV/us
251<6>[ 0.270305]@1 msm-thermal 70000.qcom,msm-thermal: msm_thermal:Failed reading node=/soc/qcom,msm-thermal, key=qcom,rpm-phase-resource-type err=-22. KTM continues
252<6>[ 0.270333]@1 msm-thermal 70000.qcom,msm-thermal: msm_thermal:Failed reading node=/soc/qcom,msm-thermal, key=qcom,gfx-sensor-id. err=-22. KTM continues
253<6>[ 0.270346]@1 msm_thermal:sensor_mgr_init_threshold threshold id already initialized
254<6>[ 0.270361]@1 msm-thermal 70000.qcom,msm-thermal: probe_vdd_mx:Failed reading node=/soc/qcom,msm-thermal, key=qcom,mx-restriction-temp. KTM continues
255<6>[ 0.270376]@1 msm-thermal 70000.qcom,msm-thermal: probe_psm:Failed reading node=/soc/qcom,msm-thermal, key=qcom,pmic-sw-mode-temp. err=-22. KTM continues
256<6>[ 0.270818]@1 msm_thermal:vdd_restriction_reg_init Defer regulator vdd-gfx probe
257<3>[ 0.270835]@1 msm_thermal:probe_vdd_rstr Err regulator init. err:-517. KTM continues.
258<6>[ 0.270848]@1 msm-thermal 70000.qcom,msm-thermal: probe_vdd_rstr:Failed reading node=/soc/qcom,msm-thermal, key=qcom,max-freq-level. err=-517. KTM continues
259<3>[ 0.270860]@1 msm_thermal:msm_thermal_dev_probe Failed reading node=/soc/qcom,msm-thermal, key=qcom,online-hotplug-core. err:-517
260<3>[ 0.271422]@1 msm_mpm_dev_probe(): Cannot get clk resource for XO: -517
261<6>[ 0.271943]@1 i2c-msm-v2 75ba000.i2c: probing driver i2c-msm-v2
262<3>[ 0.272045]@1 i2c-msm-v2 75ba000.i2c: error on clk_get(core_clk):-517
263<3>[ 0.272059]@1 i2c-msm-v2 75ba000.i2c: error probe() failed with err:-517
264<6>[ 0.272510]@1 i2c-msm-v2 757a000.i2c: probing driver i2c-msm-v2
265<3>[ 0.272601]@1 i2c-msm-v2 757a000.i2c: error on clk_get(core_clk):-517
266<3>[ 0.272614]@1 i2c-msm-v2 757a000.i2c: error probe() failed with err:-517
267<6>[ 0.273059]@1 i2c-msm-v2 75b5000.i2c: probing driver i2c-msm-v2
268<3>[ 0.273149]@1 i2c-msm-v2 75b5000.i2c: error on clk_get(core_clk):-517
269<3>[ 0.273161]@1 i2c-msm-v2 75b5000.i2c: error probe() failed with err:-517
270<6>[ 0.273601]@1 i2c-msm-v2 7577000.i2c: probing driver i2c-msm-v2
271<3>[ 0.273691]@1 i2c-msm-v2 7577000.i2c: error on clk_get(core_clk):-517
272<3>[ 0.273702]@1 i2c-msm-v2 7577000.i2c: error probe() failed with err:-517
273<6>[ 0.274106]@1 i2c-msm-v2 75b6000.i2c: probing driver i2c-msm-v2
274<3>[ 0.274195]@1 i2c-msm-v2 75b6000.i2c: error on clk_get(core_clk):-517
275<3>[ 0.274207]@1 i2c-msm-v2 75b6000.i2c: error probe() failed with err:-517
276<3>[ 0.274546]@1 cpu-clock-8996 6400000.qcom,cpu-clock-8996: resources init failed
277<6>[ 0.293177]@1 qcom,gcc-8996 300000.qcom,gcc: Registered GCC clocks.
278<6>[ 0.294257]@1 vfe0_clk_src: set OPP pair(75000000 Hz: 3 uV) on a10000.qcom,vfe0
279<6>[ 0.294283]@1 vfe0_clk_src: set OPP pair(320000000 Hz: 5 uV) on a10000.qcom,vfe0
280<6>[ 0.294296]@1 vfe0_clk_src: set OPP pair(600000000 Hz: 7 uV) on a10000.qcom,vfe0
281<6>[ 0.294653]@1 vfe1_clk_src: set OPP pair(75000000 Hz: 3 uV) on a14000.qcom,vfe1
282<6>[ 0.294677]@1 vfe1_clk_src: set OPP pair(320000000 Hz: 5 uV) on a14000.qcom,vfe1
283<6>[ 0.294689]@1 vfe1_clk_src: set OPP pair(600000000 Hz: 7 uV) on a14000.qcom,vfe1
284<6>[ 0.295063]@1 cpp_clk_src: set OPP pair(100000000 Hz: 3 uV) on a04000.qcom,cpp
285<6>[ 0.295080]@1 cpp_clk_src: set OPP pair(480000000 Hz: 5 uV) on a04000.qcom,cpp
286<6>[ 0.295090]@1 cpp_clk_src: set OPP pair(640000000 Hz: 7 uV) on a04000.qcom,cpp
287<6>[ 0.304021]@1 qcom,mmsscc-8996 8c0000.qcom,mmsscc: Registered MMSS clocks.
288<6>[ 0.305688]@1 pmi8994_boost_5v: no parameters
289<3>[ 0.305840]@1 qcom,rpm-smd-regulator soc:qcom,rpm-smd:rpm-regulator-bstb:regulator-bst: Failed to find supply parent
290<3>[ 0.305942]@1 rpm_vreg_device_probe: regulator_register failed: pmi8994_boost_5v, rc=-517
291<6>[ 0.306167]@1 pmi8994_boost_pin_ctrl: no parameters
292<3>[ 0.306243]@1 qcom,rpm-smd-regulator soc:qcom,rpm-smd:rpm-regulator-bstb:regulator-bst-pin-ctrl: Failed to find supply parent
293<3>[ 0.306333]@1 rpm_vreg_device_probe: regulator_register failed: pmi8994_boost_pin_ctrl, rc=-517
294<6>[ 0.307130]@1 msm-thermal 70000.qcom,msm-thermal: msm_thermal:Failed reading node=/soc/qcom,msm-thermal, key=qcom,rpm-phase-resource-type err=-22. KTM continues
295<6>[ 0.307155]@1 msm-thermal 70000.qcom,msm-thermal: msm_thermal:Failed reading node=/soc/qcom,msm-thermal, key=qcom,gfx-sensor-id. err=-22. KTM continues
296<6>[ 0.307168]@1 msm_thermal:sensor_mgr_init_threshold threshold id already initialized
297<6>[ 0.307182]@1 msm-thermal 70000.qcom,msm-thermal: probe_vdd_mx:Failed reading node=/soc/qcom,msm-thermal, key=qcom,mx-restriction-temp. KTM continues
298<6>[ 0.307196]@1 msm-thermal 70000.qcom,msm-thermal: probe_psm:Failed reading node=/soc/qcom,msm-thermal, key=qcom,pmic-sw-mode-temp. err=-22. KTM continues
299<6>[ 0.307450]@1 msm_thermal:vdd_restriction_reg_init Defer regulator vdd-gfx probe
300<3>[ 0.307463]@1 msm_thermal:probe_vdd_rstr Err regulator init. err:-517. KTM continues.
301<6>[ 0.307474]@1 msm-thermal 70000.qcom,msm-thermal: probe_vdd_rstr:Failed reading node=/soc/qcom,msm-thermal, key=qcom,max-freq-level. err=-517. KTM continues
302<3>[ 0.307486]@1 msm_thermal:msm_thermal_dev_probe Failed reading node=/soc/qcom,msm-thermal, key=qcom,online-hotplug-core. err:-517
303<6>[ 0.308190]@1 cpr3_msm8996_hmss_read_fuse_data: apc0_pwrcl_corner: speed bin = 0
304<6>[ 0.308211]@1 cpr3_msm8996_hmss_read_fuse_data: apc0_pwrcl_corner: CPR fusing revision = 2
305<6>[ 0.308221]@1 cpr3_msm8996_hmss_read_fuse_data: apc0_pwrcl_corner: using redundant fuses = N
306<6>[ 0.308232]@1 cpr3_msm8996_hmss_read_fuse_data: apc0_pwrcl_corner: CPR limitation = none
307<6>[ 0.308241]@1 cpr3_msm8996_hmss_read_fuse_data: apc0_pwrcl_corner: CPR partial binning limitation = none
308<6>[ 0.308252]@1 cpr3_msm8996_hmss_read_fuse_data: apc0_pwrcl_corner: Retention voltage fuses: VDD_MX = 4, VDD_APCC = 4
309<6>[ 0.308500]@1 cpr3_hmss_kvreg_init: apc0_pwrcl_corner: LDO min headroom=80000 uV, LDO max headroom=470000 uV, LDO adj=0 uV, LDO mode=allowed, LDO retention=490000 uV
310<6>[ 0.308726]@1 cpr3_msm8996_hmss_calculate_open_loop_voltages: apc0_pwrcl_corner: fused MinSVS: open-loop= 565000 uV
311<6>[ 0.308741]@1 cpr3_msm8996_hmss_calculate_open_loop_voltages: apc0_pwrcl_corner: fused SVS: open-loop= 645000 uV
312<6>[ 0.308750]@1 cpr3_msm8996_hmss_calculate_open_loop_voltages: apc0_pwrcl_corner: fused NOM: open-loop= 735000 uV
313<6>[ 0.308759]@1 cpr3_msm8996_hmss_calculate_open_loop_voltages: apc0_pwrcl_corner: fused TURBO: open-loop= 890000 uV
314<6>[ 0.308857]@1 cpr3_msm8996_hmss_calculate_target_quotients: apc0_pwrcl_corner: fused MinSVS: quot[ 7]= 273
315<6>[ 0.308867]@1 cpr3_msm8996_hmss_calculate_target_quotients: apc0_pwrcl_corner: fused SVS: quot[ 7]= 410, quot_offset[ 7]= 100
316<6>[ 0.308878]@1 cpr3_msm8996_hmss_calculate_target_quotients: apc0_pwrcl_corner: fused NOM: quot[ 7]= 597, quot_offset[ 7]= 185
317<6>[ 0.308888]@1 cpr3_msm8996_hmss_calculate_target_quotients: apc0_pwrcl_corner: fused TURBO: quot[ 7]= 916, quot_offset[ 7]= 315
318<6>[ 0.309015]@1 cpr3_msm8996_hmss_read_fuse_data: apc0_cbf_corner: speed bin = 0
319<6>[ 0.309025]@1 cpr3_msm8996_hmss_read_fuse_data: apc0_cbf_corner: CPR fusing revision = 2
320<6>[ 0.309034]@1 cpr3_msm8996_hmss_read_fuse_data: apc0_cbf_corner: using redundant fuses = N
321<6>[ 0.309044]@1 cpr3_msm8996_hmss_read_fuse_data: apc0_cbf_corner: CPR limitation = none
322<6>[ 0.309053]@1 cpr3_msm8996_hmss_read_fuse_data: apc0_cbf_corner: CPR partial binning limitation = none
323<6>[ 0.309064]@1 cpr3_msm8996_hmss_read_fuse_data: apc0_cbf_corner: Retention voltage fuses: VDD_MX = 4, VDD_APCC = 4
324<6>[ 0.309205]@1 cpr3_msm8996_hmss_calculate_open_loop_voltages: apc0_cbf_corner: fused MinSVS: open-loop= 565000 uV
325<6>[ 0.309215]@1 cpr3_msm8996_hmss_calculate_open_loop_voltages: apc0_cbf_corner: fused SVS: open-loop= 645000 uV
326<6>[ 0.309224]@1 cpr3_msm8996_hmss_calculate_open_loop_voltages: apc0_cbf_corner: fused NOM: open-loop= 735000 uV
327<6>[ 0.309232]@1 cpr3_msm8996_hmss_calculate_open_loop_voltages: apc0_cbf_corner: fused TURBO: open-loop= 890000 uV
328<6>[ 0.309244]@1 cpr3_msm8996_hmss_calculate_open_loop_voltages: apc0_cbf_corner: fused MinSVS: CBF offset open-loop= 535000 uV
329<6>[ 0.309253]@1 cpr3_msm8996_hmss_calculate_open_loop_voltages: apc0_cbf_corner: fused LowSVS: CBF offset open-loop= 635000 uV
330<6>[ 0.309262]@1 cpr3_msm8996_hmss_calculate_open_loop_voltages: apc0_cbf_corner: fused SVS: CBF offset open-loop= 645000 uV
331<6>[ 0.309270]@1 cpr3_msm8996_hmss_calculate_open_loop_voltages: apc0_cbf_corner: fused NOM: CBF offset open-loop= 755000 uV
332<6>[ 0.309279]@1 cpr3_msm8996_hmss_calculate_open_loop_voltages: apc0_cbf_corner: fused TURBO: CBF offset open-loop= 890000 uV
333<6>[ 0.309323]@1 cpr3_msm8996_hmss_calculate_target_quotients: apc0_cbf_corner: fused MinSVS: quot[ 7]= 273
334<6>[ 0.309332]@1 cpr3_msm8996_hmss_calculate_target_quotients: apc0_cbf_corner: fused SVS: quot[ 7]= 410, quot_offset[ 7]= 100
335<6>[ 0.309342]@1 cpr3_msm8996_hmss_calculate_target_quotients: apc0_cbf_corner: fused NOM: quot[ 7]= 597, quot_offset[ 7]= 185
336<6>[ 0.309351]@1 cpr3_msm8996_hmss_calculate_target_quotients: apc0_cbf_corner: fused TURBO: quot[ 7]= 916, quot_offset[ 7]= 315
337<6>[ 0.309454]@1 cpr3_msm8996_hmss_read_fuse_data: apc1_corner: speed bin = 0
338<6>[ 0.309464]@1 cpr3_msm8996_hmss_read_fuse_data: apc1_corner: CPR fusing revision = 2
339<6>[ 0.309474]@1 cpr3_msm8996_hmss_read_fuse_data: apc1_corner: using redundant fuses = N
340<6>[ 0.309483]@1 cpr3_msm8996_hmss_read_fuse_data: apc1_corner: CPR limitation = none
341<6>[ 0.309492]@1 cpr3_msm8996_hmss_read_fuse_data: apc1_corner: CPR partial binning limitation = none
342<6>[ 0.309502]@1 cpr3_msm8996_hmss_read_fuse_data: apc1_corner: Retention voltage fuses: VDD_MX = 4, VDD_APCC = 4
343<6>[ 0.309766]@1 cpr3_hmss_kvreg_init: apc1_corner: LDO min headroom=130000 uV, LDO max headroom=470000 uV, LDO adj=0 uV, LDO mode=allowed, LDO retention=490000 uV
344<6>[ 0.310000]@1 cpr3_msm8996_hmss_calculate_open_loop_voltages: apc1_corner: fused MinSVS: open-loop= 565000 uV
345<6>[ 0.310060]@1 cpr3_msm8996_hmss_calculate_open_loop_voltages: apc1_corner: fused SVS: open-loop= 655000 uV
346<6>[ 0.310072]@1 cpr3_msm8996_hmss_calculate_open_loop_voltages: apc1_corner: fused NOM: open-loop= 745000 uV
347<6>[ 0.310081]@1 cpr3_msm8996_hmss_calculate_open_loop_voltages: apc1_corner: fused TURBO: open-loop=1050000 uV
348<6>[ 0.310204]@1 cpr3_msm8996_hmss_calculate_target_quotients: apc1_corner: fused MinSVS: quot[ 7]= 273
349<6>[ 0.310213]@1 cpr3_msm8996_hmss_calculate_target_quotients: apc1_corner: fused SVS: quot[ 7]= 432, quot_offset[ 7]= 115
350<6>[ 0.310224]@1 cpr3_msm8996_hmss_calculate_target_quotients: apc1_corner: fused NOM: quot[ 7]= 618, quot_offset[ 7]= 185
351<6>[ 0.310234]@1 cpr3_msm8996_hmss_calculate_target_quotients: apc1_corner: fused TURBO: quot[ 7]=1190, quot_offset[ 7]= 570
352<6>[ 0.310744]@1 cpr3_regulator_init_ctrl: apcc: Default CPR mode = SW closed-loop
353<6>apc0_pwrcl_corner: 0 <--> 0 mV at 0 mV
354<6>[ 0.311131]@1 apc0_cbf_corner: 0 <--> 0 mV at 0 mV
355<6>[ 0.314070]@1 cpr3_regulator_measure_aging: apcc: average quotient delta=0 (count=10)
356<6>[ 0.314104]@1 cpr3_regulator_aging_adjust: apcc: aging measurement successful; aging reference adjustment voltage=3125 uV
357<6>[ 0.314459]@1 apc1_corner: 0 <--> 0 mV at 0 mV
358<6>[ 0.316062]@1 cpr3_msm8996_mmss_read_fuse_data: gfx_corner: speed bin = 0
359<6>[ 0.316083]@1 cpr3_msm8996_mmss_read_fuse_data: gfx_corner: CPR fusing revision = 1
360<6>[ 0.316094]@1 cpr3_msm8996_mmss_read_fuse_data: gfx_corner: CPR limitation = none
361<6>[ 0.316398]@1 cpr3_msm8996_mmss_calculate_open_loop_voltages: gfx_corner: fuse_corner[0] open-loop= 630000 uV
362<6>[ 0.316409]@1 cpr3_msm8996_mmss_calculate_open_loop_voltages: gfx_corner: fuse_corner[1] open-loop= 675000 uV
363<6>[ 0.316418]@1 cpr3_msm8996_mmss_calculate_open_loop_voltages: gfx_corner: fuse_corner[2] open-loop= 805000 uV
364<6>[ 0.316427]@1 cpr3_msm8996_mmss_calculate_open_loop_voltages: gfx_corner: fuse_corner[3] open-loop= 935000 uV
365<6>[ 0.316612]@1 cpr3_regulator_init_ctrl: gfx: Default CPR mode = closed-loop
366<6>gfx_corner: 0 <--> 0 mV at 0 mV
367<6>[ 0.318254]@3 i2c-msm-v2 75ba000.i2c: probing driver i2c-msm-v2
368<3>[ 0.318355]@3 AXI: msm_bus_scale_register_client(): msm_bus_scale_register_client: Bus driver not ready.
369<6>i2c-msm-v2 75ba000.i2c: msm_bus_scale_register_client(mstr-id:84):0 (not a problem)
370<6>i2c-msm-v2 757a000.i2c: probing driver i2c-msm-v2
371<3>[ 0.319276]@3 AXI: msm_bus_scale_register_client(): msm_bus_scale_register_client: Bus driver not ready.
372<6>i2c-msm-v2 757a000.i2c: msm_bus_scale_register_client(mstr-id:86):0 (not a problem)
373<6>i2c-msm-v2 75b5000.i2c: probing driver i2c-msm-v2
374<3>[ 0.320248]@3 AXI: msm_bus_scale_register_client(): msm_bus_scale_register_client: Bus driver not ready.
375<6>i2c-msm-v2 75b5000.i2c: msm_bus_scale_register_client(mstr-id:84):0 (not a problem)
376<6>i2c-msm-v2 7577000.i2c: probing driver i2c-msm-v2
377<3>[ 0.321179]@3 AXI: msm_bus_scale_register_client(): msm_bus_scale_register_client: Bus driver not ready.
378<6>i2c-msm-v2 7577000.i2c: msm_bus_scale_register_client(mstr-id:86):0 (not a problem)
379<6>i2c-msm-v2 75b6000.i2c: probing driver i2c-msm-v2
380<3>[ 0.321916]@3 AXI: msm_bus_scale_register_client(): msm_bus_scale_register_client: Bus driver not ready.
381<6>i2c-msm-v2 75b6000.i2c: msm_bus_scale_register_client(mstr-id:84):0 (not a problem)
382<6>cpu-clock-8996 6400000.qcom,cpu-clock-8996: using perf/pwr/cbf speed bin 0 and pvs_ver 0
383<6>[ 0.324934]@3 clock-cpu-8996: set OPP pair (307200000 Hz, 615000 uv) on cpu0
384<6>[ 0.324985]@3 clock-cpu-8996: set OPP pair (2188800000 Hz, 1075000 uv) on cpu0
385<6>[ 0.325003]@3 clock-cpu-8996: set OPP pair (307200000 Hz, 615000 uv) on cpu1
386<6>[ 0.325041]@3 clock-cpu-8996: set OPP pair (2188800000 Hz, 1075000 uv) on cpu1
387<6>[ 0.325058]@3 clock-cpu-8996: set OPP pair (307200000 Hz, 615000 uv) on cpu2
388<6>[ 0.325118]@3 clock-cpu-8996: set OPP pair (2342400000 Hz, 1085000 uv) on cpu2
389<6>[ 0.325135]@3 clock-cpu-8996: set OPP pair (307200000 Hz, 615000 uv) on cpu3
390<6>[ 0.325189]@3 clock-cpu-8996: set OPP pair (2342400000 Hz, 1085000 uv) on cpu3
391<6>[ 0.325317]@3 clock-cpu-8996: set OPP pair (192000000 Hz, 600000 uv) on soc:qcom,m4m
392<6>[ 0.325360]@3 clock-cpu-8996: set OPP pair (1593600000 Hz, 955000 uv) on soc:qcom,m4m
393<6>[ 0.325697]@3 qcom,gpucc-8996 8c0000.qcom,gpucc: using speed bin 0
394<6>[ 0.326057]@3 gfx3d_clk_src_v2: set OPP pair(133000000 Hz: 560000 uV) on b00000.qcom,kgsl-3d0
395<6>[ 0.326096]@3 gfx3d_clk_src_v2: set OPP pair(652800000 Hz: 910000 uV) on b00000.qcom,kgsl-3d0
396<6>[ 0.327503]@3 qcom,gpucc-8996 8c0000.qcom,gpucc: Registered GPU clocks.
397<6>[ 0.327723]@3 pmi8994_boost_5v: no parameters
398<3>[ 0.327789]@3 qcom,rpm-smd-regulator soc:qcom,rpm-smd:rpm-regulator-bstb:regulator-bst: Failed to find supply parent
399<3>[ 0.327884]@3 rpm_vreg_device_probe: regulator_register failed: pmi8994_boost_5v, rc=-517
400<6>[ 0.328079]@3 pmi8994_boost_pin_ctrl: no parameters
401<3>[ 0.328127]@3 qcom,rpm-smd-regulator soc:qcom,rpm-smd:rpm-regulator-bstb:regulator-bst-pin-ctrl: Failed to find supply parent
402<3>[ 0.328213]@3 rpm_vreg_device_probe: regulator_register failed: pmi8994_boost_pin_ctrl, rc=-517
403<6>[ 0.328953]@3 msm-thermal 70000.qcom,msm-thermal: msm_thermal:Failed reading node=/soc/qcom,msm-thermal, key=qcom,rpm-phase-resource-type err=-22. KTM continues
404<6>[ 0.328973]@3 msm-thermal 70000.qcom,msm-thermal: msm_thermal:Failed reading node=/soc/qcom,msm-thermal, key=qcom,gfx-sensor-id. err=-22. KTM continues
405<6>[ 0.328986]@3 msm_thermal:sensor_mgr_init_threshold threshold id already initialized
406<6>[ 0.329000]@3 msm-thermal 70000.qcom,msm-thermal: probe_vdd_mx:Failed reading node=/soc/qcom,msm-thermal, key=qcom,mx-restriction-temp. KTM continues
407<6>[ 0.329015]@3 msm-thermal 70000.qcom,msm-thermal: probe_psm:Failed reading node=/soc/qcom,msm-thermal, key=qcom,pmic-sw-mode-temp. err=-22. KTM continues
408<3>[ 0.329286]@3 msm_thermal:update_cpu_freq Unable to update policy for cpu:0. err:-19
409<3>[ 0.329302]@3 msm_thermal:update_cpu_freq Unable to update policy for cpu:2. err:-19
410<3>[ 0.329313]@3 msm_thermal:update_cpu_freq Unable to update policy for cpu:2. err:-19
411<3>[ 0.329332]@3 msm-thermal 70000.qcom,msm-thermal: probe_ocr:Failed reading node=/soc/qcom,msm-thermal, key=qcom,pmic-opt-curr-temp err:-22. KTM continues
412<6>[ 0.330250]@2 pmi8994_boost_5v: no parameters
413<3>[ 0.330324]@2 qcom,rpm-smd-regulator soc:qcom,rpm-smd:rpm-regulator-bstb:regulator-bst: Failed to find supply parent
414<3>[ 0.330421]@2 rpm_vreg_device_probe: regulator_register failed: pmi8994_boost_5v, rc=-517
415<3>[ 0.330429]@3 msm_thermal:update_cpu_freq Unable to update policy for cpu:0. err:-19
416<3>[ 0.330439]@3 msm_thermal:update_cpu_freq Unable to update policy for cpu:2. err:-19
417<3>[ 0.330452]@3 msm_thermal:update_cpu_freq Unable to update policy for cpu:2. err:-19
418<6>[ 0.330639]@2 pmi8994_boost_pin_ctrl: no parameters
419<3>[ 0.330691]@2 qcom,rpm-smd-regulator soc:qcom,rpm-smd:rpm-regulator-bstb:regulator-bst-pin-ctrl: Failed to find supply parent
420<3>[ 0.330778]@2 rpm_vreg_device_probe: regulator_register failed: pmi8994_boost_pin_ctrl, rc=-517
421<6>[ 0.373885]@3 KPI: Bootloader start count = 31128
422<6>[ 0.373904]@3 KPI: Bootloader end count = 258633
423<6>[ 0.373912]@3 KPI: Bootloader display count = 243651
424<6>[ 0.373920]@3 KPI: Bootloader load kernel count = 2127
425<6>[ 0.373930]@3 KPI: Kernel MPM timestamp = 284218
426<6>[ 0.373937]@3 KPI: Kernel MPM Clock frequency = 32768
427<6>[ 0.373952]@3 socinfo_print: v0.11, id=305, ver=1.1, raw_id=95, raw_ver=1, hw_plat=8, hw_plat_ver=65536
428<6> accessory_chip=0, hw_plat_subtype=0, pmic_model=65545, pmic_die_revision=131072 foundry_id=3 serial_number=2606472571 num_pmics=2
429<3>[ 0.373978]@3 init_project_info: project_name: 15811 hw_version: 28 rf_v1: 32 rf_v2: 1: rf_v3: 0 paltform_id:305
430<3>[ 0.373992]@3 init_project_info: aboard_version: 1
431<3>[ 0.374867]@3 op_rf_cable_probe: ftm_mode FOUND! use 1 always
432<3>[ 0.374883]@3 modify_rf_cable_smem_info: rf_cable: 1
433<3>[ 0.374891]@3 op_rf_cable_probe: probe ok!
434<6>[ 0.375240]@3 gdsc_mmagic_bimc: no parameters
435<6>[ 0.375827]@3 rome_vreg: no parameters
436<6>[ 0.376075]@3 wlan_en_vreg: no parameters
437<6>[ 0.376632]@3 vgaarb: loaded
438<5>[ 0.376852]@3 SCSI subsystem initialized
439<6>[ 0.377019]@3 usbcore: registered new interface driver usbfs
440<6>[ 0.377060]@3 usbcore: registered new interface driver hub
441<6>[ 0.377212]@3 usbcore: registered new device driver usb
442<4>[ 0.377584]@3 soc:usb_nop_phy supply vcc not found, using dummy regulator
443<6>[ 0.410390]@3 cpufreq: driver msm up and running
444<6>[ 0.410922]@3 platform soc:qcom,ion:qcom,ion-heap@22: assigned reserved memory node adsp_region
445<6>[ 0.411038]@3 platform soc:qcom,ion:qcom,ion-heap@27: assigned reserved memory node qseecom_region
446<6>[ 0.411143]@3 platform soc:qcom,ion:qcom,ion-heap@10: assigned reserved memory node secure_region
447<6>[ 0.411329]@3 ION heap system created
448<3>[ 0.411417]@3 ion_heap_create: Heap type is disabled: 1
449<3>[ 0.411422]@3 msm_ion_heap_create: error creating heap kmalloc type 1 base 0x0000000000000000 size 0
450<6>[ 0.411428]@3 ION heap adsp created at 0x00000000ff800000 with size 400000
451<6>[ 0.411440]@3 ION heap qsecom created at 0x00000000fe400000 with size 1400000
452<6>[ 0.411448]@3 ION heap secure_display created at 0x00000000f8800000 with size 5c00000
453<6>[ 0.411456]@3 ION heap secure_heap created
454<3>[ 0.412092]@3 msm_bus_fabric_init_driver
455<3>[ 0.414666]@3 msm-bus-type fab-a0noc: Error: Failed to get regulator bus-gdsc:-517
456<3>[ 0.414679]@3 msm-bus-type fab-a0noc: Error: Failed to get regulator bus-a-gdsc:-517
457<3>[ 0.417101]@3 msm-bus-type slv-vmem-cfg: Error: Failed to get regulator node-gdsc:-517
458<3>[ 0.417492]@3 msm-bus-type slv-vmem: Error: Failed to get regulator node-gdsc:-517
459<3>[ 0.422346]@3 msm-bus-type fab-a0noc: Error: Failed to get regulator aggre0-snoc-axi-no-rate:-517
460<3>[ 0.422358]@3 msm-bus-type fab-a0noc: Error: Failed to get regulator aggre0-snoc-axi-no-rate:-517
461<3>[ 0.422367]@3 msm-bus-type fab-a0noc: Error: Failed to get regulator aggre0-snoc-axi-no-rate:-517
462<3>[ 0.422474]@3 msm-bus-type fab-mnoc: Error: Failed to get regulator mmagic-mdss-axi-no-rate:-517
463<3>[ 0.422494]@3 msm-bus-type fab-mnoc: Error: Failed to get regulator mmagic-mdss-axi-no-rate:-517
464<3>[ 0.422512]@3 msm-bus-type fab-mnoc: Error: Failed to get regulator mmagic-mdss-axi-no-rate:-517
465<3>[ 0.422530]@3 msm-bus-type fab-mnoc: Error: Failed to get regulator mmagic-mdss-axi-no-rate:-517
466<3>[ 0.422548]@3 msm-bus-type fab-mnoc: Error: Failed to get regulator mmagic-mdss-axi-no-rate:-517
467<3>[ 0.422566]@3 msm-bus-type fab-mnoc: Error: Failed to get regulator mmagic-mdss-axi-no-rate:-517
468<3>[ 0.422584]@3 msm-bus-type fab-mnoc: Error: Failed to get regulator mmagic-mdss-axi-no-rate:-517
469<6>[ 0.423833]@3 qcom,qpnp-power-on qpnp-power-on-2: PMIC@SID0 Power-on reason: Triggered from Hard Reset[0x21] and 'cold' boot
470<6>[ 0.423844]@3 qcom,qpnp-power-on qpnp-power-on-2: PMIC@SID0 Power-on reason: Triggered from PON1 (secondary PMIC)[0x21] and 'cold' boot
471<6>[ 0.423860]@3 qcom,qpnp-power-on qpnp-power-on-2: PMIC@SID0: Power-off reason: Triggered from PS_HOLD (PS_HOLD/MSM controlled shutdown)[0x2]
472<6>[ 0.423969]@3 input: qpnp_pon as /devices/virtual/input/input0
473<6>[ 0.424449]@3 pon_spare_reg: no parameters
474<6>[ 0.424496]@3 qcom,qpnp-power-on qpnp-power-on-11: No PON config. specified
475<6>[ 0.424551]@3 qcom,qpnp-power-on qpnp-power-on-11: PMIC@SID2 Power-on reason: Triggered from Hard Reset[0x31] and 'cold' boot
476<6>[ 0.424556]@3 qcom,qpnp-power-on qpnp-power-on-11: PMIC@SID2 Power-on reason: Triggered from USB (USB charger insertion)[0x31] and 'cold' boot
477<6>[ 0.424561]@3 qcom,qpnp-power-on qpnp-power-on-11: PMIC@SID2 Power-on reason: Triggered from PON1 (secondary PMIC)[0x31] and 'cold' boot
478<6>[ 0.424576]@3 qcom,qpnp-power-on qpnp-power-on-11: PMIC@SID2: Power-off reason: Triggered from PS_HOLD (PS_HOLD/MSM controlled shutdown)[0x2]
479<6>[ 0.424720]@3 PMIC@SID0: PM8994 v2.0 options: 0, 0, 2, 2
480<6>[ 0.424804]@3 PMIC@SID2: PMI8996 v1.1 options: 0, 0, 0, 0
481<3>[ 0.425812]@3 ipa ipa2_uc_state_check:296 uC interface not initialized
482<3>[ 0.425825]@3 ipa ipa_sps_irq_control_all:938 EP (2) not allocated.
483<3>[ 0.425830]@3 ipa ipa_sps_irq_control_all:938 EP (5) not allocated.
484<6>[ 0.427791]@3 sps:BAM 0x0000000000684000 is registered.
485<3>ipa ipa2_uc_state_check:296 uC interface not initialized
486<6>[ 0.428717]@3 sps:BAM 0x0000000000684000 (va:0xffffff80020c0000) enabled: ver:0x27, number of pipes:20
487<3>[ 0.430388]@3 ipa ipa2_uc_state_check:296 uC interface not initialized
488<3>[ 0.435331]@3 ipa ipa2_uc_state_check:296 uC interface not initialized
489<6>[ 0.436920]@3 IPA driver initialization was successful.
490<6>[ 0.438119]@3 gdsc_mmagic_video: no parameters
491<6>[ 0.438306]@3 gdsc_mmagic_mdss: no parameters
492<6>[ 0.438463]@3 gdsc_mmagic_camss: no parameters
493<6>[ 0.438650]@3 gdsc_venus: no parameters
494<6>[ 0.438668]@3 gdsc_venus: supplied by gdsc_mmagic_video
495<6>[ 0.438839]@3 gdsc_venus_core0: fast normal
496<6>[ 0.438969]@3 gdsc_venus_core1: fast normal
497<6>[ 0.439125]@3 gdsc_camss_top: no parameters
498<6>[ 0.439142]@3 gdsc_camss_top: supplied by gdsc_mmagic_camss
499<6>[ 0.439294]@3 gdsc_vfe0: no parameters
500<6>[ 0.439313]@3 gdsc_vfe0: supplied by gdsc_camss_top
501<6>[ 0.439463]@3 gdsc_vfe1: no parameters
502<6>[ 0.439479]@3 gdsc_vfe1: supplied by gdsc_camss_top
503<6>[ 0.439639]@3 gdsc_mdss: no parameters
504<6>[ 0.439656]@3 gdsc_mdss: supplied by gdsc_mmagic_mdss
505<6>[ 0.439886]@3 gdsc_jpeg: no parameters
506<6>[ 0.439903]@3 gdsc_jpeg: supplied by gdsc_camss_top
507<6>[ 0.440177]@3 gdsc_cpp: no parameters
508<6>[ 0.440202]@3 gdsc_cpp: supplied by gdsc_camss_top
509<6>[ 0.440343]@3 gdsc_pcie_0: no parameters
510<6>[ 0.440475]@3 gdsc_pcie_1: no parameters
511<6>[ 0.440595]@3 gdsc_pcie_2: no parameters
512<6>[ 0.440733]@3 gdsc_usb30: no parameters
513<6>[ 0.440862]@3 gdsc_ufs: no parameters
514<6>[ 0.441023]@3 gdsc_fd: no parameters
515<6>[ 0.441041]@3 gdsc_fd: supplied by gdsc_camss_top
516<6>[ 0.441183]@3 gdsc_gpu: no parameters
517<6>[ 0.441358]@3 gdsc_gpu_gx: no parameters
518<6>[ 0.441720]@3 gdsc_gpu_gx: supplied by gfx_corner
519<6>[ 0.441872]@3 gdsc_hlos1_vote_aggre0_noc: no parameters
520<6>[ 0.442005]@3 gdsc_hlos1_vote_lpass_adsp: no parameters
521<6>[ 0.442134]@3 gdsc_hlos1_vote_lpass_core: no parameters
522<6>[ 0.442262]@3 gdsc_aggre0_noc: no parameters
523<6>[ 0.444409]@3 mdss_pll_probe: MDSS pll label = MDSS DSI 0 PLL
524<6>[ 0.444428]@3 mdss_pll_probe: mdss_pll_probe: label=MDSS DSI 0 PLL PLL SSC enabled
525<6>[ 0.446189]@3 dsi_pll_clock_register_8996: Registered DSI PLL ndx=0 clocks successfully
526<6>[ 0.446274]@3 mdss_pll_probe: MDSS pll label = MDSS DSI 1 PLL
527<6>[ 0.446284]@3 mdss_pll_probe: mdss_pll_probe: label=MDSS DSI 1 PLL PLL SSC enabled
528<3>[ 0.447365]@3 pll_is_pll_locked_8996: DSI PLL ndx=1 status=0 failed to Lock
529<6>[ 0.447811]@3 dsi_pll_clock_register_8996: Registered DSI PLL ndx=1 clocks successfully
530<6>[ 0.554937]@3 get_param_by_index_and_offset[75] sid_index = 12 offset = 0 buf = ffffffc000fff780 length = 420
531<6>[ 0.555059]@3 Advanced Linux Sound Architecture Driver Initialized.
532<1>[ 0.555583]@3 pcie:pcie_init.
533<4>[ 0.558839]@3 600000.qcom,pcie supply vreg-3.3 not found, using dummy regulator
534<3>[ 0.561596]@3 msm_pcie_get_resources: PCIe: RC0 can't get tcsr resource.
535<6>[ 0.564309]@1 pmi8994_boost_5v: no parameters
536<6>[ 0.564586]@1 pmi8994_boost_5v: supplied by pon_spare_reg
537<6>[ 0.565090]@1 pmi8994_boost_pin_ctrl: no parameters
538<6>[ 0.565304]@1 pmi8994_boost_pin_ctrl: supplied by pon_spare_reg
539<6>[ 0.565844]@3 Switched to clocksource arch_sys_counter
540<6>[ 0.566724]@3 bcl_peripheral:bcl_perph_init BCL Initialized
541<6>[ 0.570821]@3 NET: Registered protocol family 2
542<6>[ 0.571321]@3 TCP established hash table entries: 65536 (order: 7, 524288 bytes)
543<6>[ 0.571434]@3 TCP bind hash table entries: 65536 (order: 8, 1048576 bytes)
544<6>[ 0.572381]@3 TCP: Hash tables configured (established 65536 bind 65536)
545<6>[ 0.572560]@3 TCP: reno registered
546<6>[ 0.572604]@3 UDP hash table entries: 4096 (order: 5, 131072 bytes)
547<6>[ 0.572692]@3 UDP-Lite hash table entries: 4096 (order: 5, 131072 bytes)
548<6>[ 0.573072]@3 NET: Registered protocol family 1
549<7>[ 0.573129]@3 PCI: CLS 0 bytes, default 128
550<6>[ 0.573670]@3 Trying to unpack rootfs image as initramfs...
551<6>[ 0.739793]@3 Freeing initrd memory: 8912K (ffffffc002200000 - ffffffc002ab4000)
552<6>[ 0.742075]@3 kryo perfevents: CPU pmu for kryo-pmuv3 detected
553<6>[ 0.747029]@3 futex hash table entries: 1024 (order: 5, 131072 bytes)
554<6>[ 0.747163]@3 audit: initializing netlink subsys (disabled)
555<5>[ 0.747280]@3 audit: type=2000 audit(0.739:1): initialized
556<4>[ 0.747775]@3 vmscan: error setting kswapd cpu affinity mask
557<5>[ 0.750188]@3 VFS: Disk quotas dquot_6.5.2
558<4>[ 0.750292]@3 Dquot-cache hash table entries: 512 (order 0, 4096 bytes)
559<6>[ 0.750819]@3 exfat: init_exfat_fs: exFAT Filesystem version 1.2.24
560<6>[ 0.750867]@3 fuse init (API version 7.23)
561<6>[ 0.752975]@3 Block layer SCSI generic (bsg) driver version 0.4 loaded (major 247)
562<6>[ 0.753001]@3 io scheduler noop registered (default)
563<3>[ 0.763464]@3 mdss_mdp_irq_clk_register: unable to get clk: lut_clk
564<3>[ 0.764712]@3 No change in context(0==0), skip
565<6>[ 0.765744]@3 mdss_mdp_pipe_addr_setup: type:0 ftchid:-1 xinid:0 num:0 rect:0 ndx:0x1 prio:0
566<6>[ 0.765753]@3 mdss_mdp_pipe_addr_setup: type:0 ftchid:-1 xinid:4 num:1 rect:0 ndx:0x2 prio:1
567<6>[ 0.765759]@3 mdss_mdp_pipe_addr_setup: type:0 ftchid:-1 xinid:8 num:2 rect:0 ndx:0x4 prio:2
568<6>[ 0.765765]@3 mdss_mdp_pipe_addr_setup: type:0 ftchid:-1 xinid:12 num:8 rect:0 ndx:0x100 prio:3
569<6>[ 0.765779]@3 mdss_mdp_pipe_addr_setup: type:1 ftchid:-1 xinid:1 num:3 rect:0 ndx:0x8 prio:4
570<6>[ 0.765784]@3 mdss_mdp_pipe_addr_setup: type:1 ftchid:-1 xinid:5 num:4 rect:0 ndx:0x10 prio:5
571<6>[ 0.765790]@3 mdss_mdp_pipe_addr_setup: type:1 ftchid:-1 xinid:9 num:5 rect:0 ndx:0x20 prio:6
572<6>[ 0.765795]@3 mdss_mdp_pipe_addr_setup: type:1 ftchid:-1 xinid:13 num:9 rect:0 ndx:0x200 prio:7
573<6>[ 0.765807]@3 mdss_mdp_pipe_addr_setup: type:2 ftchid:-1 xinid:2 num:6 rect:0 ndx:0x40 prio:8
574<6>[ 0.765813]@3 mdss_mdp_pipe_addr_setup: type:2 ftchid:-1 xinid:10 num:7 rect:0 ndx:0x80 prio:9
575<6>[ 0.765825]@3 mdss_mdp_pipe_addr_setup: type:3 ftchid:-1 xinid:7 num:10 rect:0 ndx:0x400 prio:0
576<6>[ 0.765830]@3 mdss_mdp_pipe_addr_setup: type:3 ftchid:-1 xinid:7 num:11 rect:0 ndx:0x800 prio:1
577<3>[ 0.765840]@3 mdss_mdp_parse_dt_handler: Error from prop qcom,mdss-pipe-sw-reset-off : u32 array read
578<3>[ 0.765909]@3 mdss_mdp_parse_dt_handler: Error from prop qcom,mdss-ib-factor-overlap : u32 array read
579<6>[ 0.766234]@3 xlog_status: enable:0, panic:0, dump:1
580<6>[ 0.767394]@3 mdss_mdp_probe: mdss version = 0x10070002, bootloader display is on, num 1, intf_sel=0x00000100
581<6>[ 0.771934]@3 mdss_smmu_probe: iommu v2 domain[0] mapping and clk register successful!
582<6>[ 0.772095]@3 mdss_smmu_probe: iommu v2 domain[1] mapping and clk register successful!
583<6>[ 0.772210]@3 mdss_smmu_probe: iommu v2 domain[2] mapping and clk register successful!
584<6>[ 0.772314]@3 mdss_smmu_probe: iommu v2 domain[3] mapping and clk register successful!
585<6>[ 0.775232]@3 mdss_dsi_ctrl_probe: DSI Ctrl name = MDSS DSI CTRL->0
586<6>[ 0.775565]@3 mdss_dsi_find_panel_of_node: cmdline:0:qcom,mdss_dsi_samsung_s6e3fa5_1080p_cmd:1:none:cfg:single_dsi panel_name:qcom,mdss_dsi_samsung_s6e3fa5_1080p_cmd
587<6>[ 0.775582]@3 mdss_dsi_panel_init: Panel Name = samsung s6e3fa5 1080p cmd mode dsi panel
588<6>[ 0.775679]@3 mdss_dsi_panel_timing_from_dt: found new timing "qcom,mdss_dsi_samsung_s6e3fa5_1080p_cmd" (ffffffc1764bb380)
589<3>[ 0.775698]@3 mdss_dsi_parse_dcs_cmds: failed, key=qcom,mdss-dsi-timing-switch-command
590<4>[ 0.775704]@3 mdss_dsi_panel_get_dsc_cfg_np: cannot find dsc config node:
591<6>[ 0.775823]@3 mdss_dsi_parse_panel_features: partial_update_enabled=0
592<6>[ 0.775832]@3 mdss_dsi_parse_panel_features: ulps feature disabled
593<6>[ 0.775839]@3 mdss_dsi_parse_panel_features: ulps during suspend feature disabled
594<6>mdss_dsi_parse_dms_config: dynamic switch feature enabled: 0
595<6>[ 0.775875]@3 mdss_dsi_panel_init: Panel Manufacture = SAMSUNG
596<6>[ 0.775881]@3 mdss_dsi_panel_init: Panel Version = S6E3FA5
597<3>[ 0.775889]@3 high brightness panel: 1
598<3>[ 0.776279]@3 mdss_dsi_parse_ctrl_params:4006 Unable to read qcom,display-id, data=0000000000000000,len=20
599<6>[ 0.776321]@3 mdss_dsi_parse_gpio_params: bklt_en gpio not specified
600<3>[ 0.776554]@3 msm_dss_get_res_byname: 'dsi_phy_regulator' resource not found
601<3>[ 0.776561]@3 0xffffffc0003911a8->msm_dss_ioremap_byname: 'dsi_phy_regulator' msm_dss_get_res_byname failed
602<6>[ 0.776568]@3 mdss_dsi_retrieve_ctrl_resources: ctrl_base=ffffff80021dc000 ctrl_size=400 phy_base=ffffff80021de400 phy_size=588
603<6>[ 0.776737]@3 dsi_panel_device_register: Continuous splash enabled
604<6>[ 0.777331]@3 mdss_register_panel: adding framebuffer device 994000.qcom,mdss_dsi_ctrl0
605<6>[ 0.780849]@3 mdss_dsi_ctrl_probe: Dsi Ctrl->0 initialized, DSI rev:0x10040001, PHY rev:0x2
606<6>[ 0.782226]@3 mdss_dsi_status_init: DSI status check interval:5000
607<6>[ 0.782630]@3 mdss_register_panel: adding framebuffer device soc:qcom,mdss_wb_panel
608<6>[ 0.784204]@3 mdss_fb_probe: fb0: split_mode:0 left:0 right:0
609<6>[ 0.784667]@3 mdss_fb_register: FrameBuffer[0] 1080x1920 registered successfully!
610<6>[ 0.785475]@3 mdss_fb_probe: fb1: split_mode:0 left:0 right:0
611<6>[ 0.785547]@3 mdss_fb_register: FrameBuffer[1] 640x480 registered successfully!
612<3>[ 0.785606]@3 mdss_mdp_splash_parse_dt: splash mem child node is not present
613<6>[ 0.795780]@3 In memshare_probe, Memshare probe success
614<6>[ 0.800408]@3 l2cache-pmu soc:l2-pmu: Registered L2 cache PMU using 2 HW PMUs
615<5>[ 0.801387]@3 msm_rpm_log_probe: OK
616<6>[ 0.805110]@0 subsys-pil-tz ce0000.qcom,venus: for venus segments only will be dumped.
617<6>subsys-pil-tz soc:qcom,kgsl-hyp: for a530_zap segments only will be dumped.
618<3>uart_tx_gpio is not available
619<3>[ 0.810958]@2 uart_rx_gpio is not available
620<3>[ 0.810966]@2 uart_cts_gpio is not available
621<3>[ 0.810971]@2 uart_rfr_gpio is not available
622<3>[ 0.811768]@3 sps: BAM device 0x0000000007544000 is not registered yet.
623<6>[ 0.811921]@3 sps:BAM 0x0000000007544000 is registered.
624<3>smd_channel_probe_now: allocation table not initialized
625<6>[ 0.813471]@3 7570000.uart: ttyHS0 at MMIO 0x7570000 (irq = 20, base_baud = 460800) is a MSM HS UART
626<6>[ 0.815518]@3 msm_serial_hs module loaded
627<6>[ 0.816333]@3 msm_serial_hsl_probe: detected port #0 (ttyHSL0)
628<3>[ 0.816463]@3 AXI: get_pdata(): Error: Client name not found
629<3>[ 0.816471]@3 AXI: msm_bus_cl_get_pdata(): client has to provide missing entry for successful registration
630<3>[ 0.816478]@3 msm_serial_hsl_probe: Bus scaling is disabled
631<6>[ 0.816584]@3 75b0000.serial: ttyHSL0 at MMIO 0x75b0000 (irq = 12, base_baud = 460800) is a MSM
632<6>[ 0.816664]@3 msm_hsl_console_setup: console setup on port #0
633<6>[ 5.359142]@3 console [ttyHSL0] enabled
634<6>[ 5.364086]@3 msm_serial_hsl_init: driver initialized
635<6>[ 5.387708]@3 brd: module loaded
636<6>[ 5.390896]@3 loop: module loaded
637<6>[ 5.393289]@3 at24 6-0051: 4096 byte 24c32 EEPROM, writable, 1 bytes/write
638<6>[ 5.401298]@3 QSEECOM: qseecom_probe: qseecom.qsee_version = 0x1000000
639<4>[ 5.406825]@3 QSEECOM: qseecom_retrieve_ce_data: Device does not support PFE
640<6>QSEECOM: qseecom_probe: no-clock-support=0x1<4>QSEECOM: qseecom_probe: qseecom.qsee_reentrancy_support = 2
641<3>[ 5.423565]@3 scm_call failed: func id 0x70000006, ret: -2, syscall returns: 0xffffffffffffffed, 0x0, 0x0
642<4>[ 5.432502]@3 QSEECOM: qseecom_probe: qseecom.whitelist_support = 1
643<4>[ 5.439736]@3 i2c-core: driver [tusb320] using legacy suspend method
644<4>[ 5.445091]@3 i2c-core: driver [tusb320] using legacy resume method
645<4>[ 5.451609]@3 i2c-core: driver [fusb301] using legacy suspend method
646<4>[ 5.457655]@3 i2c-core: driver [fusb301] using legacy resume method
647<4>[ 5.463951]@3 i2c-core: driver [ptn5150] using legacy suspend method
648<4>[ 5.470253]@3 i2c-core: driver [ptn5150] using legacy resume method
649<3>[ 5.478097]@3 gpio_dev_probe
650<3>[ 5.479987]@3 i= 1 gpio=: 97
651<3>[ 5.482908]@3 i= 2 gpio=: 98
652<3>[ 5.485717]@3 i= 3 gpio=: 100
653<3>[ 5.488680]@3 i= 4 gpio=: 115
654<3>[ 5.491657]@3 i= 5 gpio=: 127
655<3>[ 5.494610]@3 i= 6 gpio=: 133
656<3>[ 5.497572]@3 i= 7 gpio=: 136
657<4>[ 5.500720]@3 gpio_pinctrl_init
658<4>[ 5.504062]@3 gpio_dev_probe ok!
659<6>[ 5.507166]@3 Loading pn544 driver
660<6>[ 5.510437]@3 Enter pn544_probe !!!
661<6>[ 5.513926]@3 pn544_parse_dt: 9, 94, 12, 1015 ,1018, 0
662<6>[ 5.519037]@3 successfully got regulator_s4
663<6>[ 5.523316]@3 successfully set regulator voltage_s4
664<6>[ 5.527953]@3 get BBCLK2!!!
665<6>[ 5.530774]@3 clk_prepare_enable. ret = 0
666<6>[ 5.534854]@3 pn544_probe : requesting IRQ 273
667<6>[ 5.539258]@3 pn544_probe pn544_dev->clk_gpio = 0
668<6>[ 5.543904]@3 pn544_probe : requesting IRQ 542
669<4>[ 5.548329]@3 ###clkreq_disable_irq###
670<4>i2c-core: driver [pn544] using legacy suspend method
671<4>[ 5.556684]@3 i2c-core: driver [pn544] using legacy resume method
672<6>[ 5.562784]@3 [NXP-P61] : Entry : p61_dev_init
673<6>[ 5.568531]@3 qce 660000.qcedev: Qualcomm Crypto 5.3.1 device found @0x660000
674<6>[ 5.574713]@3 qce 660000.qcedev: CE device = 0x0
675<6>, IO base, CE = 0xffffff8003780000
676<6>, Consumer (IN) PIPE 2, Producer (OUT) PIPE 3
677<6>IO base BAM = 0x (null)
678<6>BAM IRQ 156
679<6>Engines Availability = 0x2011053
680<6>[ 5.593940]@3 sps:BAM 0x0000000000644000 is registered.
681<6>sps:BAM 0x0000000000644000 (va:0xffffff8003800000) enabled: ver:0x27, number of pipes:16
682<6>[ 5.607319]@3 QCE50: qce_sps_init: Qualcomm MSM CE-BAM at 0x0000000000644000 irq 156
683<6>[ 5.622733]@3 qcrypto 660000.qcrypto: Qualcomm Crypto 5.3.1 device found @0x660000
684<6>[ 5.629286]@3 qcrypto 660000.qcrypto: CE device = 0x0
685<6>, IO base, CE = 0xffffff8003840000
686<6>, Consumer (IN) PIPE 4, Producer (OUT) PIPE 5
687<6>IO base BAM = 0x (null)
688<6>BAM IRQ 156
689<6>Engines Availability = 0x2011053
690<6>[ 5.649271]@3 QCE50: qce_sps_init: Qualcomm MSM CE-BAM at 0x0000000000644000 irq 156
691<6>[ 5.662951]@3 qcrypto 660000.qcrypto: qcrypto-ecb-aes
692<6>[ 5.667031]@3 qcrypto 660000.qcrypto: qcrypto-cbc-aes
693<6>[ 5.672100]@3 qcrypto 660000.qcrypto: qcrypto-ctr-aes
694<6>[ 5.677097]@3 qcrypto 660000.qcrypto: qcrypto-ecb-des
695<6>[ 5.682147]@3 qcrypto 660000.qcrypto: qcrypto-cbc-des
696<6>[ 5.687166]@3 qcrypto 660000.qcrypto: qcrypto-ecb-3des
697<6>[ 5.692300]@3 qcrypto 660000.qcrypto: qcrypto-cbc-3des
698<6>[ 5.697408]@3 qcrypto 660000.qcrypto: qcrypto-xts-aes
699<6>[ 5.702656]@3 qcrypto 660000.qcrypto: qcrypto-sha1
700<6>[ 5.707218]@3 qcrypto 660000.qcrypto: qcrypto-sha256
701<6>[ 5.712178]@3 qcrypto 660000.qcrypto: qcrypto-aead-hmac-sha1-cbc-aes
702<6>[ 5.718503]@3 qcrypto 660000.qcrypto: qcrypto-aead-hmac-sha1-cbc-des
703<6>[ 5.724852]@3 qcrypto 660000.qcrypto: qcrypto-aead-hmac-sha1-cbc-3des
704<6>[ 5.731274]@3 qcrypto 660000.qcrypto: qcrypto-aead-hmac-sha256-cbc-aes
705<6>[ 5.737772]@3 qcrypto 660000.qcrypto: qcrypto-aead-hmac-sha256-cbc-des
706<6>[ 5.744302]@3 qcrypto 660000.qcrypto: qcrypto-aead-hmac-sha256-cbc-3des
707<6>[ 5.751090]@3 qcrypto 660000.qcrypto: qcrypto-hmac-sha1
708<6>[ 5.756090]@3 qcrypto 660000.qcrypto: qcrypto-hmac-sha256
709<6>[ 5.761486]@3 qcrypto 660000.qcrypto: qcrypto-aes-ccm
710<6>[ 5.766504]@3 qcrypto 660000.qcrypto: qcrypto-rfc4309-aes-ccm
711<6>[ 5.774789]@3 ICE IRQ = 28
712<6>[ 5.780620]@3 qcom_ice_get_pdevice: found ice device ffffffc17323cc00
713<6>[ 5.786039]@3 qcom_ice_get_pdevice: matching platform device ffffffc175bedc00
714<3>[ 5.793646]@3 scm_call failed: func id 0x42000c02, ret: -2, syscall returns: 0xfffffffffffffffc, 0x0, 0x0
715<3>[ 5.803504]@3 ufs_qcom_phy_qmp_14nm 627000.ufsphy: failed to get tx_iface_clk err -2
716<3>ufs_qcom_phy_qmp_14nm 627000.ufsphy: failed to get rx_iface_clk err -2
717<6>scsi host0: ufshcd
718<6>[ 5.822192]@3 qcom_ice 630000.ufsice: QC ICE 2.1.44 device found @0xffffff8002890000
719<6>[ 5.841598]@3 SCSI Media Changer driver v0.25
720<6>[ 5.848669]@3 sps:BAM 0x0000000007544000 (va:0xffffff80025c0000) enabled: ver:0x19, number of pipes:24
721<6>[ 5.857471]@3 [NXP-P61] : p61_probe chip select : 1 , bus number = 0
722<3>[ 5.859265]@1 ufshcd 624000.ufshc: ufshcd_print_pwr_info:[RX, TX]: gear=[1, 1], lane[1, 1], pwr[SLOWAUTO_MODE, SLOWAUTO_MODE], rate = 0
723<6>[ 5.875828]@3 p61_parse_dt: 34, 21 0
724<6>[ 5.879170]@3 [NXP-P61] : Entry : p61_hw_setup
725<6>[ 5.883732]@3 [NXP-P61] : Exit : p61_hw_setup
726<6>[ 5.888217]@3 [NXP-P61] : Entry : p61_disable_irq
727<6>[ 5.892897]@3 [NXP-P61] : Exit : p61_disable_irq
728<6>[ 5.897573]@3 [NXP-P61] : Exit : p61_probe
729<6>[ 5.903464]@3 msm_sharedmem: sharedmem_register_qmi: qmi init successful
730<6>[ 5.911865]@2 msm_sharedmem: msm_sharedmem_probe: Device created for client 'rmtfs'
731<4>[ 5.922092]@2 7411000.qusb supply USB3_GDSC not found, using dummy regulator
732<3>[ 5.931147]@3 msm-dwc3 6a00000.ssusb: unable to get dbm device
733<6>[ 5.939007]@3 ehci_hcd: USB 2.0 'Enhanced' Host Controller (EHCI) Driver
734<6>[ 5.944759]@3 ehci-pci: EHCI PCI platform driver
735<6>[ 5.949333]@3 usbcore: registered new interface driver uas
736<6>[ 5.955016]@3 usbcore: registered new interface driver usb-storage
737<6>[ 5.960933]@3 usbcore: registered new interface driver ums-alauda
738<6>[ 5.966997]@3 usbcore: registered new interface driver ums-cypress
739<6>[ 5.973185]@3 usbcore: registered new interface driver ums-datafab
740<6>[ 5.979326]@3 usbcore: registered new interface driver ums_eneub6250
741<6>[ 5.985670]@3 usbcore: registered new interface driver ums-freecom
742<6>[ 5.991836]@3 usbcore: registered new interface driver ums-isd200
743<3>[ 5.992753]@1 ufshcd 624000.ufshc: ufshcd_print_pwr_info:[RX, TX]: gear=[3, 3], lane[1, 1], pwr[FAST MODE, FAST MODE], rate = 2
744<5>[ 5.993526]@1 scsi 0:0:0:49488: Well-known LUN SAMSUNG KLUCG4J1CB-B0B1 0800 PQ: 0 ANSI: 6
745<5>[ 5.994330]@1 scsi 0:0:0:49456: Well-known LUN SAMSUNG KLUCG4J1CB-B0B1 0800 PQ: 0 ANSI: 6
746<5>[ 5.995013]@1 scsi 0:0:0:49476: Well-known LUN SAMSUNG KLUCG4J1CB-B0B1 0800 PQ: 0 ANSI: 6
747<4>[ 5.995622]@1 ufs_get_capacity_info size = 0x7734000
748<5>scsi 0:0:0:0: Direct-Access SAMSUNG KLUCG4J1CB-B0B1 0800 PQ: 0 ANSI: 6
749<5>[ 5.996711]@0 scsi 0:0:0:1: Direct-Access SAMSUNG KLUCG4J1CB-B0B1 0800 PQ: 0 ANSI: 6
750<5>[ 5.997146]@0 scsi 0:0:0:2: Direct-Access SAMSUNG KLUCG4J1CB-B0B1 0800 PQ: 0 ANSI: 6
751<5>[ 5.997567]@0 scsi 0:0:0:3: Direct-Access SAMSUNG KLUCG4J1CB-B0B1 0800 PQ: 0 ANSI: 6
752<5>[ 5.997996]@0 scsi 0:0:0:4: Direct-Access SAMSUNG KLUCG4J1CB-B0B1 0800 PQ: 0 ANSI: 6
753<5>[ 5.998411]@0 scsi 0:0:0:5: Direct-Access SAMSUNG KLUCG4J1CB-B0B1 0800 PQ: 0 ANSI: 6
754<5>[ 5.999267]@2 sd 0:0:0:0: [sda] 16384-byte physical blocks
755<5>[ 5.999759]@1 sd 0:0:0:1: [sdb] 16384-byte physical blocks
756<5>[ 6.000934]@1 sd 0:0:0:2: [sdc] 16384-byte physical blocks
757<5>[ 6.000992]@1 sd 0:0:0:3: [sdd] 16384-byte physical blocks
758<5>[ 6.001734]@1 sd 0:0:0:0: [sda] 16384-byte physical blocks
759<5>[ 6.002918]@0 sd 0:0:0:1: [sdb] 16384-byte physical blocks
760<5>[ 6.003443]@2 sd 0:0:0:5: [sdf] 16384-byte physical blocks
761<5>[ 6.003481]@1 sd 0:0:0:4: [sde] 16384-byte physical blocks
762<5>[ 6.004304]@1 sd 0:0:0:2: [sdc] 16384-byte physical blocks
763<5>[ 6.004816]@1 sd 0:0:0:3: [sdd] 16384-byte physical blocks
764<6>[ 6.006356]@1 sda: sda1 sda2 sda3 sda4 sda5 sda6 sda7 sda8 sda9 sda10 sda11 sda12 sda13 sda14 sda15
765<5>[ 6.007049]@2 sd 0:0:0:5: [sdf] 16384-byte physical blocks
766<5>[ 6.007935]@0 sd 0:0:0:0: [sda] 16384-byte physical blocks
767<6>[ 6.008280]@1 sdb: sdb1
768<5>[ 6.008623]@1 sd 0:0:0:4: [sde] 16384-byte physical blocks
769<6>[ 6.008655]@2 sdc: sdc1
770<6>[ 6.009605]@0 sdd: sdd1 sdd2 sdd3
771<5>[ 6.009915]@1 sd 0:0:0:2: [sdc] 16384-byte physical blocks
772<5>[ 6.009940]@1 sd 0:0:0:1: [sdb] 16384-byte physical blocks
773<6>[ 6.010625]@0 sdf: sdf1 sdf2 sdf3 sdf4
774<5>[ 6.011523]@0 sd 0:0:0:5: [sdf] 16384-byte physical blocks
775<6>[ 6.013158]@1 sde: sde1 sde2 sde3 sde4 sde5 sde6 sde7 sde8 sde9 sde10 sde11 sde12 sde13 sde14 sde15 sde16 sde17 sde18 sde19 sde20 sde21 sde22 sde23 sde24 sde25 sde26 sde27 sde28 sde29 sde30 sde31 sde32 sde33 sde34
776<5>[ 6.015013]@1 sd 0:0:0:4: [sde] 16384-byte physical blocks
777<5>[ 6.018436]@2 sd 0:0:0:3: [sdd] 16384-byte physical blocks
778<6>[ 6.227164]@3 usbcore: registered new interface driver ums-jumpshot
779<6>[ 6.233183]@2 usbcore: registered new interface driver ums-karma
780<6>[ 6.239139]@2 usbcore: registered new interface driver ums-onetouch
781<6>[ 6.245418]@2 usbcore: registered new interface driver ums-realtek
782<6>[ 6.251559]@2 usbcore: registered new interface driver ums-sddr09
783<6>[ 6.257622]@2 usbcore: registered new interface driver ums-sddr55
784<6>[ 6.263709]@2 usbcore: registered new interface driver ums-usbat
785<6>[ 6.269739]@2 usbcore: registered new interface driver usbserial
786<6>[ 6.276218]@3 gbridge_init: gbridge_init successs.
787<6>[ 6.280550]@3 mousedev: PS/2 mouse device common for all mice
788<6>[ 6.286266]@3 usbcore: registered new interface driver xpad
789<3>[ 6.291738]@3 synaptics,s3320: tpd_driver_init enter
790<3>[ 6.297448]@3 synaptics,s3320: before on cpu [3]
791<3>[ 6.301293]@3 synaptics,s3320: check CPU[0] is [online]
792<3>[ 6.306816]@3 touchkey,s1302: boot_time: before optimize [synaptics_ts_probe] on cpu 3
793<3>[ 6.314489]@3 touchkey,s1302: boot_time: [synaptics_ts_probe] CPU0 is online
794<3>[ 6.323557]@3 switch_data->key3_gpio=1013
795<3>[ 6.326632]@3 switch_data->key2_gpio=1012
796<3>[ 6.330758]@3 switch_data->key1_gpio=1014
797<6>[ 6.336074]@3 fpc1020_probe
798<6>[ 6.338026]@3 fpc1020 soc:fpc_fpc1020: fpc,irq-gpio - gpio: 95
799<6>[ 6.343746]@3 fpc1020 soc:fpc_fpc1020: fpc,reset-gpio - gpio: 86
800<6>[ 6.349658]@3 fpc1020 soc:fpc_fpc1020: fpc,gpio_id0 - gpio: 25
801<3>[ 6.355468]@3 fpc1020 soc:fpc_fpc1020: fpc1020_probe: gpio_is_valid(fpc1020->id0_gpio=25)
802<6>[ 6.363654]@3 fpc1020 soc:fpc_fpc1020: fpc,gpio_id1 - gpio: 143
803<3>[ 6.369519]@3 fpc1020 soc:fpc_fpc1020: fpc1020_probe: gpio_is_valid(fpc1020->id1_gpio=143)
804<6>[ 6.378042]@3 fpc1020 soc:fpc_fpc1020: fpc,gpio_1V8_EN - gpio: 14
805<6>[ 6.383985]@3 input: fpc1020 as /devices/virtual/input/input1
806<6>[ 6.389803]@3 fpc1020 soc:fpc_fpc1020: requested irq 359
807<6>[ 6.394922]@3 fpc1020 soc:fpc_fpc1020: fpc1020_probe: ok
808<6>[ 6.401518]@3 qcom,qpnp-rtc qpnp-rtc-8: rtc core: registered qpnp_rtc as rtc0
809<6>[ 6.407787]@3 i2c /dev entries driver
810<3>[ 6.412706]@3 SMBCHG: load_data: chip is NULL !
811<3>[ 6.416510]@3 SMBCHG: load_data: chip is NULL !
812<6>[ 6.420846]@2 FG: fg_probe: FG Probe success - FG Revision DIG:3.1 ANA:1.2 PMIC subtype=19
813<6>[ 6.429300]@3 BQ: bq27541_battery_probe: probe sucdess
814<3>[ 6.434540]@3 i2c-msm-v2 757a000.i2c: msm_bus_scale_register_client(mstr-id:86):0x11 (ok)
815<6>BQ: check_bat_type: is_4p4v_bat=1,support_4p4v_bat=1
816<4>[ 6.447764]@3 i2c-core: driver [bq27541-battery] using legacy suspend method
817<4>[ 6.454771]@3 i2c-core: driver [bq27541-battery] using legacy resume method
818<6>[ 6.462410]@3 FASTCHG: dash_probe: dash_probe
819<6>[ 6.500041]@3 FASTCHG: dash_probe: dash_probe success
820<3>[ 6.505992]@3 unable to find DT imem DLOAD mode node
821<3>[ 6.511299]@3 unable to find DT imem EDLOAD mode node
822<4>[ 6.516297]@3 set_dload_mode ON
823<6>[ 6.549168]@3 device-mapper: uevent: version 1.0.3
824<6>[ 6.553092]@3 device-mapper: ioctl: 4.28.0-ioctl (2014-09-17) initialised: dm-devel@redhat.com
825<6>[ 6.561538]@3 device-mapper: req-crypt: dm-req-crypt successfully initalized.
826<6>
827<6>[ 6.568973]@3 sdhci: Secure Digital Host Controller Interface driver
828<6>[ 6.575384]@3 sdhci: Copyright(c) Pierre Ossman
829<6>[ 6.579667]@3 sdhci-pltfm: SDHCI platform and OF driver helper
830<6>[ 6.590375]@3 hidraw: raw HID events driver (C) Jiri Kosina
831<6>[ 6.595112]@3 usbcore: registered new interface driver usbhid
832<3>[ 6.600053]@0 synaptics,s3320: after on cpu [0]
833<3>[ 6.600060]@0 synaptics,s3320: synaptics_ts_probe is called
834<3>[ 6.600443]@0 synaptics,s3320: synaptics_parse_dts ts->support_hw_poweroff =1
835<3>[ 6.600447]@0 synaptics,s3320: ts->enable2v8_gpio not specified
836<3>[ 6.600450]@0 synaptics,s3320: ts->max_num not specified
837<3>[ 6.600453]@0 synaptics,s3320: button-map not specified
838<3>[ 6.600455]@0 synaptics,s3320: synaptics:button map readed is 0 0 0
839<3>[ 6.600459]@0 synaptics,s3320: synaptics,tx-rx-num is 16 28
840<4>[ 6.600463]@0 synaptics,s3320: synaptic:ts->irq_gpio:125 irq_flags:8200 max_num 10
841<3>[ 6.601052]@0 synaptics,s3320: synaptics:enable the v1p8_gpio
842<3>[ 6.620231]@0 touchkey,s1302: boot_time: after optimize call [synaptics_ts_probe] on cpu 0
843<3>[ 6.620235]@0 touchkey,s1302: synaptics_ts_probe is called
844<6>[ 6.673537]@3 usbhid: USB HID core driver
845<6>[ 6.677661]@3 ashmem: initialized
846<3>[ 6.680048]@0 synaptics,s3320: synaptics:enable the reset_gpio
847<6>[ 6.686497]@3 logger: created 256K log 'log_main'
848<6>[ 6.691186]@3 logger: created 256K log 'log_events'
849<6>[ 6.696013]@3 logger: created 256K log 'log_radio'
850<6>[ 6.700804]@3 logger: created 256K log 'log_system'
851<6>[ 6.707895]@3 qpnp_coincell_charger_show_state: enabled=Y, voltage=3200 mV, resistance=2100 ohm
852<6>[ 6.722301]@3 bimc-bwmon 408000.qcom,cpu-bwmon: BW HWmon governor registered.
853<6>[ 6.729373]@3 arm-memlat-mon soc:qcom,arm-memlat-mon-0: Memory Latency governor registered.
854<6>[ 6.736847]@3 arm-memlat-mon soc:qcom,arm-memlat-mon-2: Memory Latency governor registered.
855<6>[ 6.746956]@3 m4m-hwmon 6530000.qcom,m4m-hwmon: Cache HWmon governor registered.
856<3>[ 6.756767]@3 devfreq soc:qcom,cpubw: Couldn't update frequency transition information.
857<3>[ 6.763861]@3 devfreq soc:qcom,mincpubw: Couldn't update frequency transition information.
858<3>[ 6.772267]@3 devfreq soc:qcom,memlat-cpu0: Couldn't update frequency transition information.
859<3>[ 6.780577]@3 devfreq soc:qcom,memlat-cpu2: Couldn't update frequency transition information.
860<3>[ 6.790324]@0 i2c-msm-v2 75ba000.i2c: msm_bus_scale_register_client(mstr-id:84):0x17 (ok)
861<6>otracer: initialized
862<6>[ 6.792424]@3 op_netlink_init
863<3>[ 6.793088]@3 tfa98xx_i2c_probe
864<6>[ 6.793508]@3 TCP: cubic registered
865<6>[ 6.793660]@3 NET: Registered protocol family 10
866<6>[ 6.793971]@3 NET: Registered protocol family 17
867<6>[ 6.794567]@3 NET: Registered protocol family 27
868<6>[ 6.796979]@1 subsys-pil-tz 9300000.qcom,lpass: for adsp segments only will be dumped.
869<6>subsys-pil-tz 1c00000.qcom,ssc: for slpi segments only will be dumped.
870<6>sps:BAM 0x0000000006b04000 is registered.
871<3>qpnp-smbcharger qpnp-smbcharger-17: node /soc/qcom,spmi@400f000/qcom,pmi8994@2/qcom,qpnp-smbcharger IO resource absent!
872<6>[ 6.823097]@1 SMBCHG: qpnp_battery_temp_region_set: set temp_region = 5
873<6>[ 6.823171]@1 smbcharger_charger_otg: no parameters
874<6>[ 6.823260]@1 smbcharger_external_otg: no parameters
875<6>[ 6.823283]@1 smbcharger_external_otg: supplied by pmi8994_boost_5v
876<6>[ 6.823354]@1 SMBCHG: smbchg_hw_init: enable APSD
877<6>[ 6.823401]@1 SMBCHG: smbchg_hw_init: disabe HVDCP
878<6>[ 6.823645]@1 SMBCHG: smbchg_charging_en: enable=1
879<6>[ 6.823760]@1 SMBCHG: smbchg_charging_en: enable=0
880<6>[ 6.823784]@1 SMBCHG: smbchg_usb_suspend: suspend=0
881<6>[ 6.824259]@1 SMBCHG: smbchg_set_fastchg_current_raw: fastcharge current requested 500, set to 500
882<6>[ 6.867605]@1 SMBCHG: handle_usb_insertion: inserted type = 4 (SDP)
883<6>[ 6.867609]@1 SMBCHG: smbchg_charging_en: enable=1
884<6>[ 6.867633]@1 FG: oneplus_set_allow_read_iic: set allow read extern fg iic fail
885<6>[ 6.867637]@1 SMBCHG: smbchg_set_usb_current_max: USB current_ma = 500, typeC_support_current_ma = 4000
886<6>[ 6.867985]@1 SMBCHG: smbchg_usb_update_online_work: chip->usb_online = -22, online = 1
887<6>[ 6.868142]@1 SMBCHG: load_data: stored_soc[0xb7], shutdown_soc[91]
888<6>[ 6.868241]@1 SMBCHG: load_data: stored_soc[0xb7], shutdown_soc[91]
889<6>[ 6.884984]@1 SMBCHG: load_data: stored_soc[0xb7], shutdown_soc[91]
890<6>[ 6.885362]@1 SMBCHG: load_data: stored_soc[0xb7], shutdown_soc[91]
891<6>[ 6.885439]@1 SMBCHG: load_data: stored_soc[0xb7], shutdown_soc[91]
892<6>[ 6.885537]@1 SMBCHG: load_data: stored_soc[0xb7], shutdown_soc[91]
893<3>[ 6.888087]@1 qpnp-smbcharger qpnp-smbcharger-17: node /soc/qcom,spmi@400f000/qcom,pmi8994@2/qcom,qpnp-smbcharger IO resource absent!
894<6>[ 6.888323]@1 SMBCHG: load_data: stored_soc[0xb7], shutdown_soc[91]
895<3>[ 6.913138]@1 msm-usb-ssphy-qmp 7410000.ssphy: QMP PHY initialization timeout
896<3>[ 6.913145]@1 msm-usb-ssphy-qmp 7410000.ssphy: USB3_PHY_PCS_STATUS:69696969
897<6>[ 6.914542]@1 SMBCHG: load_data: stored_soc[0xb7], shutdown_soc[91]
898<6>[ 6.914601]@1 SMBCHG: load_data: stored_soc[0xb7], shutdown_soc[91]
899<6>[ 6.914677]@1 SMBCHG: load_data: stored_soc[0xb7], shutdown_soc[91]
900<6>[ 6.914774]@1 SMBCHG: load_data: stored_soc[0xb7], shutdown_soc[91]
901<6>[ 6.915766]@1 qpnp-smbcharger qpnp-smbcharger-17: SMBCHG successfully probe Charger version=SCHG Revision DIG:2.0 ANA:2.1 batt=1 dc=0 usb=1
902<3>[ 6.915806]@1 tusb320 7-0060: tusb320_probe
903<3>[ 6.916436]@1 i2c-msm-v2 75b5000.i2c: msm_bus_scale_register_client(mstr-id:84):0x1a (ok)
904<6>SMBCHG: load_data: stored_soc[0xb7], shutdown_soc[91]
905<3>[ 6.917615]@0 i2c-msm-v2 75b5000.i2c: NACK: slave not responding, ensure its powered: msgs(n:2 cur:0 tx) bc(rx:1 tx:1) mode:FIFO slv_addr:0x60 MSTR_STS:0x0d1300c8 OPER:0x00000010
906<4>[ 6.917651]@1 tusb320_read_reg:reg(0x0), ret(-107)
907<3>[ 6.917655]@1 tusb320 7-0060: DEV_ID(0x0)!= 0x30
908<4>[ 6.917665]@1 tusb320: probe of 7-0060 failed with error -22
909<3>[ 6.917705]@1 fusb301 7-0021: fusb301_probe
910<3>[ 6.925021]@1 fusb301 7-0021: fusb301_gpio_configure OK!
911<3>[ 6.948660]@1 fusb301 7-0021: fusb301_probe OK!
912<3>[ 6.948717]@1 ptn5150 7-001d: ptn5150_probe
913<3>[ 6.954760]@0 i2c-msm-v2 75b5000.i2c: NACK: slave not responding, ensure its powered: msgs(n:2 cur:0 tx) bc(rx:1 tx:1) mode:FIFO slv_addr:0x1d MSTR_STS:0x0d1300c8 OPER:0x00000010
914<3>[ 6.954789]@1 ptn5150_read_reg: i2c read error: -5
915<3>[ 6.954793]@1 ptn5150 7-001d: DEV_ID(0x00)!= 0x0b || 0x09
916<4>[ 6.954800]@1 ptn5150: probe of 7-001d failed with error -22
917<6>[ 6.967436]@2 SMBCHG: load_data: stored_soc[0xb7], shutdown_soc[91]
918<6>[ 6.967523]@2 SMBCHG: load_data: stored_soc[0xb7], shutdown_soc[91]
919<6>[ 6.967625]@2 SMBCHG: load_data: stored_soc[0xb7], shutdown_soc[91]
920<6>[ 6.968942]@1 project_info_init_sysfs success
921<6>[ 6.969334]@3 fastrpc soc:qcom,msm-adsprpc-mem: for adsp_rh segments only will be dumped.
922<6>adsprpc: channel link type: 0
923<6>[ 6.970365]@2 SMBCHG: load_data: stored_soc[0xb7], shutdown_soc[91]
924<6>[ 6.977153]@3 file system registered
925<6>[ 6.977180]@3 mbim_init: initialize 1 instances
926<6>[ 6.977211]@3 mbim_init: Initialized 1 ports
927<6>[ 6.977812]@3 rndis_qc_init: initialize rndis QC instance
928<6>[ 6.977909]@3 Number of LUNs=8
929<6>[ 6.977913]@3 Mass Storage Function, version: 2009/09/11
930<6>[ 6.977916]@3 LUN: removable file: (no medium)
931<6>[ 6.977925]@3 Number of LUNs=1
932<6>[ 6.977946]@3 LUN: removable read only CD-ROM file: (no medium)
933<6>[ 6.977949]@3 Number of LUNs=1
934<6>[ 6.978038]@3 android_usb gadget: android_usb ready
935<6>[ 6.979230]@3 input: gpio-keys as /devices/soc/soc:gpio_keys/input/input2
936<6>[ 6.979761]@3 qcom,qpnp-rtc qpnp-rtc-8: setting system clock to 1970-01-31 22:00:07 UTC (2671207)
937<6>[ 6.980338]@3 SMBCHG: load_data: stored_soc[0xb7], shutdown_soc[91]
938<6>[ 6.983849]@3 lmh_lite:lmh_parse_sensor Registering sensor:[DLMt_APC1]
939<6>[ 6.984033]@3 lmh_lite:lmh_parse_sensor Registering sensor:[LLM_cp00]
940<6>[ 6.984144]@3 lmh_lite:lmh_parse_sensor Registering sensor:[LLM_cp01]
941<6>[ 6.984248]@3 lmh_lite:lmh_parse_sensor Registering sensor:[LLM_cp10]
942<6>[ 6.984352]@3 lmh_lite:lmh_parse_sensor Registering sensor:[LLM_cp11]
943<6>[ 6.984455]@3 lmh_lite:lmh_parse_sensor Registering sensor:[LLM_m4m0]
944<6>[ 6.984558]@3 lmh_lite:lmh_parse_sensor Registering sensor:[LLM_l21-]
945<6>[ 6.984660]@3 lmh_lite:lmh_parse_sensor Registering sensor:[LLM_l20-]
946<3>[ 6.986264]@3 parse_cpu_levels: idx 1 545
947<3>[ 6.986269]@3 parse_cpu_levels: idx 2 6022
948<3>[ 6.986271]@3 parse_cpu_levels: idx 2 11499
949<3>[ 6.986305]@3 parse_cpu_levels: idx 1 545
950<3>[ 6.986307]@3 parse_cpu_levels: idx 2 6022
951<3>[ 6.986308]@3 parse_cpu_levels: idx 2 11499
952<3>[ 6.993200]@3 qcom,qpnp-flash-led qpnp-flash-led-25: Unable to acquire pinctrl
953<6>[ 6.994437]@3 rmnet_ipa started initialization
954<6>[ 6.994441]@3 IPA SSR support = True
955<6>[ 6.994443]@3 IPA ipa-loaduC = True
956<6>[ 6.994445]@3 IPA SG support = True
957<3>[ 7.031236]@1 ipa ipa_sps_irq_control_all:938 EP (5) not allocated.
958<3>[ 7.031242]@1 ipa ipa2_uc_state_check:301 uC is not loaded
959<6>[ 7.087342]@1 rmnet_ipa completed initialization
960<6>[ 7.091118]@1 qcom,cc-debug-8996 362000.qcom,cc-debug: Registered debug mux.
961<6>[ 7.091838]@1 wlan_en_vreg: disabling
962<6>[ 7.091844]@1 rome_vreg: disabling
963<6>[ 7.091846]@1 gdsc_mmagic_bimc: disabling
964<6>[ 7.091881]@1 kryo1-retention: disabling
965<6>[ 7.091884]@1 kryo0-retention: disabling
966<6>[ 7.091886]@1 gfx_mem_acc_corner: disabling
967<6>[ 7.091888]@1 apcc_l3_mem_acc_corner: disabling
968<6>[ 7.091890]@1 apc1_perfcl_mem_acc_corner: disabling
969<6>[ 7.091891]@1 apc0_pwrcl_mem_acc_corner: disabling
970<6>[ 7.091894]@1 regulator_proxy_consumer_remove_all: removing regulator proxy consumer requests
971<6>[ 7.092162]@2 clock_late_init: Removing enables held for handed-off clocks
972<6>[ 7.197190]@1 ALSA device list:
973<6>[ 7.197194]@1 No soundcards found.
974<3>[ 7.437745]@0 i2c-msm-v2 75b6000.i2c: msm_bus_scale_register_client(mstr-id:84):0x1c (ok)
975<6>Freeing unused kernel memory: 396K (ffffffc000af6000 - ffffffc000b59000)
976<6>[ 7.437802]@1 Freeing alternatives memory: 68K (ffffffc000b59000 - ffffffc000b6a000)
977<3>[ 7.459587]@0 synaptics,s3320: F12_2D_QUERY_BASE = 47
978<3> F12_2D_CMD_BASE = 0
979<3> F12_2D_CTRL_BASE = 15
980<3> F12_2D_DATA_BASE = 6
981<3>
982<3>touchkey,s1302: product id is s1302
983<3>[ 7.474995]@0 synaptics,s3320: F01_RMI_QUERY_BASE = 2a
984<3> F01_RMI_CMD_BASE = 25
985<3> F01_RMI_CTRL_BASE = e
986<3> F01_RMI_DATA_BASE = 4
987<3>
988<3>touchkey,s1302: F11_2D_QUERY_BASE = 95
989<3> F11_2D_CMD_BASE = 6e
990<3> F11_2D_CTRL_BASE = 3d
991<3> F11_2D_DATA_BASE = 15
992<3> synaptics,s3320: F34_FLASH_QUERY_BASE = 26
993<3> F34_FLASH_CMD_BASE = 0
994<3> F34_FLASH_CTRL_BASE = a
995<3> F34_FLASH_DATA_BASE = 0
996<3>
997<6>BQ: bq27541_hw_config: DEVICE_TYPE is 0x541, FIRMWARE_VERSION is 0x200
998<3>[ 7.510464]@0 synaptics,s3320: F51_CUSTOM_QUERY_BASE = 3a
999<3> F51_CUSTOM_CMD_BASE = 0
1000<3> F51_CUSTOM_CTRL_BASE = 1a
1001<3> F51_CUSTOM_DATA_BASE = 0
1002<3>
1003<3>synaptics,s3320: F54_QUERY_BASE = 47
1004<3> F54_CMD_BASE = 46
1005<3> F54_CTRL_BASE = e
1006<3> F54_DATA_BASE = 0
1007<3>
1008<3>synaptics,s3320: before fw update bootloader_mode[0x0]
1009<3>[ 7.511197]@0 touchkey,s1302: CURRENT_FIRMWARE_ID = 0x4
1010<3>[ 7.511264]@0 synaptics,s3320: CURRENT_FIRMWARE_ID = 0x15811001
1011<3>[ 7.511340]@0 touchkey,s1302: before fw update,bootloader_mode = 0x0
1012<6>[ 7.511446]@0 input: HWK,synaptics,s1302 as /devices/soc/75b6000.i2c/i2c-8/8-0020/input/input3
1013<3>[ 7.511704]@0 synaptics,s3320: 0synatpitcs_fw: fw_name = tp/fw_synaptics_15811.img,ts->manu_name:S350815811
1014<3>[ 7.511866]@0 synaptics,s3320: synaptics_init_panel is called!
1015<3>[ 7.512122]@0 synaptics,s3320: synaptics_mode_change: set TP to mode[0x80]
1016<3>[ 7.513746]@0 synaptics,s3320: max_x = 1080,max_y = 1920; max_x_ic = 1079,max_y_ic = 1919
1017<3>[ 7.513891]@0 synaptics,s3320: afte fw update,program memory self-check bootloader_mode = 0x0
1018<3>[ 7.514341]@0 synaptics,s3320: synaptics_soft_reset !!!
1019<13>[ 7.550945]@1 init: init started!
1020<7>[ 7.552454]@1 SELinux: 2048 avtab hash slots, 4859 rules.
1021<6>[ 7.552482]@1 SELinux: Android master kernel running Android M policy in compatibility mode.
1022<7>[ 7.553126]@1 SELinux: 2048 avtab hash slots, 4859 rules.
1023<7>[ 7.553135]@1 SELinux: 1 users, 2 roles, 530 types, 0 bools, 1 sens, 1024 cats
1024<7>[ 7.553140]@1 SELinux: 87 classes, 4859 rules
1025<6>[ 7.553407]@1 SELinux: Permission module_load in class system not defined in policy.
1026<6>[ 7.553587]@1 SELinux: Permission audit_read in class capability2 not defined in policy.
1027<6>[ 7.553597]@1 SELinux: Class can_socket not defined in policy.
1028<6>[ 7.553599]@1 SELinux: the above unknown classes and permissions will be denied
1029<7>[ 7.553614]@1 SELinux: Completing initialization.
1030<7>[ 7.553616]@1 SELinux: Setting up existing superblocks.
1031<7>[ 7.553624]@1 SELinux: initialized (dev tmpfs, type tmpfs), uses transition SIDs
1032<7>[ 7.553641]@1 SELinux: initialized (dev rootfs, type rootfs), uses genfs_contexts
1033<7>[ 7.554044]@1 SELinux: initialized (dev bdev, type bdev), not configured for labeling
1034<7>[ 7.554055]@1 SELinux: initialized (dev proc, type proc), uses genfs_contexts
1035<7>[ 7.554070]@1 SELinux: initialized (dev debugfs, type debugfs), uses genfs_contexts
1036<7>[ 7.576437]@2 SELinux: initialized (dev sockfs, type sockfs), uses task SIDs
1037<7>[ 7.576451]@2 SELinux: initialized (dev pipefs, type pipefs), uses task SIDs
1038<7>[ 7.576457]@2 SELinux: initialized (dev anon_inodefs, type anon_inodefs), not configured for labeling
1039<7>[ 7.576461]@2 SELinux: initialized (dev aio, type aio), not configured for labeling
1040<7>[ 7.576467]@2 SELinux: initialized (dev devpts, type devpts), uses transition SIDs
1041<7>[ 7.576480]@2 SELinux: initialized (dev selinuxfs, type selinuxfs), uses genfs_contexts
1042<7>[ 7.576532]@2 SELinux: initialized (dev tmpfs, type tmpfs), uses transition SIDs
1043<7>[ 7.576546]@2 SELinux: initialized (dev sysfs, type sysfs), uses genfs_contexts
1044<5>[ 7.602573]@2 audit: type=1403 audit(2671208.119:2): policy loaded auid=4294967295 ses=4294967295
1045<13>[ 7.602893]@2 init: (Initializing SELinux non-enforcing took 0.05s.)
1046<13>[ 7.605490]@2 init: init second stage started!
1047<11>[ 7.605676]@2 init: property_set("ro.boot.bootdevice", "624000.ufshc") failed
1048<11>[ 7.605700]@2 init: property_set("ro.boot.selinux", "permissive") failed
1049<3>[ 7.620031]@0 touchkey,s1302: synaptic:ts->irq is 396
1050<3>[ 7.620161]@0 touchkey,s1302: touchkey using poll status:0
1051<3>[ 7.620420]@0 touchkey,s1302: synaptics_soft_reset !!!
1052<3>[ 7.620444]@0 touchkey,s1302: create nodes is successe!
1053<4>[ 7.620509]@0 touchkey,s1302: synaptics_ts_probe s1302: normal end
1054<3>[ 7.620511]@0 touchkey,s1302: boot_time: synaptics_ts_probe return 0
1055<3>[ 7.700295]@0 synaptics,s3320: synaptics_tpedge_limitfunc limit_enable =1,mode:0x4b !
1056<3>[ 7.700506]@0 synaptics,s3320: synaptics_input_init is called
1057<6>[ 7.700633]@0 input: synaptics,s3320 as /devices/soc/75ba000.i2c/i2c-12/12-0020/input/input4
1058<6>[ 7.745950]@3 BQ: bq27541_hw_config: Complete bq27541 configuration 0x600B
1059<3>[ 7.760048]@0 synaptics,s3320: synaptic:ts->irq is 389
1060<3>[ 7.764617]@1 synaptics,s3320: enter reset tp status,and ts->in_gesture_mode is:0
1061<3>[ 7.771649]@1 synaptics,s3320: synaptics_init_panel is called!
1062<3>[ 7.777702]@1 synaptics,s3320: synaptics_mode_change: set TP to mode[0x80]
1063<3>[ 7.780582]@0 synaptics,s3320: synaptics_ts_probe: going to create files--tp_fw_update
1064<4>[ 7.780700]@0 synaptics,s3320: synaptics_ts_probe 3203: normal end
1065<11>[ 7.912125]@2 init: waitpid failed: No child processes
1066<13>[ 7.916428]@2 init: (Loading properties from /default.prop took 0.00s.)
1067<11>[ 7.923119]@2 init: /init.rc: 62: invalid command 'load_all_props'
1068<11>[ 7.929032]@2 init: could not import file '/init.recovery.logd.rc' from '/init.rc'
1069<13>[ 7.936611]@2 init: (Parsing /init.recovery.usb.rc took 0.00s.)
1070<13>[ 7.942483]@2 init: (Parsing /init.recovery.service.rc took 0.00s.)
1071<13>[ 7.948730]@2 init: (Parsing /init.recovery.qcom.rc took 0.00s.)
1072<13>[ 7.954773]@2 init: (Parsing /init.rc took 0.03s.)
1073<5>[ 7.959630]@2 audit: type=1400 audit(2671208.469:3): avc: denied { setcheckreqprot } for pid=1 comm="init" scontext=u:r:init:s0 tcontext=u:object_r:kernel:s0 tclass=security permissive=1
1074<5>[ 7.976391]@3 audit: type=1400 audit(2671208.489:4): avc: denied { setcurrent } for pid=1 comm="init" scontext=u:r:init:s0 tcontext=u:r:init:s0 tclass=process permissive=1
1075<5>[ 7.991862]@3 audit: type=1400 audit(2671208.509:5): avc: denied { dyntransition } for pid=1 comm="init" scontext=u:r:init:s0 tcontext=u:r:init:s0 tclass=process permissive=1
1076<11>[ 8.007850]@3 init: SELinux: Could not get canonical path /postinstall restorecon: No such file or directory.
1077<13>[ 8.017568]@3 init: Starting service 'ueventd'...
1078<13>[ 8.022380]@3 init: Starting service 'healthd'...
1079<13>[ 8.023334]@2 ueventd: ueventd started!
1080<13>[ 8.030935]@3 init: Waiting for /dev/.coldboot_done...
1081<3>[ 8.219372]@2 BQ: bq27541_battery_soc: bq27541_battery_soc = 91
1082<3>[ 8.220253]@3 BQ: bq27541_battery_soc: bq27541_battery_soc = 91
1083<6>[ 8.220273]@3 SMBCHG: load_data: stored_soc[0xb7], shutdown_soc[91]
1084<6>[ 8.220275]@3 BQ: fg_soc_calibrate: soc=91, soc_load=91
1085<13>[ 8.806568]@3 ueventd: Coldboot took 0.78s.
1086<13>[ 8.812096]@0 init: Waiting for /dev/.coldboot_done took 0.78s.
1087<7>[ 8.818174]@2 SELinux: initialized (dev tmpfs, type tmpfs), uses transition SIDs
1088<13>[ 8.818740]@2 init: Starting service 'setup-decrypt'...
1089<7>[ 8.823207]@2 SELinux: initialized (dev pstore, type pstore), uses genfs_contexts
1090<7>[ 8.823613]@2 SELinux: initialized (dev functionfs, type functionfs), uses genfs_contexts
1091<3>[ 8.823726]@2 enable_store: android_usb: already disabled
1092<11>[ 8.828432]@2 init: property 'ro.product.model' doesn't exist while expanding '${ro.product.model}'
1093<5>[ 8.834598]@3 audit: type=1400 audit(2671209.349:6): avc: denied { write } for pid=403 comm="setup_decrypt" name="kmsg" dev="tmpfs" ino=14860 scontext=u:r:recovery:s0 tcontext=u:object_r:kmsg_device:s0 tclass=chr_file permissive=1
1094<5>[ 8.834615]@3 audit: type=1400 audit(2671209.349:7): avc: denied { open } for pid=403 comm="setup_decrypt" path="/dev/kmsg" dev="tmpfs" ino=14860 scontext=u:r:recovery:s0 tcontext=u:object_r:kmsg_device:s0 tclass=chr_file permissive=1
1095<12>[ 8.834647]@3 setup_decrypt: Mounting /system read-only
1096<6>[ 8.841666]@1 EXT4-fs (sde20): mounted filesystem with ordered data mode. Opts: (null)
1097<7>[ 8.841683]@1 SELinux: initialized (dev sde20, type ext4), uses xattr
1098<12>[ 8.855031]@3 setup_decrypt: Copying decryption libraries from /system
1099<5>[ 8.858711]@3 audit: type=1400 audit(2671209.369:8): avc: denied { write } for pid=410 comm="cp" name="sbin" dev="rootfs" ino=8359 scontext=u:r:recovery:s0 tcontext=u:object_r:rootfs:s0 tclass=dir permissive=1
1100<5>[ 8.858726]@3 audit: type=1400 audit(2671209.369:9): avc: denied { remove_name } for pid=410 comm="cp" name="qseecomd" dev="rootfs" ino=8597 scontext=u:r:recovery:s0 tcontext=u:object_r:rootfs:s0 tclass=dir permissive=1
1101<5>[ 8.858736]@3 audit: type=1400 audit(2671209.369:10): avc: denied { unlink } for pid=410 comm="cp" name="qseecomd" dev="rootfs" ino=8597 scontext=u:r:recovery:s0 tcontext=u:object_r:rootfs:s0 tclass=file permissive=1
1102<5>[ 8.858767]@3 audit: type=1400 audit(2671209.369:11): avc: denied { add_name } for pid=410 comm="cp" name="qseecomd" scontext=u:r:recovery:s0 tcontext=u:object_r:rootfs:s0 tclass=dir permissive=1
1103<5>[ 8.877517]@3 random: sed urandom read with 90 bits of entropy available
1104<11>[ 8.981286]@2 init: cannot expand '${ro.product.model}' while writing to '/sys/class/android_usb/android0/iProduct'
1105<11>[ 8.991820]@2 init: avc: denied { set } for property=crypto.using_system_libs scontext=u:r:recovery:s0 tcontext=u:object_r:vold_prop:s0 tclass=property_service
1106<3>[ 9.005902]@3 functions_store: android_usb: functions_store'adb'
1107<12>[ 9.006906]@2 setup_decrypt: Using system decryption libraries!
1108<13>[ 9.017938]@3 init: Service 'setup-decrypt' (pid 400) exited with status 0
1109<11>[ 9.025031]@3 init: property_set("ro.build.product", "OnePlus3") failed
1110<11>[ 9.031106]@3 init: property_set("ro.build.user", "OnePlus") failed
1111<11>[ 9.037338]@3 init: property_set("ro.build.flavor", "OnePlus3-user") failed
1112<11>[ 9.044295]@3 init: property_set("ro.build.description", "OnePlus3-user 7.0 NRD90M 138 dev-keys") failed
1113<11>[ 9.053838]@3 init: property_set("ro.product.brand", "OnePlus") failed
1114<11>[ 9.060452]@3 init: property_set("ro.product.manufacturer", "OnePlus") failed
1115<11>[ 9.067480]@3 init: property_set("ro.build.id", "NRD90M") failed
1116<11>[ 9.073377]@3 init: property_set("ro.build.version.incremental", "138") failed
1117<11>[ 9.080579]@3 init: property_set("ro.build.version.sdk", "24") failed
1118<11>[ 9.086990]@3 init: property_set("ro.build.version.preview_sdk", "0") failed
1119<11>[ 9.094034]@3 init: property_set("ro.build.version.codename", "REL") failed
1120<11>[ 9.100979]@3 init: property_set("ro.build.version.all_codenames", "REL") failed
1121<11>[ 9.108344]@3 init: property_set("ro.build.version.release", "7.0") failed
1122<11>[ 9.115389]@3 init: property_set("ro.build.version.security_patch", "2016-12-01") failed
1123<11>[ 9.123288]@3 init: property_set("ro.build.version.base_os", "") failed
1124<11>[ 9.129871]@3 init: property_set("ro.build.date", "Sat Jan 14 01:21:58 CST 2017") failed
1125<11>[ 9.137963]@3 init: property_set("ro.build.date.utc", "1484328118") failed
1126<11>[ 9.144815]@3 init: property_set("ro.build.type", "user") failed
1127<11>[ 9.150805]@3 init: property_set("ro.build.host", "ubuntu-23") failed
1128<11>[ 9.157217]@3 init: property_set("ro.build.tags", "release-keys") failed
1129<11>[ 9.164097]@3 init: property_set("ro.product.board", "QC_Reference_Phone") failed
1130<11>[ 9.171377]@3 init: property_set("ro.product.cpu.abi", "arm64-v8a") failed
1131<11>[ 9.178222]@3 init: property_set("ro.product.cpu.abilist", "arm64-v8a,armeabi-v7a,armeabi") failed
1132<11>[ 9.187183]@3 init: property_set("ro.product.cpu.abilist32", "armeabi-v7a,armeabi") failed
1133<11>[ 9.195429]@3 init: property_set("ro.product.cpu.abilist64", "arm64-v8a") failed
1134<11>[ 9.202802]@3 init: property_set("ro.product.locale", "en-US") failed
1135<11>[ 9.209212]@3 init: property_set("ro.wifi.channels", "") failed
1136<11>[ 9.215317]@3 init: property_set("ro.board.platform", "msm8996") failed
1137<11>[ 9.221724]@3 init: property_set("ro.build.characteristics", "nosdcard") failed
1138<11>[ 9.229525]@3 init: property_set("ro.com.android.dataroaming", "false") failed
1139<11>[ 9.236228]@3 init: property_set("ro.config.ringtone", "oneplus_tune.ogg") failed
1140<11>[ 9.243692]@3 init: property_set("ro.config.notification_sound", "meet.ogg") failed
1141<11>[ 9.251326]@3 init: property_set("ro.config.alarm_alert", "spring.ogg") failed
1142<11>[ 9.258519]@3 init: property_set("ro.carrier", "unknown") failed
1143<11>[ 9.264728]@3 init: property_set("ro.frp.pst", "/dev/block/bootdevice/by-name/frp") failed
1144<11>[ 9.272785]@3 init: property_set("ro.qc.sdk.audio.fluencetype", "none") failed
1145<13>[ 9.280164]@3 init: (Loading properties from /system/build.prop took 0.26s.)
1146<13>[ 9.287017]@3 init: (Loading properties from /vendor/build.prop took 0.00s.)
1147<13>[ 9.294051]@3 init: (Loading properties from /factory/factory.prop took 0.00s.)
1148<13>[ 9.303095]@3 init: (Loading properties from /data/local.prop took 0.00s.)
1149<11>[ 9.308946]@3 init: Unable to open persistent property directory "/data/property": No such file or directory
1150<11>[ 9.318857]@0 init: property_set("ro.display.series", "OnePlus 3T") failed
1151<13>[ 9.325897]@3 init: Starting service 'set_permissive'...
1152<13>[ 9.331060]@3 init: Starting service 'recovery'...
1153<3>[ 9.336191]@3 functions_store: android_usb: functions_store'mtp,adb'
1154<13>[ 9.342163]@3 init: Service 'set_permissive' (pid 419) exited with status 0
1155<13>[ 9.349067]@3 init: Starting service 'adbd'...
1156<11>[ 9.353696]@3 init: avc: denied { set } for property=twrp.crash_counter scontext=u:r:recovery:s0 tcontext=u:object_r:default_prop:s0 tclass=property_service
1157<6>[ 9.355210]@0 ep0_open success!
1158<6>[ 9.355221]@0 read descriptors
1159<6>[ 9.355235]@0 read strings
1160<6>[ 9.355251]@0 mtp_bind_config
1161<6>[ 9.355260]@0 mtp_create_bulk_endpoints: useFixAddr:false
1162<3>[ 9.385129]@3 dwc3 6a00000.dwc3: request ffffffc172a1f200 was not queued to ep0out
1163<13>[ 9.392421]@3 init: Service 'adbd' is being killed...
1164<6>[ 9.397413]@3 mtp_bind_config
1165<6>[ 9.400331]@0 mtp_create_bulk_endpoints: useFixAddr:false
1166<3>[ 9.405826]@0 ffs_function_bind_config: ffs_function_bind_config(): usb_add_function() fails (err:-19) for ffs
1167<3>[ 9.415754]@2 android_bind_enabled_functions: android_bind_enabled_functions: ffs failed
1168<3>[ 9.423740]@2 android_enable: android_enable: usb_add_config failed : err: -19
1169<4>[ 9.426893]@0 mdss_dsi_on start
1170<6>[ 9.426898]@0 get_param_by_index_and_offset[75] sid_index = 2 offset = 32 buf = ffffffc173154f70 length = 4
1171<3>[ 9.426902]@0 mdss_dsi_on:srgb mode 0
1172<6>[ 9.426904]@0 get_param_by_index_and_offset[75] sid_index = 2 offset = 36 buf = ffffffc173154fb8 length = 4
1173<3>[ 9.426906]@0 mdss_dsi_on:srgb mode 0
1174<6>[ 9.426908]@0 get_param_by_index_and_offset[75] sid_index = 2 offset = 40 buf = ffffffc173155000 length = 4
1175<3>[ 9.426910]@0 mdss_dsi_on:srgb mode 0
1176<4>[ 9.426914]@0 mdss_dsi_on end
1177<3>[ 9.477336]@2 enable_store: enable_store: android_enable failed
1178<3>[ 9.483265]@0 dwc3 6a00000.dwc3: request ffffffc172a1f200 was not queued to ep0out
1179<4>[ 9.490810]@0 ------------[ cut here ]------------
1180<4>[ 9.495565]@0 WARNING: CPU: 0 PID: 425 at ../drivers/usb/gadget/composite.c:1028 0xffffffc0005a81e4()
1181<4>[ 9.504767]@0 CPU: 0 PID: 425 Comm: adbd Not tainted 3.18.31-twrp-3.0 #1
1182<4>[ 9.511452]@0 Hardware name: Qualcomm Technologies, Inc. MSM 8996pro + PMI8996 MTP (DT)
1183<0>[ 9.519439]@0 Call trace:
1184<4>[ 9.522040]@0 [<ffffffc000088650>] 0xffffffc000088650
1185<4>[ 9.527077]@0 [<ffffffc000088754>] 0xffffffc000088754
1186<4>[ 9.532111]@0 [<ffffffc0008d8434>] 0xffffffc0008d8434
1187<4>[ 9.537144]@0 [<ffffffc00009f4e4>] 0xffffffc00009f4e4
1188<4>[ 9.542180]@0 [<ffffffc00009f5e8>] 0xffffffc00009f5e8
1189<4>[ 9.547216]@0 [<ffffffc0005a81e4>] 0xffffffc0005a81e4
1190<4>[ 9.552250]@0 [<ffffffc0005d005c>] 0xffffffc0005d005c
1191<4>[ 9.557284]@0 [<ffffffc0005d0658>] 0xffffffc0005d0658
1192<4>[ 9.562318]@0 [<ffffffc0005b7250>] 0xffffffc0005b7250
1193<4>[ 9.567353]@0 [<ffffffc0005b7508>] 0xffffffc0005b7508
1194<4>[ 9.572389]@0 [<ffffffc0005b7590>] 0xffffffc0005b7590
1195<4>[ 9.577423]@0 [<ffffffc00017ffb0>] 0xffffffc00017ffb0
1196<4>[ 9.582461]@0 [<ffffffc0001800b8>] 0xffffffc0001800b8
1197<4>[ 9.587493]@0 [<ffffffc0000b7400>] 0xffffffc0000b7400
1198<4>[ 9.592528]@0 [<ffffffc0000a1ba4>] 0xffffffc0000a1ba4
1199<4>[ 9.597563]@0 [<ffffffc0000a20cc>] 0xffffffc0000a20cc
1200<4>[ 9.602600]@0 [<ffffffc0000abe1c>] 0xffffffc0000abe1c
1201<4>[ 9.607634]@0 [<ffffffc000087b98>] 0xffffffc000087b98
1202<4>[ 9.612668]@0 [<ffffffc000088210>] 0xffffffc000088210
1203<4>[ 9.617702]@0 ---[ end trace 09d9f08e91f68ee7 ]---
1204<13>[ 9.623115]@2 init: Service 'adbd' (pid 422) killed by signal 9
1205<13>[ 9.628426]@2 init: Service 'adbd' (pid 422) killing any children in process group
1206<4>[ 9.783236]@1 mdss_dsi_off start
1207<4>[ 9.812213]@1 mdss_dsi_off end
1208<4>[ 9.821943]@1 mdss_dsi_on start
1209<4>[ 9.858080]@1 mdss_dsi_on end
1210<4>[ 9.885434]@1 --------backlight level = 127---------
1211<4>[ 9.926280]@1 blank off start
1212<3>[ 9.926293]@1 fpc1020 soc:fpc_fpc1020: fb_notifier_callback screen off
1213<3>[ 9.926321]@1 synaptics,s3320: fb_notifier_callback blank[4],event[0x10]
1214<3>[ 9.926324]@1 synaptics,s3320: fb_notifier_callback : going TP suspend start
1215<3>[ 9.926328]@1 synaptics,s3320: synaptics_ts_suspend enter
1216<3>[ 9.926335]@1 synaptics,s3320: synaptics_ts_suspend normal end
1217<3>[ 9.926337]@1 synaptics,s3320: fb_notifier_callback : going TP suspend end
1218<4>[ 9.926442]@1 --------backlight level = 0---------
1219<6>[ 9.980718]@2 of_batterydata_get_best_profile: OP_3400mAH found
1220<6>[ 9.993185]@2 FG: fg_batt_profile_init: Battery SOC: 94, V: 4230169uV
1221<4>[ 10.129920]@1 mdss_dsi_off start
1222<4>[ 10.157160]@0 mdss_dsi_off end
1223<3>[ 10.159182]@1 synaptics,s3320: fb_notifier_callback blank[4],event[0x9]
1224<4>[ 10.159211]@1 blank off end
1225<4>[ 10.232194]@2 blank on start
1226<3>[ 10.232761]@2 fpc1020 soc:fpc_fpc1020: fb_notifier_callback screen on
1227<3>[ 10.232781]@2 synaptics,s3320: fb_notifier_callback blank[0],event[0x10]
1228<3>[ 10.232785]@2 synaptics,s3320: fb_notifier_callback going TP resume start
1229<3>[ 10.232788]@2 synaptics,s3320: synaptics_ts_resume enter!
1230<3>[ 10.232803]@2 synaptics,s3320: synaptics_ts_resume:normal end!
1231<3>[ 10.232804]@2 synaptics,s3320: fb_notifier_callback going TP resume end
1232<4>[ 10.234307]@0 mdss_dsi_on start
1233<3>[ 10.240052]@1 synaptics,s3320: tp_baseline_get start!
1234<3>[ 10.262070]@1 sps: BAM device 0x0000000007584000 is not registered yet.
1235<6>[ 10.262269]@1 sps:BAM 0x0000000007584000 is registered.
1236<6>sps:BAM 0x0000000007584000 (va:0xffffff8006300000) enabled: ver:0x19, number of pipes:24
1237<4>[ 10.267101]@0 mdss_dsi_on end
1238<4>[ 10.288789]@0 --------backlight level = 127---------
1239<6>[ 10.289919]@0 BQ: bq27541_set_lcd_off_status: off=0
1240<3>[ 10.290149]@0 synaptics,s3320: fb_notifier_callback blank[0],event[0x9]
1241<4>[ 10.290153]@0 blank on end
1242<3>[ 10.305529]@1 synaptics,s3320: enter reset tp status,and ts->in_gesture_mode is:0
1243<3>[ 10.305534]@1 synaptics,s3320: synaptics_init_panel is called!
1244<3>[ 10.305791]@1 synaptics,s3320: synaptics_mode_change: set TP to mode[0x80]
1245<3>[ 10.370316]@1 synaptics,s3320: synaptics_tpedge_limitfunc limit_enable =1,mode:0x4b !
1246<3>[ 10.370531]@1 synaptics,s3320: tp_baseline_get end!
1247<3>[ 10.415282]@3 mdss_dsi_post_panel_on:+
1248<3>[ 10.431586]@3 mdss_dsi_post_panel_on:-
1249<3>[ 10.477913]@2 F2FS-fs (sda15): Unrecognized mount option "noatime" or missing value
1250<3>[ 10.484580]@2 F2FS-fs (sda15): Unrecognized mount option "noatime" or missing value
1251<7>[ 10.527511]@3 SELinux: initialized (dev sda15, type f2fs), uses xattr
1252<3>[ 10.558612]@2 F2FS-fs (sda15): Unrecognized mount option "noatime" or missing value
1253<3>[ 10.565274]@2 F2FS-fs (sda15): Unrecognized mount option "noatime" or missing value
1254<7>[ 10.607406]@3 SELinux: initialized (dev sda15, type f2fs), uses xattr
1255<3>[ 10.637743]@3 F2FS-fs (sda15): Unrecognized mount option "noatime" or missing value
1256<3>[ 10.644416]@3 F2FS-fs (sda15): Unrecognized mount option "noatime" or missing value
1257<7>[ 10.685404]@3 SELinux: initialized (dev sda15, type f2fs), uses xattr
1258<3>[ 10.715651]@3 F2FS-fs (sda15): Unrecognized mount option "noatime" or missing value
1259<3>[ 10.722317]@3 F2FS-fs (sda15): Unrecognized mount option "noatime" or missing value
1260<7>[ 10.763291]@3 SELinux: initialized (dev sda15, type f2fs), uses xattr
1261<6>[ 10.777300]@3 EXT4-fs (sda3): mounted filesystem with ordered data mode. Opts:
1262<7>[ 10.783617]@3 SELinux: initialized (dev sda3, type ext4), uses xattr
1263<6>[ 10.784039]@3 SELinux: Context u:object_r:cache_recovery_file:s0 is not valid (left unmapped).
1264<6>[ 10.822410]@3 SELinux: Context u:object_r:audioserver_data_file:s0 is not valid (left unmapped).
1265<6>[ 10.831399]@3 SELinux: Context u:object_r:boottrace_data_file:s0 is not valid (left unmapped).
1266<6>[ 10.839482]@3 SELinux: Context u:object_r:update_engine_data_file:s0 is not valid (left unmapped).
1267<6>[ 10.848517]@3 SELinux: Context u:object_r:method_trace_data_file:s0 is not valid (left unmapped).
1268<6>[ 10.858051]@3 SELinux: Context u:object_r:user_profile_data_file:s0 is not valid (left unmapped).
1269<6>[ 10.867022]@3 SELinux: Context u:object_r:user_profile_foreign_dex_data_file:s0 is not valid (left unmapped).
1270<6>[ 10.876685]@3 SELinux: Context u:object_r:user_profile_foreign_dex_data_file:s0:c512,c768 is not valid (left unmapped).
1271<5>[ 11.202542]@0 random: nonblocking pool is initialized
1272<6>[ 11.241302]@1 SELinux: Context u:object_r:profman_dump_data_file:s0 is not valid (left unmapped).
1273<6>[ 11.251417]@1 SELinux: Context u:object_r:qfp-daemon_data_file:s0 is not valid (left unmapped).
1274<6>[ 11.263263]@0 SELinux: Context u:object_r:data_qsee_file:s0 is not valid (left unmapped).
1275<6>[ 11.275580]@1 SELinux: Context u:object_r:ipacm_data_file:s0 is not valid (left unmapped).
1276<6>[ 11.284405]@1 SELinux: Context u:object_r:port_bridge_data_file:s0 is not valid (left unmapped).
1277<6>[ 11.293876]@1 SELinux: Context u:object_r:data_test_data_file:s0 is not valid (left unmapped).
1278<6>[ 11.308703]@1 SELinux: Context u:object_r:display_misc_file:s0 is not valid (left unmapped).
1279<6>[ 11.317707]@1 SELinux: Context u:object_r:location_data_file:s0 is not valid (left unmapped).
1280<6>[ 11.327098]@1 SELinux: Context u:object_r:location_socket:s0 is not valid (left unmapped).
1281<3>[ 11.340352]@3 switch_dev_work ,tristatekey set to state(3)
1282<6>[ 11.340556]@1 SELinux: Context u:object_r:fm_data_file:s0 is not valid (left unmapped).
1283<6>[ 11.341394]@1 SELinux: Context u:object_r:RIDL_data_file:s0 is not valid (left unmapped).
1284<6>[ 11.344858]@1 SELinux: Context u:object_r:RIDL_socket:s0 is not valid (left unmapped).
1285<6>[ 11.348529]@1 SELinux: Context u:object_r:iop_data_file:s0 is not valid (left unmapped).
1286<6>[ 11.349742]@1 SELinux: Context u:object_r:qti_logkit_priv_data_file:s0 is not valid (left unmapped).
1287<6>[ 11.351195]@1 SELinux: Context u:object_r:qti_logkit_pub_data_file:s0 is not valid (left unmapped).
1288<6>[ 11.351970]@1 SELinux: Context u:object_r:qti_logkit_priv_socket:s0 is not valid (left unmapped).
1289<6>[ 11.352735]@1 SELinux: Context u:object_r:qti_logkit_pub_socket:s0 is not valid (left unmapped).
1290<6>[ 11.354235]@1 SELinux: Context u:object_r:wapi_data_file:s0 is not valid (left unmapped).
1291<6>[ 11.355006]@1 SELinux: Context u:object_r:dts_data_file:s0 is not valid (left unmapped).
1292<6>[ 11.355743]@1 SELinux: Context u:object_r:seemp_file:s0 is not valid (left unmapped).
1293<6>[ 11.356934]@1 SELinux: Context u:object_r:tlocd_data_file:s0 is not valid (left unmapped).
1294<6>[ 11.357680]@1 SELinux: Context u:object_r:qvop_data_file:s0 is not valid (left unmapped).
1295<6>[ 11.358418]@1 SELinux: Context u:object_r:qvrd_data_file:s0 is not valid (left unmapped).
1296<6>[ 11.359154]@1 SELinux: Context u:object_r:audio_pp_data_file:s0 is not valid (left unmapped).
1297<6>[ 11.359903]@1 SELinux: Context u:object_r:bootstat_data_file:s0 is not valid (left unmapped).
1298<6>[ 11.685548]@0 SELinux: Context u:object_r:qsee_svc_app_data_file:s0 is not valid (left unmapped).
1299<3>[ 11.920156]@1 SMBCHG: smbchg_re_det_chg_type: Re-detect charger type
1300<6>[ 11.925536]@1 SMBCHG: smbchg_set_usb_current_max: USB current_ma = 300, typeC_support_current_ma = 4000
1301<3>[ 11.935038]@1 SMBCHG: smbchg_re_det_chg_type: Faking Removal
1302<6>[ 11.940863]@3 SMBCHG: usbin_uv_handler: triggered
1303<6>[ 11.940903]@1 SMBCHG: src_detect_handler: chip->usb_present = 1 usb_present = 0 src_detect = 0 hvdcp_3_det_ignore_uv=0
1304<6>[ 11.940952]@1 SMBCHG: handle_usb_removal: triggered
1305<6>[ 11.941661]@1 SMBCHG: smbchg_usb_update_online_work: chip->usb_online = 1, online = 0
1306<3>[ 11.968690]@3 SMBCHG: usbin_uv_handler: chip->usb_present = 0 rt_sts = 0x01 hvdcp_3_det_ignore_uv = 0 aicl = 1500
1307<6>[ 12.060391]@3 msm-dwc3 6a00000.ssusb: DWC3 in low power mode
1308<6>[ 12.065038]@3 android_work: android_work: did not send uevent (0 0 (null))
1309<3>[ 12.480167]@1 SMBCHG: smbchg_re_det_chg_type: Faking Insertion
1310<6>[ 12.485238]@3 SMBCHG: usbin_uv_handler: triggered
1311<3>[ 12.489721]@3 SMBCHG: usbin_uv_handler: chip->usb_present = 0 rt_sts = 0x00 hvdcp_3_det_ignore_uv = 0 aicl = 1500
1312<6>[ 13.342813]@1 SMBCHG: src_detect_handler: chip->usb_present = 0 usb_present = 1 src_detect = 1 hvdcp_3_det_ignore_uv=0
1313<6>[ 13.352767]@1 SMBCHG: handle_usb_insertion: inserted type = 4 (SDP)
1314<6>[ 13.358861]@1 SMBCHG: smbchg_charging_en: enable=1
1315<6>[ 13.363958]@1 SMBCHG: smbchg_set_usb_current_max: USB current_ma = 500, typeC_support_current_ma = 4000
1316<6>[ 13.373793]@1 SMBCHG: smbchg_usb_update_online_work: chip->usb_online = 0, online = 1
1317<4>[ 13.455454]@1 audit_printk_skb: 306 callbacks suppressed
1318<5>[ 13.459752]@1 audit: type=1400 audit(2671213.969:114): avc: denied { getattr } for pid=421 comm="recovery" path="/data/app-private" dev="sda15" ino=77 scontext=u:r:recovery:s0 tcontext=u:object_r:apk_private_data_file:s0 tclass=dir permissive=1
1319<5>[ 13.482238]@1 audit: type=1400 audit(2671213.999:115): avc: denied { read } for pid=421 comm="recovery" name="app-private" dev="sda15" ino=77 scontext=u:r:recovery:s0 tcontext=u:object_r:apk_private_data_file:s0 tclass=dir permissive=1
1320<5>[ 13.503389]@1 audit: type=1400 audit(2671214.019:116): avc: denied { open } for pid=421 comm="recovery" path="/data/app-private" dev="sda15" ino=77 scontext=u:r:recovery:s0 tcontext=u:object_r:apk_private_data_file:s0 tclass=dir permissive=1
1321<3>[ 13.506521]@0 msm-usb-ssphy-qmp 7410000.ssphy: QMP PHY initialization timeout
1322<3>[ 13.506526]@0 msm-usb-ssphy-qmp 7410000.ssphy: USB3_PHY_PCS_STATUS:69696969
1323<6>[ 13.506640]@0 msm-dwc3 6a00000.ssusb: DWC3 exited from low power mode
1324<5>[ 13.547543]@2 audit: type=1400 audit(2671214.059:117): avc: denied { getattr } for pid=421 comm="recovery" path="/data/app-asec" dev="sda15" ino=81 scontext=u:r:recovery:s0 tcontext=u:object_r:asec_image_file:s0 tclass=dir permissive=1
1325<5>[ 13.567671]@2 audit: type=1400 audit(2671214.079:118): avc: denied { read } for pid=421 comm="recovery" name="app-asec" dev="sda15" ino=81 scontext=u:r:recovery:s0 tcontext=u:object_r:asec_image_file:s0 tclass=dir permissive=1
1326<5>[ 13.587949]@2 audit: type=1400 audit(2671214.099:119): avc: denied { open } for pid=421 comm="recovery" path="/data/app-asec" dev="sda15" ino=81 scontext=u:r:recovery:s0 tcontext=u:object_r:asec_image_file:s0 tclass=dir permissive=1
1327<5>[ 13.611150]@2 audit: type=1400 audit(2671214.129:120): avc: denied { read } for pid=421 comm="recovery" name="app" dev="sda15" ino=85 scontext=u:r:recovery:s0 tcontext=u:object_r:apk_data_file:s0 tclass=dir permissive=1
1328<5>[ 13.629863]@2 audit: type=1400 audit(2671214.139:121): avc: denied { open } for pid=421 comm="recovery" path="/data/app" dev="sda15" ino=85 scontext=u:r:recovery:s0 tcontext=u:object_r:apk_data_file:s0 tclass=dir permissive=1
1329<5>[ 13.652108]@3 audit: type=1400 audit(2671214.169:122): avc: denied { getattr } for pid=421 comm="recovery" path="/data/property" dev="sda15" ino=87 scontext=u:r:recovery:s0 tcontext=u:object_r:property_data_file:s0 tclass=dir permissive=1
1330<5>[ 13.672479]@3 audit: type=1400 audit(2671214.189:123): avc: denied { read } for pid=421 comm="recovery" name="property" dev="sda15" ino=87 scontext=u:r:recovery:s0 tcontext=u:object_r:property_data_file:s0 tclass=dir permissive=1
1331<6>[ 13.791654]@1 SELinux: Context u:object_r:ota_data_file:s0 is not valid (left unmapped).
1332<6>[ 13.834789]@0 SELinux: Context u:object_r:mpctl_data_file:s0 is not valid (left unmapped).
1333<6>[ 13.843977]@0 SELinux: Context u:object_r:swap_data_file:s0 is not valid (left unmapped).
1334<6>[ 13.894531]@0 SELinux: Context u:object_r:ringtone_file:s0 is not valid (left unmapped).
1335<6>[ 14.168535]@1 SELinux: Context u:object_r:cnd_data_file:s0 is not valid (left unmapped).
1336<6>[ 14.177865]@1 SELinux: Context u:object_r:dpmd_data_file:s0 is not valid (left unmapped).
1337<6>[ 14.189111]@1 SELinux: Context u:object_r:time_data_file:s0 is not valid (left unmapped).
1338<6>[ 14.203746]@0 SELinux: Context u:object_r:oem_data_file:s0 is not valid (left unmapped).
1339<6>[ 14.213459]@1 SELinux: Context u:object_r:fpc_images_file:s0 is not valid (left unmapped).
1340<6>[ 14.223345]@1 SELinux: Context u:object_r:fpc_data_file:s0 is not valid (left unmapped).
1341<6>[ 14.232069]@1 SELinux: Context u:object_r:coredump_data_file:s0 is not valid (left unmapped).
1342<6>[ 14.240601]@1 SELinux: Context u:object_r:theme_data_file:s0 is not valid (left unmapped).
1343<6>[ 14.249903]@1 SELinux: Context u:object_r:usf_data_file:s0 is not valid (left unmapped).
1344<13>[ 14.640215]@0 init: Starting service 'adbd'...
1345<6>[ 14.645827]@0 ep0_open success!
1346<6>[ 14.647979]@0 read descriptors
1347<6>[ 14.651152]@3 read strings
1348<6>[ 14.653701]@3 mtp_bind_config
1349<6>[ 14.656640]@3 mtp_create_bulk_endpoints: useFixAddr:false
1350<6>[ 14.859247]@0 android_work: android_work: sent uevent USB_STATE=CONNECTED
1351<6>[ 14.865121]@0 SMBCHG: notify_usb_enumeration_function: status=1
1352<6>[ 14.885211]@0 android_usb gadget: high-speed config #1: 66bf0c8.android_usb
1353<6>[ 14.891335]@0 usb_gadget_vbus_draw USB setting current is 500mA
1354<6>[ 14.897087]@0 msm-dwc3 6a00000.ssusb: Avail curr from USB = 500
1355<6>[ 14.907478]@0 SMBCHG: set_chg_ibat_vbat_max: vote ibatmax = 1910 and set vbatmax = 4370
1356<6>[ 14.914692]@0 SMBCHG: smbchg_set_fastchg_current_raw: fastcharge current requested 1910, set to 1900
1357<6>[ 14.939768]@0 SMBCHG: qpnp_battery_temp_region_set: set temp_region = 5
1358<6>[ 14.945620]@0 SMBCHG: set_chg_ibat_vbat_max: vote ibatmax = 1910 and set vbatmax = 4370
1359<6>[ 14.953617]@0 SMBCHG: smbchg_external_power_changed: change usb_target_current_ma = 500
1360<6>[ 14.961548]@0 android_work: android_work: sent uevent USB_STATE=CONFIGURED
1361<6>[ 14.968531]@0 SMBCHG: qpnp_battery_temp_region_set: set temp_region = 5
1362<6>[ 14.974846]@0 SMBCHG: smbchg_external_power_changed: change usb_target_current_ma = 500
1363<4>[ 15.640133]@0 synap rmidev_create_attr
1364<6>[ 15.795909]@3 mtp_open
1365<4>[ 15.800282]@0 synap rmidev_create_attr
1366<6>[ 19.036610]@1 SMBCHG: update_heartbeat: inserted charger type = 4 (SDP), charger_type = 4
1367<6>[ 19.067459]@1 SMBCHG: update_heartbeat: charger_type:4,bat_voltage:4249,charger_voltage:5028,current:-303,temp:293,capacity:91
1368<3>[ 19.786505]@1 synaptics,s3320: start get base data:1
1369<3>[ 19.790484]@1 synaptics,s3320: tp_baseline_get start!
1370<3>[ 19.920561]@1 synaptics,s3320: synaptics_tpedge_limitfunc limit_enable =1,mode:0x4b !
1371<3>[ 19.927740]@1 synaptics,s3320: tp_baseline_get end!
1372<3>[ 19.932859]@1 synaptics,s3320: enter reset tp status,and ts->in_gesture_mode is:0
1373<3>[ 19.939800]@1 synaptics,s3320: synaptics_init_panel is called!
1374<3>[ 19.946067]@1 synaptics,s3320: synaptics_mode_change: set TP to mode[0x80]
1375<3>[20170121_06:21:59.365242]@0 synaptics,s3320: all finger up
1376<6>[20170121_06:21:59.574501]@1 get_param_by_index_and_offset[75] sid_index = 7 offset = 24 buf = ffffffc1730f7d00 length = 4
1377<6>[20170121_06:21:59.584470]@1 SMBCHG: charger_type_record: charger_type_record: charger_type_record: param_value = 20170121_06:21:59|1,dash_present=0
1378<6>[20170121_06:21:59.597586]@1 set_param_by_index_and_offset[99]sid_index = 7 offset = 168 buf = ffffffc1730f7d60 length = 4
1379<4>[20170121_06:21:59.608586]@1 audit_printk_skb: 156 callbacks suppressed
1380<5>[20170121_06:21:59.614575]@1 audit: type=1400 audit(1484979719.598:176): avc: denied { read write } for pid=163 comm="kworker/1:1" name="sda11" dev="tmpfs" ino=14646 scontext=u:r:kernel:s0 tcontext=u:object_r:block_device:s0 tclass=blk_file permissive=1
1381<5>[20170121_06:21:59.636930]@1 audit: type=1400 audit(1484979719.628:177): avc: denied { open } for pid=163 comm="kworker/1:1" path="/dev/block/sda11" dev="tmpfs" ino=14646 scontext=u:r:kernel:s0 tcontext=u:object_r:block_device:s0 tclass=blk_file permissive=1
1382<6>[20170121_06:21:59.665436]@1 set_param_by_index_and_offset[99]sid_index = 7 offset = 172 buf = ffffffc1730f7d64 length = 4
1383<6>[20170121_06:21:59.675734]@1 set_param_by_index_and_offset[99]sid_index = 7 offset = 176 buf = ffffffc1730f7d68 length = 4
1384<6>[20170121_06:21:59.686466]@1 set_param_by_index_and_offset[99]sid_index = 7 offset = 180 buf = ffffffc1730f7d6c length = 4
1385<6>[20170121_06:21:59.697237]@1 set_param_by_index_and_offset[99]sid_index = 7 offset = 184 buf = ffffffc1730f7d70 length = 4
1386<6>[20170121_06:21:59.707952]@1 set_param_by_index_and_offset[99]sid_index = 7 offset = 24 buf = ffffffc1730f7d00 length = 4
1387<5>[20170121_06:22:02.165039]@2 audit: type=1400 audit(1484979722.158:178): avc: denied { write } for pid=421 comm="recovery" name="0" dev="sda15" ino=4 scontext=u:r:recovery:s0 tcontext=u:object_r:media_rw_data_file:s0 tclass=dir permissive=1
1388<5>[20170121_06:22:02.185321]@2 audit: type=1400 audit(1484979722.178:179): avc: denied { add_name } for pid=421 comm="recovery" name="recovery.log" scontext=u:r:recovery:s0 tcontext=u:object_r:media_rw_data_file:s0 tclass=dir permissive=1
1389<5>[20170121_06:22:02.206237]@2 audit: type=1400 audit(1484979722.198:180): avc: denied { create } for pid=421 comm="recovery" name="recovery.log" scontext=u:r:recovery:s0 tcontext=u:object_r:media_rw_data_file:s0 tclass=file permissive=1
1390<5>[20170121_06:22:02.227176]@2 audit: type=1400 audit(1484979722.218:181): avc: denied { write } for pid=421 comm="recovery" path="/data/media/0/recovery.log" dev="sda15" ino=13448 scontext=u:r:recovery:s0 tcontext=u:object_r:media_rw_data_file:s0 tclass=file permissive=1
1391<5>[20170121_06:22:02.251373]@2 audit: type=1400 audit(1484979722.238:182): avc: denied { setattr } for pid=421 comm="recovery" name="recovery.log" dev="sda15" ino=13448 scontext=u:r:recovery:s0 tcontext=u:object_r:media_rw_data_file:s0 tclass=file permissive=1
1392<5>[20170121_06:22:02.273804]@3 audit: type=1400 audit(1484979722.258:183): avc: denied { relabelfrom } for pid=421 comm="recovery" name="recovery.log" dev="sda15" ino=13448 scontext=u:r:recovery:s0 tcontext=u:object_r:media_rw_data_file:s0 tclass=file permissive=1
1393<5>[20170121_06:22:02.297119]@3 audit: type=1400 audit(1484979722.288:184): avc: denied { relabelto } for pid=421 comm="recovery" name="recovery.log" dev="sda15" ino=13448 scontext=u:r:recovery:s0 tcontext=u:object_r:media_rw_data_file:s0 tclass=file permissive=1