· 9 years ago · Jan 21, 2017, 07:02 AM
1<6>[ 0.000000]@0 Initializing cgroup subsys cpu
2<6>[ 0.000000]@0 Initializing cgroup subsys cpuacct
3<5>[ 0.000000]@0 Linux version 3.18.31-twrp-3.0 (jc@westerley) (gcc version 6.2.1 20161016 (Linaro GCC 6.2-2016.11) ) #1 SMP PREEMPT Sat Jan 21 00:54:44 EST 2017
4<4>[ 0.000000]@0 CPU: AArch64 Processor [512f2011] revision 1
5<6>[ 0.000000]@0 alternatives: detected feature GIC system register CPU interface
6<6>[ 0.000000]@0 Machine: Qualcomm Technologies, Inc. MSM 8996pro + PMI8996 MTP
7<6>[ 0.000000]@0 efi: Getting EFI parameters from FDT:
8<6>[ 0.000000]@0 efi: UEFI not found.
9<6>[ 0.000000]@0 Reserved memory: reserved region for node 'removed_regions@85800000': base 0x0000000085800000, size 48 MiB
10<6>[ 0.000000]@0 Reserved memory: reserved region for node 'peripheral_region@8ea00000': base 0x000000008ea00000, size 45 MiB
11<6>[ 0.000000]@0 Reserved memory: reserved region for node 'modem_region@88800000': base 0x0000000088800000, size 98 MiB
12<6>[ 0.000000]@0 Reserved memory: reserved region for node 'dfps_data_mem@83400000': base 0x0000000083400000, size 0 MiB
13<6>[ 0.000000]@0 Reserved memory: reserved region for node 'cont_splash_mem@83401000': base 0x0000000083401000, size 35 MiB
14<6>[ 0.000000]@0 Reserved memory: reserved region for node 'ramoops_mem@ac000000': base 0x00000000ac000000, size 2 MiB
15<6>[ 0.000000]@0 Reserved memory: reserved region for node 'param_mem@ac200000': base 0x00000000ac200000, size 1 MiB
16<6>[ 0.000000]@0 Reserved memory: reserved region for node 'bootloader_log_mem@ac300000': base 0x00000000ac300000, size 1 MiB
17<6>[ 0.000000]@0 Reserved memory: reserved region for node 'mtp_mem@ac400000': base 0x00000000ac400000, size 1 MiB
18<6>[ 0.000000]@0 Reserved memory: reserved region for node 'cont_splash_mem_hdmi@b1c00000': base 0x00000000b1c00000, size 35 MiB
19<6>[ 0.000000]@0 Removed memory: created DMA memory pool at 0x0000000085800000, size 48 MiB
20<6>[ 0.000000]@0 Reserved memory: initialized node removed_regions@85800000, compatible id removed-dma-pool
21<6>[ 0.000000]@0 Removed memory: created DMA memory pool at 0x000000008ea00000, size 45 MiB
22<6>[ 0.000000]@0 Reserved memory: initialized node peripheral_region@8ea00000, compatible id removed-dma-pool
23<6>[ 0.000000]@0 Reserved memory: allocated memory for 'adsp_region' node: base 0x00000000ff800000, size 4 MiB
24<6>[ 0.000000]@0 Reserved memory: created CMA memory pool at 0x00000000ff800000, size 4 MiB
25<6>[ 0.000000]@0 Reserved memory: initialized node adsp_region, compatible id shared-dma-pool
26<6>[ 0.000000]@0 Reserved memory: allocated memory for 'qseecom_region' node: base 0x00000000fe400000, size 20 MiB
27<6>[ 0.000000]@0 Reserved memory: created CMA memory pool at 0x00000000fe400000, size 20 MiB
28<6>[ 0.000000]@0 Reserved memory: initialized node qseecom_region, compatible id shared-dma-pool
29<6>[ 0.000000]@0 Reserved memory: allocated memory for 'secure_region' node: base 0x00000000f8800000, size 92 MiB
30<6>[ 0.000000]@0 Reserved memory: created CMA memory pool at 0x00000000f8800000, size 92 MiB
31<6>[ 0.000000]@0 Reserved memory: initialized node secure_region, compatible id shared-dma-pool
32<6>[ 0.000000]@0 Removed memory: created DMA memory pool at 0x0000000088800000, size 98 MiB
33<6>[ 0.000000]@0 Reserved memory: initialized node modem_region@88800000, compatible id removed-dma-pool
34<6>[ 0.000000]@0 cma: Reserved 32 MiB at 0x00000000f6800000
35<7>[ 0.000000]@0 On node 0 totalpages: 1514064
36<7>[ 0.000000]@0 DMA zone: 11524 pages used for memmap
37<7>[ 0.000000]@0 DMA zone: 0 pages reserved
38<7>[ 0.000000]@0 DMA zone: 737536 pages, LIFO batch:31
39<7>[ 0.000000]@0 Normal zone: 12134 pages used for memmap
40<7>[ 0.000000]@0 Normal zone: 776528 pages, LIFO batch:31
41<6>[ 0.000000]@0 psci: probing for conduit method from DT.
42<6>[ 0.000000]@0 psci: PSCIv1.0 detected in firmware.
43<6>[ 0.000000]@0 psci: Using standard PSCI v0.2 function IDs
44<6>[ 0.000000]@0 psci: Initializing psci_cpu_init
45<6>[ 0.000000]@0 psci: Initializing psci_cpu_init
46<6>[ 0.000000]@0 psci: Initializing psci_cpu_init
47<6>[ 0.000000]@0 PERCPU: Embedded 13 pages/cpu @ffffffc17d717000 s22656 r0 d30592 u53248
48<7>[ 0.000000]@0 pcpu-alloc: s22656 r0 d30592 u53248 alloc=13*4096
49<7>[ 0.000000]@0 pcpu-alloc: [0] 0 [0] 1 [0] 2 [0] 3
50<4>[ 0.000000]@0 Built 1 zonelists in Zone order, mobility grouping on. Total pages: 1490406
51<5>[ 0.000000]@0 Kernel command line: sched_enable_hmp=1 sched_enable_power_aware=1 console=ttyHSL0,115200,n8 androidboot.console=ttyHSL0 androidboot.hardware=qcom androidboot.bootdevice=624000.ufshc androidboot.selinux=permissive user_debug=31 msm_rtb.filter=0x237 ehci-hcd.park=3 lpm_levels.sleep_disabled=1 cma=32M@0-0xffffffff enforcing=0 androidboot.bootdevice=624000.ufshc androidboot.verifiedbootstate=orange androidboot.veritymode=enforcing androidboot.keymaster=1 androidboot.serialno=51f752ea gpt androidboot.baseband=msm mdss_mdp.panel=1:dsi:0:qcom,mdss_dsi_samsung_s6e3fa5_1080p_cmd:1:none:cfg:single_dsi fpsimd.fpsimd_settings=0 app_setting.use_app_setting=0 androidboot.mode=recovery androidboot.ftm_mode=ftm_recovery androidboot.project_name=15811 androidboot.selinux=permissive androidboot.rf_version=32 androidboot.hw_version=28 ddr_manufacture_info=Samsung ddr_row0_info=16 androidboot.pcba_number=001581306C11032000005876 androidboot.enable_dm_verity=1 androidboot.secboot<6>PID hash table entries: 4096 (order: 3, 32768 bytes)
52<6>[ 0.000000]@0 Dentry cache hash table entries: 1048576 (order: 11, 8388608 bytes)
53<6>[ 0.000000]@0 Inode-cache hash table entries: 524288 (order: 10, 4194304 bytes)
54<4>[ 0.000000]@0 Memory: 5687748K/6056256K available (8620K kernel code, 1119K rwdata, 2080K rodata, 396K init, 3616K bss, 368508K reserved)
55<5>[ 0.000000]@0 Virtual kernel memory layout:
56<5> vmalloc : 0xffffff8000000000 - 0xffffffbdbfff0000 ( 246 GB)
57<5> vmemmap : 0xffffffbdc0000000 - 0xffffffbfc0000000 ( 8 GB maximum)
58<5> 0xffffffbdc0000000 - 0xffffffbdc5f65400 ( 95 MB actual)
59<5> PCI I/O : 0xffffffbffa000000 - 0xffffffbffb000000 ( 16 MB)
60<5> fixed : 0xffffffbffbdfd000 - 0xffffffbffbdff000 ( 8 KB)
61<5> modules : 0xffffffbffc000000 - 0xffffffc000000000 ( 64 MB)
62<5> memory : 0xffffffc000000000 - 0xffffffc17d950000 ( 6105 MB)
63<5> .init : 0xffffffc000af6000 - 0xffffffc000b59000 ( 396 KB)
64<5> .text : 0xffffffc000080000 - 0xffffffc000af5384 ( 10709 KB)
65<5> .data : 0xffffffc000b71000 - 0xffffffc000c88c00 ( 1119 KB)
66<6>[ 0.000000]@0 SLUB: HWalign=128, Order=0-3, MinObjects=0, CPUs=4, Nodes=1
67<6>[ 0.000000]@0 HMP scheduling enabled.
68<6>[ 0.000000]@0 Preemptible hierarchical RCU implementation.
69<6>[ 0.000000]@0 RCU dyntick-idle grace-period acceleration is enabled.
70<6>[ 0.000000]@0 NR_IRQS:64 nr_irqs:64 0
71<6>[ 0.000000]@0 CPU0: found redistributor 0 region 0:0x0000000009c00000
72<4>[ 0.000000]@0 mpm_init_irq_domain(): Cannot find irq controller for qcom,gpio-parent
73<3>[ 0.000000]@0 MPM 1 irq mapping errored -517
74<6>[ 0.000000]@0 Offload RCU callbacks from all CPUs
75<6>[ 0.000000]@0 Offload RCU callbacks from CPUs: 0-3.
76<6>[ 0.000000]@0 Architected cp15 and mmio timer(s) running at 19.20MHz (virt/virt).
77<6>[ 0.000000]@0 sched_clock: 56 bits at 19MHz, resolution 52ns, wraps every 3579139424256ns
78<6>[ 0.000014]@0 Switched to clocksource arch_sys_counter
79<6>[ 0.000634]@0 Calibrating delay loop (skipped), value calculated using timer frequency.. 38.40 BogoMIPS (lpj=192000)
80<6>[ 0.000647]@0 pid_max: default: 32768 minimum: 301
81<6>[ 0.000705]@0 Security Framework initialized
82<6>[ 0.000720]@0 SELinux: Initializing.
83<7>[ 0.000742]@0 SELinux: Starting in permissive mode
84<6>[ 0.000774]@0 Mount-cache hash table entries: 16384 (order: 5, 131072 bytes)
85<6>[ 0.000784]@0 Mountpoint-cache hash table entries: 16384 (order: 5, 131072 bytes)
86<6>[ 0.001239]@0 Initializing cgroup subsys freezer
87<4>[ 0.001504]@0 /cpus/cpu@0: Unknown CPU type
88<4>[ 0.001513]@0 /cpus/cpu@1: Unknown CPU type
89<4>[ 0.001521]@0 /cpus/cpu@100: Unknown CPU type
90<4>[ 0.001530]@0 /cpus/cpu@101: Unknown CPU type
91<6>[ 0.001537]@0 hw perfevents: enabled with arm/armv8-pmuv3 PMU driver, 9 counters available
92<6>[ 0.001552]@0 EFI services will not be available.
93<4>[ 0.009258]@0 NOHZ: local_softirq_pending 02
94<4>[ 0.010853]@0
95<4>**********************************************************
96<4>[ 0.010864]@0 ** NOTICE NOTICE NOTICE NOTICE NOTICE NOTICE NOTICE **
97<4>[ 0.010868]@0 ** **
98<4>[ 0.010872]@0 ** trace_printk() being used. Allocating extra memory. **
99<4>[ 0.010877]@0 ** **
100<4>[ 0.010881]@0 ** This means that this is a DEBUG kernel and it is **
101<4>[ 0.010885]@0 ** unsafe for produciton use. **
102<4>[ 0.010889]@0 ** **
103<4>[ 0.010893]@0 ** If you see this message and you are not debugging **
104<4>[ 0.010897]@0 ** the kernel, report this immediately to your vendor! **
105<4>[ 0.010901]@0 ** **
106<4>[ 0.010904]@0 ** NOTICE NOTICE NOTICE NOTICE NOTICE NOTICE NOTICE **
107<4>[ 0.010908]@0 **********************************************************
108<6>[ 0.012565]@0 MSM Memory Dump base table set up
109<6>[ 0.012591]@0 MSM Memory Dump apps data table set up
110<3>[ 0.012602]@0 hyp_assign_table is not functional as qcom_secure_mem is not allocated.
111<6>[ 0.012816]@0 clock-cpu-8996: configuring clocks for the perf cluster
112<6>[ 0.012955]@0 cpu_clock_8996_early_init: finished CPU clock configuration
113<6>[ 0.015448]@1 CPU1: found redistributor 1 region 0:0x0000000009c40000
114<6>[ 0.017967]@2 CPU2: found redistributor 100 region 0:0x0000000009c80000
115<6>[ 0.020372]@3 CPU3: found redistributor 101 region 0:0x0000000009cc0000
116<6>[ 0.020512]@0 Brought up 4 CPUs
117<6>[ 0.020529]@0 SMP: Total of 4 processors activated.
118<6>[ 0.023702]@0 DMI not present or invalid.
119<6>[ 0.030810]@2 pinctrl core: initialized pinctrl subsystem
120<6>[ 0.031160]@2 regulator-dummy: no parameters
121<6>[ 0.086062]@2 NET: Registered protocol family 16
122<6>[ 0.100099]@2 cpuidle: using governor ladder
123<6>[ 0.120076]@2 cpuidle: using governor menu
124<6>[ 0.140088]@2 cpuidle: using governor qcom
125<6>[ 0.140791]@2 vdso: 2 pages (1 code @ ffffffc000b79000, 1 data @ ffffffc000b78000)
126<6>[ 0.141248]@2 software IO TLB [mem 0xffc00000-0x100000000] (4MB) mapped at [ffffffc0bfc00000-ffffffc0bfffffff]
127<6>[ 0.142015]@2 DMA: preallocated 256 KiB pool for atomic allocations
128<6>[ 0.144465]@2 kernel boot_mode = normal[0]
129<6>[ 0.155587]@2 sps:sps is ready.
130<6>[ 0.156115]@2 i2c-msm-v2 75ba000.i2c: could not find pctldev for node /soc/pinctrl@01010000/i2c_12/i2c_12_active, deferring probe
131<6>[ 0.156741]@2 i2c-msm-v2 757a000.i2c: could not find pctldev for node /soc/pinctrl@01010000/i2c_6/i2c_6_active, deferring probe
132<6>[ 0.156994]@2 i2c-msm-v2 75b5000.i2c: could not find pctldev for node /soc/pinctrl@01010000/i2c_7/i2c_7_active, deferring probe
133<6>[ 0.157252]@2 i2c-msm-v2 7577000.i2c: could not find pctldev for node /soc/pinctrl@01010000/i2c_3/i2c_3_active, deferring probe
134<6>[ 0.157501]@2 i2c-msm-v2 75b6000.i2c: could not find pctldev for node /soc/pinctrl@01010000/i2c_8/i2c_8_active, deferring probe
135<4>[ 0.157871]@2 irq: no irq domain found for /soc/pinctrl@01010000 !
136<3>[ 0.159354]@2 cpu-clock-8996 6400000.qcom,cpu-clock-8996: resources init failed
137<3>[ 0.182580]@2 smd_channel_probe_now: allocation table not initialized
138<3>[ 0.182845]@2 smd_channel_probe_now: allocation table not initialized
139<3>[ 0.183093]@2 smd_channel_probe_now: allocation table not initialized
140<3>[ 0.183347]@2 smd_channel_probe_now: allocation table not initialized
141<6>[ 0.183565]@2 msm_watchdog 9830000.qcom,wdt: wdog absent resource not present
142<6>[ 0.183798]@2 msm_watchdog 9830000.qcom,wdt: MSM Watchdog Initialized
143<6>[ 0.184457]@2 msm_rpm_dev_probe: APSS-RPM communication over GLINK
144<3>[ 0.192019]@2 spmi_pmic_arb 400f000.qcom,spmi: PMIC Arb Version-2 0x20010000
145<3>[ 0.193396]@2 spmi_pmic_arb 400f000.qcom,spmi: missing property: qcom,pmic-arb-max-periph-interrupts
146<6>[ 0.197678]@2 pmi8994_s2: 400 <--> 1065 mV at 1000 mV normal idle
147<6>[ 0.198270]@2 platform 9300000.qcom,lpass: assigned reserved memory node peripheral_region@8ea00000
148<6>[ 0.198522]@2 platform ce0000.qcom,venus: assigned reserved memory node peripheral_region@8ea00000
149<6>[ 0.198923]@2 platform 1c00000.qcom,ssc: assigned reserved memory node peripheral_region@8ea00000
150<6>[ 0.199246]@2 platform 2080000.qcom,mss: assigned reserved memory node modem_region@88800000
151<6>[ 0.201727]@2 msm-thermal 70000.qcom,msm-thermal: msm_thermal:Failed reading node=/soc/qcom,msm-thermal, key=qcom,rpm-phase-resource-type err=-22. KTM continues
152<6>[ 0.201749]@2 msm-thermal 70000.qcom,msm-thermal: msm_thermal:Failed reading node=/soc/qcom,msm-thermal, key=qcom,gfx-sensor-id. err=-22. KTM continues
153<6>[ 0.201767]@2 msm-thermal 70000.qcom,msm-thermal: probe_vdd_mx:Failed reading node=/soc/qcom,msm-thermal, key=qcom,mx-restriction-temp. KTM continues
154<6>[ 0.201780]@2 msm-thermal 70000.qcom,msm-thermal: probe_psm:Failed reading node=/soc/qcom,msm-thermal, key=qcom,pmic-sw-mode-temp. err=-22. KTM continues
155<6>[ 0.201831]@2 msm_thermal:vdd_restriction_reg_init Defer regulator vdd-dig probe
156<3>[ 0.201838]@2 msm_thermal:probe_vdd_rstr Err regulator init. err:-517. KTM continues.
157<6>[ 0.201846]@2 msm-thermal 70000.qcom,msm-thermal: probe_vdd_rstr:Failed reading node=/soc/qcom,msm-thermal, key=qcom,max-freq-level. err=-517. KTM continues
158<3>[ 0.201855]@2 msm_thermal:msm_thermal_dev_probe Failed reading node=/soc/qcom,msm-thermal, key=qcom,online-hotplug-core. err:-517
159<6>[ 0.206374]@2 platform soc:qcom,msm-adsprpc-mem: assigned reserved memory node adsp_region
160<3>[ 0.209558]@0 smd_channel_probe_now: allocation table not initialized
161<6>[ 0.209754]@1 msm_rpm_trans_notify_state: glink config params: transport=(null), edge=rpm, name=rpm_requests
162<6>[ 0.210416]@3 msm_cache_erp64 6500000.qcom,cache_erp64: Registering for L1 error interrupts
163<6>[ 0.210511]@3 msm_cache_erp64 6500000.qcom,cache_erp64: Registering for L2 error interrupts
164<6>[ 0.210665]@3 msm_cache_erp64 6500000.qcom,cache_erp64: Registering for L3 error interrupts
165<6>[ 0.210908]@3 msm_m4m_erp 9a40000.qcom,m4m_erp64: Registering for M4M error interrupts
166<6>[ 0.214628]@3 console [pstore-1] enabled
167<6>[ 0.214741]@3 pstore: Registered ramoops as persistent store backend
168<6>[ 0.214751]@3 ramoops: attached 0x200000@0xac000000, ecc: 0/0
169<3>[ 0.214880]@3 XCB bootloader_log_probe
170<6>[ 0.215088]@3 bootloader_log!
171<6>[ 0.216024]@3 apc0_pwrcl_mem_acc_corner: 0 <--> 0 mV
172<6>[ 0.216384]@3 apc1_perfcl_mem_acc_corner: 0 <--> 0 mV
173<6>[ 0.216701]@3 apcc_l3_mem_acc_corner: 0 <--> 0 mV
174<6>[ 0.217026]@3 gfx_mem_acc_corner: 0 <--> 0 mV
175<6>[ 0.217410]@3 kryo0-retention: 468 <--> 892 mV at 520 mV
176<6>[ 0.217596]@3 kryo0: 468 <--> 892 mV at 754 mV
177<6>[ 0.217740]@3 kryo_regulator_probe: kryo0: default LDO functional volt=754021 uV, LDO retention volt=521789 uV, Vref func=325285 + 4466*(val), cluster-num=0
178<6>[ 0.218031]@3 kryo1-retention: 468 <--> 892 mV at 520 mV
179<6>[ 0.218215]@3 kryo1: 468 <--> 892 mV at 754 mV
180<6>[ 0.218357]@3 kryo_regulator_probe: kryo1: default LDO functional volt=754021 uV, LDO retention volt=521789 uV, Vref func=325285 + 4466*(val), cluster-num=1
181<6>[ 0.222557]@3 platform soc:qcom,kgsl-hyp: assigned reserved memory node peripheral_region@8ea00000
182<3>[ 0.223817]@3 msm_mpm_dev_probe(): Cannot get clk resource for XO: -517
183<4>[ 0.241428]@3 __of_mpm_init(): MPM driver mapping exists
184<6>[ 0.243225]@2 i2c-msm-v2 75ba000.i2c: probing driver i2c-msm-v2
185<3>[ 0.243380]@2 i2c-msm-v2 75ba000.i2c: error on clk_get(core_clk):-517
186<3>[ 0.243394]@2 i2c-msm-v2 75ba000.i2c: error probe() failed with err:-517
187<6>[ 0.243696]@2 i2c-msm-v2 757a000.i2c: probing driver i2c-msm-v2
188<3>[ 0.243754]@2 i2c-msm-v2 757a000.i2c: error on clk_get(core_clk):-517
189<3>[ 0.243766]@2 i2c-msm-v2 757a000.i2c: error probe() failed with err:-517
190<6>[ 0.244055]@2 i2c-msm-v2 75b5000.i2c: probing driver i2c-msm-v2
191<3>[ 0.244110]@2 i2c-msm-v2 75b5000.i2c: error on clk_get(core_clk):-517
192<3>[ 0.244122]@2 i2c-msm-v2 75b5000.i2c: error probe() failed with err:-517
193<6>[ 0.244408]@2 i2c-msm-v2 7577000.i2c: probing driver i2c-msm-v2
194<3>[ 0.244464]@2 i2c-msm-v2 7577000.i2c: error on clk_get(core_clk):-517
195<3>[ 0.244477]@2 i2c-msm-v2 7577000.i2c: error probe() failed with err:-517
196<6>[ 0.244727]@2 i2c-msm-v2 75b6000.i2c: probing driver i2c-msm-v2
197<3>[ 0.244784]@2 i2c-msm-v2 75b6000.i2c: error on clk_get(core_clk):-517
198<3>[ 0.244795]@2 i2c-msm-v2 75b6000.i2c: error probe() failed with err:-517
199<3>[ 0.244947]@2 cpu-clock-8996 6400000.qcom,cpu-clock-8996: resources init failed
200<6>[ 0.245682]@2 pm8994_s1_corner: 0 <--> 0 mV at 0 mV normal idle
201<6>[ 0.246110]@2 pm8994_s1_floor_corner: 0 <--> 0 mV at 0 mV normal idle
202<6>[ 0.246483]@2 pm8994_s1_corner_ao: 0 <--> 0 mV at 0 mV normal idle
203<6>[ 0.246897]@2 pm8994_s2_corner: 0 <--> 0 mV at 0 mV normal idle
204<6>[ 0.247266]@2 pm8994_s2_corner_ao: 0 <--> 0 mV at 0 mV normal idle
205<6>[ 0.247675]@2 pm8994_s3: 1300 mV normal idle
206<6>[ 0.248092]@2 pm8994_s4: 1800 mV normal idle
207<6>[ 0.248505]@2 pm8994_s5: 2150 mV normal idle
208<6>[ 0.248931]@2 pm8994_s7: 800 mV normal idle
209<6>[ 0.249330]@2 pm8994_l1: 1000 mV normal idle
210<6>[ 0.249753]@2 pm8994_l2: 1250 mV normal idle
211<6>[ 0.250372]@2 pm8994_l3: 1100 mV normal idle
212<6>[ 0.250790]@2 pm8994_l4: 1225 mV normal idle
213<6>[ 0.251195]@2 pm8994_l6: 1200 mV normal idle
214<6>[ 0.251604]@2 pm8994_l8: 1800 mV normal idle
215<6>[ 0.252000]@2 pm8994_l9: 1800 mV normal idle
216<6>[ 0.252413]@2 pm8994_l10: 1800 mV normal idle
217<6>[ 0.252812]@2 pm8994_l11: 1150 mV normal idle
218<6>[ 0.253226]@2 pm8994_l12: 1800 mV normal idle
219<6>[ 0.253965]@2 pm8994_l13: 29500 <--> 2950 mV at 2950 mV normal idle
220<6>[ 0.254380]@2 pm8994_l15: 1800 mV normal idle
221<6>[ 0.254780]@2 pm8994_l16: 2700 mV normal idle
222<6>[ 0.255193]@2 pm8994_l17: 2600 mV normal idle
223<6>[ 0.255593]@2 pm8994_l18: 3300 mV normal idle
224<6>[ 0.256009]@2 pm8994_l19: 3000 mV normal idle
225<6>[ 0.256407]@2 pm8994_l20: 2950 mV normal idle
226<6>[ 0.256818]@2 pm8994_l21: 2950 mV normal idle
227<6>[ 0.257216]@2 pm8994_l22: 3000 <--> 3300 mV at 3000 mV normal idle
228<6>[ 0.257624]@2 pm8994_l23: 2800 mV normal idle
229<6>[ 0.258027]@2 pm8994_l24: 3075 mV normal idle
230<6>[ 0.258440]@2 pm8994_l25: 1200 mV normal idle
231<6>[ 0.259094]@2 pm8994_l26_corner: 0 <--> 0 mV at 0 mV normal idle
232<6>[ 0.259456]@2 pm8994_l26_floor_corner: 0 <--> 0 mV at 0 mV normal idle
233<6>[ 0.259875]@2 pm8994_l27: 1000 <--> 1200 mV at 1030 mV normal idle
234<6>[ 0.260328]@2 pm8994_l28: 925 mV normal idle
235<6>[ 0.260944]@2 pm8994_l29: 2800 mV normal idle
236<6>[ 0.261358]@2 pm8994_l30: 1800 mV normal idle
237<6>[ 0.261771]@2 pm8994_l32: 1800 mV normal idle
238<6>[ 0.262163]@2 pm8994_lvs1: no parameters
239<6>[ 0.262534]@2 pm8994_lvs2: no parameters
240<6>[ 0.262911]@2 pmi8994_s1: 1025 mV normal idle
241<6>[ 0.263302]@2 pmi8994_boost_5v: no parameters
242<3>[ 0.263394]@2 qcom,rpm-smd-regulator soc:qcom,rpm-smd:rpm-regulator-bstb:regulator-bst: Failed to find supply parent
243<3>[ 0.263492]@2 rpm_vreg_device_probe: regulator_register failed: pmi8994_boost_5v, rc=-517
244<6>[ 0.263775]@2 pmi8994_boost_pin_ctrl: no parameters
245<3>[ 0.263825]@2 qcom,rpm-smd-regulator soc:qcom,rpm-smd:rpm-regulator-bstb:regulator-bst-pin-ctrl: Failed to find supply parent
246<3>[ 0.263911]@2 rpm_vreg_device_probe: regulator_register failed: pmi8994_boost_pin_ctrl, rc=-517
247<6>[ 0.264232]@2 pmi8994_boostbypass: 3150 <--> 3600 mV at 3150 mV normal idle
248<6>[ 0.264578]@2 pm8994_s11: 470 <--> 1140 mV at 905 mV normal idle
249<6>[ 0.264786]@2 pm8994_s11_avs_limit: 470 <--> 1140 mV
250<6>[ 0.264899]@2 spm_regulator_probe: name=pm8994_s11, range=LV, voltage=905000 uV, mode=AUTO, step rate=2400 uV/us
251<6>[ 0.265692]@2 msm-thermal 70000.qcom,msm-thermal: msm_thermal:Failed reading node=/soc/qcom,msm-thermal, key=qcom,rpm-phase-resource-type err=-22. KTM continues
252<6>[ 0.265712]@2 msm-thermal 70000.qcom,msm-thermal: msm_thermal:Failed reading node=/soc/qcom,msm-thermal, key=qcom,gfx-sensor-id. err=-22. KTM continues
253<6>[ 0.265725]@2 msm_thermal:sensor_mgr_init_threshold threshold id already initialized
254<6>[ 0.265740]@2 msm-thermal 70000.qcom,msm-thermal: probe_vdd_mx:Failed reading node=/soc/qcom,msm-thermal, key=qcom,mx-restriction-temp. KTM continues
255<6>[ 0.265755]@2 msm-thermal 70000.qcom,msm-thermal: probe_psm:Failed reading node=/soc/qcom,msm-thermal, key=qcom,pmic-sw-mode-temp. err=-22. KTM continues
256<6>[ 0.266067]@2 msm_thermal:vdd_restriction_reg_init Defer regulator vdd-gfx probe
257<3>[ 0.266082]@2 msm_thermal:probe_vdd_rstr Err regulator init. err:-517. KTM continues.
258<6>[ 0.266092]@2 msm-thermal 70000.qcom,msm-thermal: probe_vdd_rstr:Failed reading node=/soc/qcom,msm-thermal, key=qcom,max-freq-level. err=-517. KTM continues
259<3>[ 0.266105]@2 msm_thermal:msm_thermal_dev_probe Failed reading node=/soc/qcom,msm-thermal, key=qcom,online-hotplug-core. err:-517
260<3>[ 0.266585]@2 msm_mpm_dev_probe(): Cannot get clk resource for XO: -517
261<6>[ 0.267000]@2 i2c-msm-v2 75ba000.i2c: probing driver i2c-msm-v2
262<3>[ 0.267066]@2 i2c-msm-v2 75ba000.i2c: error on clk_get(core_clk):-517
263<3>[ 0.267080]@2 i2c-msm-v2 75ba000.i2c: error probe() failed with err:-517
264<6>[ 0.267355]@2 i2c-msm-v2 757a000.i2c: probing driver i2c-msm-v2
265<3>[ 0.267410]@2 i2c-msm-v2 757a000.i2c: error on clk_get(core_clk):-517
266<3>[ 0.267422]@2 i2c-msm-v2 757a000.i2c: error probe() failed with err:-517
267<6>[ 0.267708]@2 i2c-msm-v2 75b5000.i2c: probing driver i2c-msm-v2
268<3>[ 0.267763]@2 i2c-msm-v2 75b5000.i2c: error on clk_get(core_clk):-517
269<3>[ 0.267774]@2 i2c-msm-v2 75b5000.i2c: error probe() failed with err:-517
270<6>[ 0.268056]@2 i2c-msm-v2 7577000.i2c: probing driver i2c-msm-v2
271<3>[ 0.268109]@2 i2c-msm-v2 7577000.i2c: error on clk_get(core_clk):-517
272<3>[ 0.268121]@2 i2c-msm-v2 7577000.i2c: error probe() failed with err:-517
273<6>[ 0.268370]@2 i2c-msm-v2 75b6000.i2c: probing driver i2c-msm-v2
274<3>[ 0.268423]@2 i2c-msm-v2 75b6000.i2c: error on clk_get(core_clk):-517
275<3>[ 0.268435]@2 i2c-msm-v2 75b6000.i2c: error probe() failed with err:-517
276<3>[ 0.268657]@2 cpu-clock-8996 6400000.qcom,cpu-clock-8996: resources init failed
277<6>[ 0.287338]@2 qcom,gcc-8996 300000.qcom,gcc: Registered GCC clocks.
278<6>[ 0.288389]@2 vfe0_clk_src: set OPP pair(75000000 Hz: 3 uV) on a10000.qcom,vfe0
279<6>[ 0.288411]@2 vfe0_clk_src: set OPP pair(320000000 Hz: 5 uV) on a10000.qcom,vfe0
280<6>[ 0.288424]@2 vfe0_clk_src: set OPP pair(600000000 Hz: 7 uV) on a10000.qcom,vfe0
281<6>[ 0.288647]@2 vfe1_clk_src: set OPP pair(75000000 Hz: 3 uV) on a14000.qcom,vfe1
282<6>[ 0.288661]@2 vfe1_clk_src: set OPP pair(320000000 Hz: 5 uV) on a14000.qcom,vfe1
283<6>[ 0.288672]@2 vfe1_clk_src: set OPP pair(600000000 Hz: 7 uV) on a14000.qcom,vfe1
284<6>[ 0.288915]@2 cpp_clk_src: set OPP pair(100000000 Hz: 3 uV) on a04000.qcom,cpp
285<6>[ 0.288929]@2 cpp_clk_src: set OPP pair(480000000 Hz: 5 uV) on a04000.qcom,cpp
286<6>[ 0.288938]@2 cpp_clk_src: set OPP pair(640000000 Hz: 7 uV) on a04000.qcom,cpp
287<6>[ 0.298025]@2 qcom,mmsscc-8996 8c0000.qcom,mmsscc: Registered MMSS clocks.
288<6>[ 0.299686]@2 pmi8994_boost_5v: no parameters
289<3>[ 0.299771]@2 qcom,rpm-smd-regulator soc:qcom,rpm-smd:rpm-regulator-bstb:regulator-bst: Failed to find supply parent
290<3>[ 0.299867]@2 rpm_vreg_device_probe: regulator_register failed: pmi8994_boost_5v, rc=-517
291<6>[ 0.300134]@2 pmi8994_boost_pin_ctrl: no parameters
292<3>[ 0.300184]@2 qcom,rpm-smd-regulator soc:qcom,rpm-smd:rpm-regulator-bstb:regulator-bst-pin-ctrl: Failed to find supply parent
293<3>[ 0.300270]@2 rpm_vreg_device_probe: regulator_register failed: pmi8994_boost_pin_ctrl, rc=-517
294<6>[ 0.300987]@2 msm-thermal 70000.qcom,msm-thermal: msm_thermal:Failed reading node=/soc/qcom,msm-thermal, key=qcom,rpm-phase-resource-type err=-22. KTM continues
295<6>[ 0.301007]@2 msm-thermal 70000.qcom,msm-thermal: msm_thermal:Failed reading node=/soc/qcom,msm-thermal, key=qcom,gfx-sensor-id. err=-22. KTM continues
296<6>[ 0.301019]@2 msm_thermal:sensor_mgr_init_threshold threshold id already initialized
297<6>[ 0.301033]@2 msm-thermal 70000.qcom,msm-thermal: probe_vdd_mx:Failed reading node=/soc/qcom,msm-thermal, key=qcom,mx-restriction-temp. KTM continues
298<6>[ 0.301048]@2 msm-thermal 70000.qcom,msm-thermal: probe_psm:Failed reading node=/soc/qcom,msm-thermal, key=qcom,pmic-sw-mode-temp. err=-22. KTM continues
299<6>[ 0.301224]@2 msm_thermal:vdd_restriction_reg_init Defer regulator vdd-gfx probe
300<3>[ 0.301236]@2 msm_thermal:probe_vdd_rstr Err regulator init. err:-517. KTM continues.
301<6>[ 0.301246]@2 msm-thermal 70000.qcom,msm-thermal: probe_vdd_rstr:Failed reading node=/soc/qcom,msm-thermal, key=qcom,max-freq-level. err=-517. KTM continues
302<3>[ 0.301258]@2 msm_thermal:msm_thermal_dev_probe Failed reading node=/soc/qcom,msm-thermal, key=qcom,online-hotplug-core. err:-517
303<6>[ 0.301818]@2 cpr3_msm8996_hmss_read_fuse_data: apc0_pwrcl_corner: speed bin = 0
304<6>[ 0.301832]@2 cpr3_msm8996_hmss_read_fuse_data: apc0_pwrcl_corner: CPR fusing revision = 2
305<6>[ 0.301842]@2 cpr3_msm8996_hmss_read_fuse_data: apc0_pwrcl_corner: using redundant fuses = N
306<6>[ 0.301852]@2 cpr3_msm8996_hmss_read_fuse_data: apc0_pwrcl_corner: CPR limitation = none
307<6>[ 0.301861]@2 cpr3_msm8996_hmss_read_fuse_data: apc0_pwrcl_corner: CPR partial binning limitation = none
308<6>[ 0.301872]@2 cpr3_msm8996_hmss_read_fuse_data: apc0_pwrcl_corner: Retention voltage fuses: VDD_MX = 4, VDD_APCC = 4
309<6>[ 0.302067]@2 cpr3_hmss_kvreg_init: apc0_pwrcl_corner: LDO min headroom=80000 uV, LDO max headroom=470000 uV, LDO adj=0 uV, LDO mode=allowed, LDO retention=490000 uV
310<6>[ 0.302254]@2 cpr3_msm8996_hmss_calculate_open_loop_voltages: apc0_pwrcl_corner: fused MinSVS: open-loop= 565000 uV
311<6>[ 0.302266]@2 cpr3_msm8996_hmss_calculate_open_loop_voltages: apc0_pwrcl_corner: fused SVS: open-loop= 645000 uV
312<6>[ 0.302275]@2 cpr3_msm8996_hmss_calculate_open_loop_voltages: apc0_pwrcl_corner: fused NOM: open-loop= 735000 uV
313<6>[ 0.302284]@2 cpr3_msm8996_hmss_calculate_open_loop_voltages: apc0_pwrcl_corner: fused TURBO: open-loop= 890000 uV
314<6>[ 0.302390]@2 cpr3_msm8996_hmss_calculate_target_quotients: apc0_pwrcl_corner: fused MinSVS: quot[ 7]= 273
315<6>[ 0.302400]@2 cpr3_msm8996_hmss_calculate_target_quotients: apc0_pwrcl_corner: fused SVS: quot[ 7]= 410, quot_offset[ 7]= 100
316<6>[ 0.302410]@2 cpr3_msm8996_hmss_calculate_target_quotients: apc0_pwrcl_corner: fused NOM: quot[ 7]= 597, quot_offset[ 7]= 185
317<6>[ 0.302420]@2 cpr3_msm8996_hmss_calculate_target_quotients: apc0_pwrcl_corner: fused TURBO: quot[ 7]= 916, quot_offset[ 7]= 315
318<6>[ 0.302542]@2 cpr3_msm8996_hmss_read_fuse_data: apc0_cbf_corner: speed bin = 0
319<6>[ 0.302552]@2 cpr3_msm8996_hmss_read_fuse_data: apc0_cbf_corner: CPR fusing revision = 2
320<6>[ 0.302562]@2 cpr3_msm8996_hmss_read_fuse_data: apc0_cbf_corner: using redundant fuses = N
321<6>[ 0.302571]@2 cpr3_msm8996_hmss_read_fuse_data: apc0_cbf_corner: CPR limitation = none
322<6>[ 0.302580]@2 cpr3_msm8996_hmss_read_fuse_data: apc0_cbf_corner: CPR partial binning limitation = none
323<6>[ 0.302591]@2 cpr3_msm8996_hmss_read_fuse_data: apc0_cbf_corner: Retention voltage fuses: VDD_MX = 4, VDD_APCC = 4
324<6>[ 0.302733]@2 cpr3_msm8996_hmss_calculate_open_loop_voltages: apc0_cbf_corner: fused MinSVS: open-loop= 565000 uV
325<6>[ 0.302742]@2 cpr3_msm8996_hmss_calculate_open_loop_voltages: apc0_cbf_corner: fused SVS: open-loop= 645000 uV
326<6>[ 0.302751]@2 cpr3_msm8996_hmss_calculate_open_loop_voltages: apc0_cbf_corner: fused NOM: open-loop= 735000 uV
327<6>[ 0.302760]@2 cpr3_msm8996_hmss_calculate_open_loop_voltages: apc0_cbf_corner: fused TURBO: open-loop= 890000 uV
328<6>[ 0.302771]@2 cpr3_msm8996_hmss_calculate_open_loop_voltages: apc0_cbf_corner: fused MinSVS: CBF offset open-loop= 535000 uV
329<6>[ 0.302780]@2 cpr3_msm8996_hmss_calculate_open_loop_voltages: apc0_cbf_corner: fused LowSVS: CBF offset open-loop= 635000 uV
330<6>[ 0.302789]@2 cpr3_msm8996_hmss_calculate_open_loop_voltages: apc0_cbf_corner: fused SVS: CBF offset open-loop= 645000 uV
331<6>[ 0.302797]@2 cpr3_msm8996_hmss_calculate_open_loop_voltages: apc0_cbf_corner: fused NOM: CBF offset open-loop= 755000 uV
332<6>[ 0.302805]@2 cpr3_msm8996_hmss_calculate_open_loop_voltages: apc0_cbf_corner: fused TURBO: CBF offset open-loop= 890000 uV
333<6>[ 0.302849]@2 cpr3_msm8996_hmss_calculate_target_quotients: apc0_cbf_corner: fused MinSVS: quot[ 7]= 273
334<6>[ 0.302858]@2 cpr3_msm8996_hmss_calculate_target_quotients: apc0_cbf_corner: fused SVS: quot[ 7]= 410, quot_offset[ 7]= 100
335<6>[ 0.302868]@2 cpr3_msm8996_hmss_calculate_target_quotients: apc0_cbf_corner: fused NOM: quot[ 7]= 597, quot_offset[ 7]= 185
336<6>[ 0.302877]@2 cpr3_msm8996_hmss_calculate_target_quotients: apc0_cbf_corner: fused TURBO: quot[ 7]= 916, quot_offset[ 7]= 315
337<6>[ 0.302985]@2 cpr3_msm8996_hmss_read_fuse_data: apc1_corner: speed bin = 0
338<6>[ 0.302995]@2 cpr3_msm8996_hmss_read_fuse_data: apc1_corner: CPR fusing revision = 2
339<6>[ 0.303005]@2 cpr3_msm8996_hmss_read_fuse_data: apc1_corner: using redundant fuses = N
340<6>[ 0.303014]@2 cpr3_msm8996_hmss_read_fuse_data: apc1_corner: CPR limitation = none
341<6>[ 0.303023]@2 cpr3_msm8996_hmss_read_fuse_data: apc1_corner: CPR partial binning limitation = none
342<6>[ 0.303034]@2 cpr3_msm8996_hmss_read_fuse_data: apc1_corner: Retention voltage fuses: VDD_MX = 4, VDD_APCC = 4
343<6>[ 0.303236]@2 cpr3_hmss_kvreg_init: apc1_corner: LDO min headroom=130000 uV, LDO max headroom=470000 uV, LDO adj=0 uV, LDO mode=allowed, LDO retention=490000 uV
344<6>[ 0.303443]@2 cpr3_msm8996_hmss_calculate_open_loop_voltages: apc1_corner: fused MinSVS: open-loop= 565000 uV
345<6>[ 0.303455]@2 cpr3_msm8996_hmss_calculate_open_loop_voltages: apc1_corner: fused SVS: open-loop= 655000 uV
346<6>[ 0.303464]@2 cpr3_msm8996_hmss_calculate_open_loop_voltages: apc1_corner: fused NOM: open-loop= 745000 uV
347<6>[ 0.303473]@2 cpr3_msm8996_hmss_calculate_open_loop_voltages: apc1_corner: fused TURBO: open-loop=1050000 uV
348<6>[ 0.303593]@2 cpr3_msm8996_hmss_calculate_target_quotients: apc1_corner: fused MinSVS: quot[ 7]= 273
349<6>[ 0.303603]@2 cpr3_msm8996_hmss_calculate_target_quotients: apc1_corner: fused SVS: quot[ 7]= 432, quot_offset[ 7]= 115
350<6>[ 0.303613]@2 cpr3_msm8996_hmss_calculate_target_quotients: apc1_corner: fused NOM: quot[ 7]= 618, quot_offset[ 7]= 185
351<6>[ 0.303623]@2 cpr3_msm8996_hmss_calculate_target_quotients: apc1_corner: fused TURBO: quot[ 7]=1190, quot_offset[ 7]= 570
352<6>[ 0.304112]@2 cpr3_regulator_init_ctrl: apcc: Default CPR mode = SW closed-loop
353<6>apc0_pwrcl_corner: 0 <--> 0 mV at 0 mV
354<6>[ 0.304456]@2 apc0_cbf_corner: 0 <--> 0 mV at 0 mV
355<6>[ 0.307356]@2 cpr3_regulator_measure_aging: apcc: average quotient delta=0 (count=10)
356<6>[ 0.307384]@2 cpr3_regulator_aging_adjust: apcc: aging measurement successful; aging reference adjustment voltage=3125 uV
357<6>[ 0.307714]@2 apc1_corner: 0 <--> 0 mV at 0 mV
358<6>[ 0.309161]@2 cpr3_msm8996_mmss_read_fuse_data: gfx_corner: speed bin = 0
359<6>[ 0.309178]@2 cpr3_msm8996_mmss_read_fuse_data: gfx_corner: CPR fusing revision = 1
360<6>[ 0.309189]@2 cpr3_msm8996_mmss_read_fuse_data: gfx_corner: CPR limitation = none
361<6>[ 0.309482]@2 cpr3_msm8996_mmss_calculate_open_loop_voltages: gfx_corner: fuse_corner[0] open-loop= 630000 uV
362<6>[ 0.309493]@2 cpr3_msm8996_mmss_calculate_open_loop_voltages: gfx_corner: fuse_corner[1] open-loop= 675000 uV
363<6>[ 0.309502]@2 cpr3_msm8996_mmss_calculate_open_loop_voltages: gfx_corner: fuse_corner[2] open-loop= 805000 uV
364<6>[ 0.309510]@2 cpr3_msm8996_mmss_calculate_open_loop_voltages: gfx_corner: fuse_corner[3] open-loop= 935000 uV
365<6>[ 0.309681]@2 cpr3_regulator_init_ctrl: gfx: Default CPR mode = closed-loop
366<6>gfx_corner: 0 <--> 0 mV at 0 mV
367<6>[ 0.311069]@2 i2c-msm-v2 75ba000.i2c: probing driver i2c-msm-v2
368<3>[ 0.311159]@2 AXI: msm_bus_scale_register_client(): msm_bus_scale_register_client: Bus driver not ready.
369<6>i2c-msm-v2 75ba000.i2c: msm_bus_scale_register_client(mstr-id:84):0 (not a problem)
370<6>i2c-msm-v2 757a000.i2c: probing driver i2c-msm-v2
371<3>[ 0.312027]@2 AXI: msm_bus_scale_register_client(): msm_bus_scale_register_client: Bus driver not ready.
372<6>i2c-msm-v2 757a000.i2c: msm_bus_scale_register_client(mstr-id:86):0 (not a problem)
373<6>i2c-msm-v2 75b5000.i2c: probing driver i2c-msm-v2
374<3>[ 0.312903]@2 AXI: msm_bus_scale_register_client(): msm_bus_scale_register_client: Bus driver not ready.
375<6>i2c-msm-v2 75b5000.i2c: msm_bus_scale_register_client(mstr-id:84):0 (not a problem)
376<6>i2c-msm-v2 7577000.i2c: probing driver i2c-msm-v2
377<3>[ 0.313821]@2 AXI: msm_bus_scale_register_client(): msm_bus_scale_register_client: Bus driver not ready.
378<6>i2c-msm-v2 7577000.i2c: msm_bus_scale_register_client(mstr-id:86):0 (not a problem)
379<6>i2c-msm-v2 75b6000.i2c: probing driver i2c-msm-v2
380<3>[ 0.314547]@2 AXI: msm_bus_scale_register_client(): msm_bus_scale_register_client: Bus driver not ready.
381<6>i2c-msm-v2 75b6000.i2c: msm_bus_scale_register_client(mstr-id:84):0 (not a problem)
382<6>cpu-clock-8996 6400000.qcom,cpu-clock-8996: using perf/pwr/cbf speed bin 0 and pvs_ver 0
383<6>[ 0.317517]@2 clock-cpu-8996: set OPP pair (307200000 Hz, 615000 uv) on cpu0
384<6>[ 0.317569]@2 clock-cpu-8996: set OPP pair (2188800000 Hz, 1075000 uv) on cpu0
385<6>[ 0.317587]@2 clock-cpu-8996: set OPP pair (307200000 Hz, 615000 uv) on cpu1
386<6>[ 0.317625]@2 clock-cpu-8996: set OPP pair (2188800000 Hz, 1075000 uv) on cpu1
387<6>[ 0.317642]@2 clock-cpu-8996: set OPP pair (307200000 Hz, 615000 uv) on cpu2
388<6>[ 0.317705]@2 clock-cpu-8996: set OPP pair (2342400000 Hz, 1085000 uv) on cpu2
389<6>[ 0.317722]@2 clock-cpu-8996: set OPP pair (307200000 Hz, 615000 uv) on cpu3
390<6>[ 0.317777]@2 clock-cpu-8996: set OPP pair (2342400000 Hz, 1085000 uv) on cpu3
391<6>[ 0.317905]@2 clock-cpu-8996: set OPP pair (192000000 Hz, 600000 uv) on soc:qcom,m4m
392<6>[ 0.317948]@2 clock-cpu-8996: set OPP pair (1593600000 Hz, 955000 uv) on soc:qcom,m4m
393<6>[ 0.318282]@2 qcom,gpucc-8996 8c0000.qcom,gpucc: using speed bin 0
394<6>[ 0.318641]@2 gfx3d_clk_src_v2: set OPP pair(133000000 Hz: 560000 uV) on b00000.qcom,kgsl-3d0
395<6>[ 0.318682]@2 gfx3d_clk_src_v2: set OPP pair(652800000 Hz: 910000 uV) on b00000.qcom,kgsl-3d0
396<6>[ 0.320127]@2 qcom,gpucc-8996 8c0000.qcom,gpucc: Registered GPU clocks.
397<6>[ 0.320345]@2 pmi8994_boost_5v: no parameters
398<3>[ 0.320417]@2 qcom,rpm-smd-regulator soc:qcom,rpm-smd:rpm-regulator-bstb:regulator-bst: Failed to find supply parent
399<3>[ 0.320516]@2 rpm_vreg_device_probe: regulator_register failed: pmi8994_boost_5v, rc=-517
400<6>[ 0.320712]@2 pmi8994_boost_pin_ctrl: no parameters
401<3>[ 0.320759]@2 qcom,rpm-smd-regulator soc:qcom,rpm-smd:rpm-regulator-bstb:regulator-bst-pin-ctrl: Failed to find supply parent
402<3>[ 0.320845]@2 rpm_vreg_device_probe: regulator_register failed: pmi8994_boost_pin_ctrl, rc=-517
403<6>[ 0.321590]@2 msm-thermal 70000.qcom,msm-thermal: msm_thermal:Failed reading node=/soc/qcom,msm-thermal, key=qcom,rpm-phase-resource-type err=-22. KTM continues
404<6>[ 0.321610]@2 msm-thermal 70000.qcom,msm-thermal: msm_thermal:Failed reading node=/soc/qcom,msm-thermal, key=qcom,gfx-sensor-id. err=-22. KTM continues
405<6>[ 0.321623]@2 msm_thermal:sensor_mgr_init_threshold threshold id already initialized
406<6>[ 0.321637]@2 msm-thermal 70000.qcom,msm-thermal: probe_vdd_mx:Failed reading node=/soc/qcom,msm-thermal, key=qcom,mx-restriction-temp. KTM continues
407<6>[ 0.321650]@2 msm-thermal 70000.qcom,msm-thermal: probe_psm:Failed reading node=/soc/qcom,msm-thermal, key=qcom,pmic-sw-mode-temp. err=-22. KTM continues
408<3>[ 0.321898]@2 msm_thermal:update_cpu_freq Unable to update policy for cpu:0. err:-19
409<3>[ 0.321914]@2 msm_thermal:update_cpu_freq Unable to update policy for cpu:2. err:-19
410<3>[ 0.321925]@2 msm_thermal:update_cpu_freq Unable to update policy for cpu:2. err:-19
411<3>[ 0.321943]@2 msm-thermal 70000.qcom,msm-thermal: probe_ocr:Failed reading node=/soc/qcom,msm-thermal, key=qcom,pmic-opt-curr-temp err:-22. KTM continues
412<3>[ 0.322801]@2 msm_thermal:update_cpu_freq Unable to update policy for cpu:0. err:-19
413<3>[ 0.322816]@2 msm_thermal:update_cpu_freq Unable to update policy for cpu:2. err:-19
414<3>[ 0.322826]@2 msm_thermal:update_cpu_freq Unable to update policy for cpu:2. err:-19
415<6>[ 0.323042]@2 pmi8994_boost_5v: no parameters
416<3>[ 0.323099]@2 qcom,rpm-smd-regulator soc:qcom,rpm-smd:rpm-regulator-bstb:regulator-bst: Failed to find supply parent
417<3>[ 0.323195]@2 rpm_vreg_device_probe: regulator_register failed: pmi8994_boost_5v, rc=-517
418<6>[ 0.323388]@2 pmi8994_boost_pin_ctrl: no parameters
419<3>[ 0.323436]@2 qcom,rpm-smd-regulator soc:qcom,rpm-smd:rpm-regulator-bstb:regulator-bst-pin-ctrl: Failed to find supply parent
420<3>[ 0.323524]@2 rpm_vreg_device_probe: regulator_register failed: pmi8994_boost_pin_ctrl, rc=-517
421<6>[ 0.363922]@2 KPI: Bootloader start count = 36732
422<6>[ 0.363941]@2 KPI: Bootloader end count = 265239
423<6>[ 0.363949]@2 KPI: Bootloader display count = 248849
424<6>[ 0.363957]@2 KPI: Bootloader load kernel count = 2187
425<6>[ 0.363968]@2 KPI: Kernel MPM timestamp = 290503
426<6>[ 0.363975]@2 KPI: Kernel MPM Clock frequency = 32768
427<6>[ 0.363990]@2 socinfo_print: v0.11, id=305, ver=1.1, raw_id=95, raw_ver=1, hw_plat=8, hw_plat_ver=65536
428<6> accessory_chip=0, hw_plat_subtype=0, pmic_model=65545, pmic_die_revision=131072 foundry_id=3 serial_number=2606472571 num_pmics=2
429<3>[ 0.364015]@2 init_project_info: project_name: 15811 hw_version: 28 rf_v1: 32 rf_v2: 1: rf_v3: 0 paltform_id:305
430<3>[ 0.364029]@2 init_project_info: aboard_version: 1
431<3>[ 0.364908]@2 op_rf_cable_probe: ftm_mode FOUND! use 1 always
432<3>[ 0.364924]@2 modify_rf_cable_smem_info: rf_cable: 1
433<3>[ 0.364932]@2 op_rf_cable_probe: probe ok!
434<6>[ 0.365273]@2 gdsc_mmagic_bimc: no parameters
435<6>[ 0.365896]@2 rome_vreg: no parameters
436<6>[ 0.366136]@2 wlan_en_vreg: no parameters
437<6>[ 0.366700]@2 vgaarb: loaded
438<5>[ 0.366922]@2 SCSI subsystem initialized
439<6>[ 0.367091]@2 usbcore: registered new interface driver usbfs
440<6>[ 0.367133]@2 usbcore: registered new interface driver hub
441<6>[ 0.367279]@2 usbcore: registered new device driver usb
442<4>[ 0.367653]@2 soc:usb_nop_phy supply vcc not found, using dummy regulator
443<6>[ 0.400369]@2 cpufreq: driver msm up and running
444<6>[ 0.400888]@2 platform soc:qcom,ion:qcom,ion-heap@22: assigned reserved memory node adsp_region
445<6>[ 0.401000]@2 platform soc:qcom,ion:qcom,ion-heap@27: assigned reserved memory node qseecom_region
446<6>[ 0.401105]@2 platform soc:qcom,ion:qcom,ion-heap@10: assigned reserved memory node secure_region
447<6>[ 0.401290]@2 ION heap system created
448<3>[ 0.401393]@1 ion_heap_create: Heap type is disabled: 1
449<3>[ 0.401405]@1 msm_ion_heap_create: error creating heap kmalloc type 1 base 0x0000000000000000 size 0
450<6>[ 0.401412]@1 ION heap adsp created at 0x00000000ff800000 with size 400000
451<6>[ 0.401420]@1 ION heap qsecom created at 0x00000000fe400000 with size 1400000
452<6>[ 0.401428]@1 ION heap secure_display created at 0x00000000f8800000 with size 5c00000
453<6>[ 0.401436]@1 ION heap secure_heap created
454<3>[ 0.402283]@1 msm_bus_fabric_init_driver
455<3>[ 0.405405]@1 msm-bus-type fab-a0noc: Error: Failed to get regulator bus-gdsc:-517
456<3>[ 0.405424]@1 msm-bus-type fab-a0noc: Error: Failed to get regulator bus-a-gdsc:-517
457<3>[ 0.408168]@1 msm-bus-type slv-vmem-cfg: Error: Failed to get regulator node-gdsc:-517
458<3>[ 0.408605]@1 msm-bus-type slv-vmem: Error: Failed to get regulator node-gdsc:-517
459<3>[ 0.413791]@2 msm-bus-type fab-a0noc: Error: Failed to get regulator aggre0-snoc-axi-no-rate:-517
460<3>[ 0.413805]@2 msm-bus-type fab-a0noc: Error: Failed to get regulator aggre0-snoc-axi-no-rate:-517
461<3>[ 0.413813]@2 msm-bus-type fab-a0noc: Error: Failed to get regulator aggre0-snoc-axi-no-rate:-517
462<3>[ 0.413911]@2 msm-bus-type fab-mnoc: Error: Failed to get regulator mmagic-mdss-axi-no-rate:-517
463<3>[ 0.413932]@2 msm-bus-type fab-mnoc: Error: Failed to get regulator mmagic-mdss-axi-no-rate:-517
464<3>[ 0.413950]@2 msm-bus-type fab-mnoc: Error: Failed to get regulator mmagic-mdss-axi-no-rate:-517
465<3>[ 0.413969]@2 msm-bus-type fab-mnoc: Error: Failed to get regulator mmagic-mdss-axi-no-rate:-517
466<3>[ 0.413986]@2 msm-bus-type fab-mnoc: Error: Failed to get regulator mmagic-mdss-axi-no-rate:-517
467<3>[ 0.414004]@2 msm-bus-type fab-mnoc: Error: Failed to get regulator mmagic-mdss-axi-no-rate:-517
468<3>[ 0.414021]@2 msm-bus-type fab-mnoc: Error: Failed to get regulator mmagic-mdss-axi-no-rate:-517
469<6>[ 0.415224]@2 qcom,qpnp-power-on qpnp-power-on-2: PMIC@SID0 Power-on reason: Triggered from Hard Reset[0x21] and 'cold' boot
470<6>[ 0.415235]@2 qcom,qpnp-power-on qpnp-power-on-2: PMIC@SID0 Power-on reason: Triggered from PON1 (secondary PMIC)[0x21] and 'cold' boot
471<6>[ 0.415251]@2 qcom,qpnp-power-on qpnp-power-on-2: PMIC@SID0: Power-off reason: Triggered from PS_HOLD (PS_HOLD/MSM controlled shutdown)[0x2]
472<6>[ 0.415352]@2 input: qpnp_pon as /devices/virtual/input/input0
473<6>[ 0.415818]@2 pon_spare_reg: no parameters
474<6>[ 0.415869]@2 qcom,qpnp-power-on qpnp-power-on-11: No PON config. specified
475<6>[ 0.415924]@2 qcom,qpnp-power-on qpnp-power-on-11: PMIC@SID2 Power-on reason: Triggered from Hard Reset[0x31] and 'cold' boot
476<6>[ 0.415929]@2 qcom,qpnp-power-on qpnp-power-on-11: PMIC@SID2 Power-on reason: Triggered from USB (USB charger insertion)[0x31] and 'cold' boot
477<6>[ 0.415934]@2 qcom,qpnp-power-on qpnp-power-on-11: PMIC@SID2 Power-on reason: Triggered from PON1 (secondary PMIC)[0x31] and 'cold' boot
478<6>[ 0.415948]@2 qcom,qpnp-power-on qpnp-power-on-11: PMIC@SID2: Power-off reason: Triggered from PS_HOLD (PS_HOLD/MSM controlled shutdown)[0x2]
479<6>[ 0.416094]@2 PMIC@SID0: PM8994 v2.0 options: 0, 0, 2, 2
480<6>[ 0.416176]@2 PMIC@SID2: PMI8996 v1.1 options: 0, 0, 0, 0
481<3>[ 0.417181]@2 ipa ipa2_uc_state_check:296 uC interface not initialized
482<3>[ 0.417194]@2 ipa ipa_sps_irq_control_all:938 EP (2) not allocated.
483<3>[ 0.417199]@2 ipa ipa_sps_irq_control_all:938 EP (5) not allocated.
484<6>[ 0.419173]@3 sps:BAM 0x0000000000684000 is registered.
485<3>ipa ipa2_uc_state_check:296 uC interface not initialized
486<6>[ 0.420137]@3 sps:BAM 0x0000000000684000 (va:0xffffff80020c0000) enabled: ver:0x27, number of pipes:20
487<3>[ 0.421504]@3 ipa ipa2_uc_state_check:296 uC interface not initialized
488<3>[ 0.426373]@3 ipa ipa2_uc_state_check:296 uC interface not initialized
489<6>[ 0.427916]@3 IPA driver initialization was successful.
490<6>[ 0.429098]@3 gdsc_mmagic_video: no parameters
491<6>[ 0.429282]@3 gdsc_mmagic_mdss: no parameters
492<6>[ 0.429438]@3 gdsc_mmagic_camss: no parameters
493<6>[ 0.429633]@3 gdsc_venus: no parameters
494<6>[ 0.429653]@3 gdsc_venus: supplied by gdsc_mmagic_video
495<6>[ 0.429816]@3 gdsc_venus_core0: fast normal
496<6>[ 0.429952]@3 gdsc_venus_core1: fast normal
497<6>[ 0.430216]@3 gdsc_camss_top: no parameters
498<6>[ 0.430234]@3 gdsc_camss_top: supplied by gdsc_mmagic_camss
499<6>[ 0.430373]@3 gdsc_vfe0: no parameters
500<6>[ 0.430390]@3 gdsc_vfe0: supplied by gdsc_camss_top
501<6>[ 0.430542]@3 gdsc_vfe1: no parameters
502<6>[ 0.430558]@3 gdsc_vfe1: supplied by gdsc_camss_top
503<6>[ 0.430725]@3 gdsc_mdss: no parameters
504<6>[ 0.430745]@3 gdsc_mdss: supplied by gdsc_mmagic_mdss
505<6>[ 0.430967]@3 gdsc_jpeg: no parameters
506<6>[ 0.430984]@3 gdsc_jpeg: supplied by gdsc_camss_top
507<6>[ 0.431135]@3 gdsc_cpp: no parameters
508<6>[ 0.431152]@3 gdsc_cpp: supplied by gdsc_camss_top
509<6>[ 0.431299]@3 gdsc_pcie_0: no parameters
510<6>[ 0.431412]@3 gdsc_pcie_1: no parameters
511<6>[ 0.431541]@3 gdsc_pcie_2: no parameters
512<6>[ 0.431667]@3 gdsc_usb30: no parameters
513<6>[ 0.431784]@3 gdsc_ufs: no parameters
514<6>[ 0.431957]@3 gdsc_fd: no parameters
515<6>[ 0.431974]@3 gdsc_fd: supplied by gdsc_camss_top
516<6>[ 0.432130]@3 gdsc_gpu: no parameters
517<6>[ 0.432271]@3 gdsc_gpu_gx: no parameters
518<6>[ 0.432620]@3 gdsc_gpu_gx: supplied by gfx_corner
519<6>[ 0.432808]@3 gdsc_hlos1_vote_aggre0_noc: no parameters
520<6>[ 0.432936]@3 gdsc_hlos1_vote_lpass_adsp: no parameters
521<6>[ 0.433066]@3 gdsc_hlos1_vote_lpass_core: no parameters
522<6>[ 0.433192]@3 gdsc_aggre0_noc: no parameters
523<6>[ 0.435291]@3 mdss_pll_probe: MDSS pll label = MDSS DSI 0 PLL
524<6>[ 0.435314]@3 mdss_pll_probe: mdss_pll_probe: label=MDSS DSI 0 PLL PLL SSC enabled
525<6>[ 0.437077]@3 dsi_pll_clock_register_8996: Registered DSI PLL ndx=0 clocks successfully
526<6>[ 0.437151]@3 mdss_pll_probe: MDSS pll label = MDSS DSI 1 PLL
527<6>[ 0.437163]@3 mdss_pll_probe: mdss_pll_probe: label=MDSS DSI 1 PLL PLL SSC enabled
528<3>[ 0.438237]@3 pll_is_pll_locked_8996: DSI PLL ndx=1 status=0 failed to Lock
529<6>[ 0.438692]@3 dsi_pll_clock_register_8996: Registered DSI PLL ndx=1 clocks successfully
530<6>[ 0.545350]@3 get_param_by_index_and_offset[75] sid_index = 12 offset = 0 buf = ffffffc000fff780 length = 420
531<6>[ 0.545471]@3 Advanced Linux Sound Architecture Driver Initialized.
532<1>[ 0.545998]@3 pcie:pcie_init.
533<4>[ 0.549308]@3 600000.qcom,pcie supply vreg-3.3 not found, using dummy regulator
534<3>[ 0.552045]@3 msm_pcie_get_resources: PCIe: RC0 can't get tcsr resource.
535<6>[ 0.554779]@1 pmi8994_boost_5v: no parameters
536<6>[ 0.555076]@1 pmi8994_boost_5v: supplied by pon_spare_reg
537<6>[ 0.555600]@1 pmi8994_boost_pin_ctrl: no parameters
538<6>[ 0.555832]@1 pmi8994_boost_pin_ctrl: supplied by pon_spare_reg
539<6>[ 0.556399]@3 Switched to clocksource arch_sys_counter
540<6>[ 0.557255]@3 bcl_peripheral:bcl_perph_init BCL Initialized
541<6>[ 0.561314]@3 NET: Registered protocol family 2
542<6>[ 0.561838]@3 TCP established hash table entries: 65536 (order: 7, 524288 bytes)
543<6>[ 0.561949]@3 TCP bind hash table entries: 65536 (order: 8, 1048576 bytes)
544<6>[ 0.562894]@3 TCP: Hash tables configured (established 65536 bind 65536)
545<6>[ 0.563070]@3 TCP: reno registered
546<6>[ 0.563110]@3 UDP hash table entries: 4096 (order: 5, 131072 bytes)
547<6>[ 0.563199]@3 UDP-Lite hash table entries: 4096 (order: 5, 131072 bytes)
548<6>[ 0.563579]@3 NET: Registered protocol family 1
549<7>[ 0.563635]@3 PCI: CLS 0 bytes, default 128
550<6>[ 0.564147]@3 Trying to unpack rootfs image as initramfs...
551<6>[ 0.730952]@2 Freeing initrd memory: 8912K (ffffffc002200000 - ffffffc002ab4000)
552<6>[ 0.732808]@2 kryo perfevents: CPU pmu for kryo-pmuv3 detected
553<6>[ 0.737801]@3 futex hash table entries: 1024 (order: 5, 131072 bytes)
554<6>[ 0.737934]@3 audit: initializing netlink subsys (disabled)
555<5>[ 0.738044]@3 audit: type=2000 audit(0.729:1): initialized
556<4>[ 0.738546]@3 vmscan: error setting kswapd cpu affinity mask
557<5>[ 0.741006]@3 VFS: Disk quotas dquot_6.5.2
558<4>[ 0.741094]@3 Dquot-cache hash table entries: 512 (order 0, 4096 bytes)
559<6>[ 0.741626]@3 exfat: init_exfat_fs: exFAT Filesystem version 1.2.24
560<6>[ 0.741680]@3 fuse init (API version 7.23)
561<6>[ 0.743763]@3 Block layer SCSI generic (bsg) driver version 0.4 loaded (major 247)
562<6>[ 0.743784]@3 io scheduler noop registered (default)
563<3>[ 0.754373]@3 mdss_mdp_irq_clk_register: unable to get clk: lut_clk
564<3>[ 0.755619]@3 No change in context(0==0), skip
565<6>[ 0.756679]@3 mdss_mdp_pipe_addr_setup: type:0 ftchid:-1 xinid:0 num:0 rect:0 ndx:0x1 prio:0
566<6>[ 0.756688]@3 mdss_mdp_pipe_addr_setup: type:0 ftchid:-1 xinid:4 num:1 rect:0 ndx:0x2 prio:1
567<6>[ 0.756695]@3 mdss_mdp_pipe_addr_setup: type:0 ftchid:-1 xinid:8 num:2 rect:0 ndx:0x4 prio:2
568<6>[ 0.756702]@3 mdss_mdp_pipe_addr_setup: type:0 ftchid:-1 xinid:12 num:8 rect:0 ndx:0x100 prio:3
569<6>[ 0.756717]@3 mdss_mdp_pipe_addr_setup: type:1 ftchid:-1 xinid:1 num:3 rect:0 ndx:0x8 prio:4
570<6>[ 0.756724]@3 mdss_mdp_pipe_addr_setup: type:1 ftchid:-1 xinid:5 num:4 rect:0 ndx:0x10 prio:5
571<6>[ 0.756729]@3 mdss_mdp_pipe_addr_setup: type:1 ftchid:-1 xinid:9 num:5 rect:0 ndx:0x20 prio:6
572<6>[ 0.756735]@3 mdss_mdp_pipe_addr_setup: type:1 ftchid:-1 xinid:13 num:9 rect:0 ndx:0x200 prio:7
573<6>[ 0.756748]@3 mdss_mdp_pipe_addr_setup: type:2 ftchid:-1 xinid:2 num:6 rect:0 ndx:0x40 prio:8
574<6>[ 0.756754]@3 mdss_mdp_pipe_addr_setup: type:2 ftchid:-1 xinid:10 num:7 rect:0 ndx:0x80 prio:9
575<6>[ 0.756766]@3 mdss_mdp_pipe_addr_setup: type:3 ftchid:-1 xinid:7 num:10 rect:0 ndx:0x400 prio:0
576<6>[ 0.756773]@3 mdss_mdp_pipe_addr_setup: type:3 ftchid:-1 xinid:7 num:11 rect:0 ndx:0x800 prio:1
577<3>[ 0.756783]@3 mdss_mdp_parse_dt_handler: Error from prop qcom,mdss-pipe-sw-reset-off : u32 array read
578<3>[ 0.756851]@3 mdss_mdp_parse_dt_handler: Error from prop qcom,mdss-ib-factor-overlap : u32 array read
579<6>[ 0.757183]@3 xlog_status: enable:0, panic:0, dump:1
580<6>[ 0.758317]@3 mdss_mdp_probe: mdss version = 0x10070002, bootloader display is on, num 1, intf_sel=0x00000100
581<6>[ 0.762865]@3 mdss_smmu_probe: iommu v2 domain[0] mapping and clk register successful!
582<6>[ 0.763024]@3 mdss_smmu_probe: iommu v2 domain[1] mapping and clk register successful!
583<6>[ 0.763137]@3 mdss_smmu_probe: iommu v2 domain[2] mapping and clk register successful!
584<6>[ 0.763240]@3 mdss_smmu_probe: iommu v2 domain[3] mapping and clk register successful!
585<6>[ 0.766113]@3 mdss_dsi_ctrl_probe: DSI Ctrl name = MDSS DSI CTRL->0
586<6>[ 0.766451]@3 mdss_dsi_find_panel_of_node: cmdline:0:qcom,mdss_dsi_samsung_s6e3fa5_1080p_cmd:1:none:cfg:single_dsi panel_name:qcom,mdss_dsi_samsung_s6e3fa5_1080p_cmd
587<6>[ 0.766469]@3 mdss_dsi_panel_init: Panel Name = samsung s6e3fa5 1080p cmd mode dsi panel
588<6>[ 0.766567]@3 mdss_dsi_panel_timing_from_dt: found new timing "qcom,mdss_dsi_samsung_s6e3fa5_1080p_cmd" (ffffffc1764bb380)
589<3>[ 0.766587]@3 mdss_dsi_parse_dcs_cmds: failed, key=qcom,mdss-dsi-timing-switch-command
590<4>[ 0.766593]@3 mdss_dsi_panel_get_dsc_cfg_np: cannot find dsc config node:
591<6>[ 0.766715]@3 mdss_dsi_parse_panel_features: partial_update_enabled=0
592<6>[ 0.766723]@3 mdss_dsi_parse_panel_features: ulps feature disabled
593<6>[ 0.766731]@3 mdss_dsi_parse_panel_features: ulps during suspend feature disabled
594<6>mdss_dsi_parse_dms_config: dynamic switch feature enabled: 0
595<6>[ 0.766767]@3 mdss_dsi_panel_init: Panel Manufacture = SAMSUNG
596<6>[ 0.766773]@3 mdss_dsi_panel_init: Panel Version = S6E3FA5
597<3>[ 0.766780]@3 high brightness panel: 1
598<3>[ 0.767175]@3 mdss_dsi_parse_ctrl_params:4006 Unable to read qcom,display-id, data=0000000000000000,len=20
599<6>[ 0.767228]@3 mdss_dsi_parse_gpio_params: bklt_en gpio not specified
600<3>[ 0.767459]@3 msm_dss_get_res_byname: 'dsi_phy_regulator' resource not found
601<3>[ 0.767466]@3 0xffffffc0003911a8->msm_dss_ioremap_byname: 'dsi_phy_regulator' msm_dss_get_res_byname failed
602<6>[ 0.767472]@3 mdss_dsi_retrieve_ctrl_resources: ctrl_base=ffffff80021dc000 ctrl_size=400 phy_base=ffffff80021de400 phy_size=588
603<6>[ 0.767643]@3 dsi_panel_device_register: Continuous splash enabled
604<6>[ 0.768282]@3 mdss_register_panel: adding framebuffer device 994000.qcom,mdss_dsi_ctrl0
605<6>[ 0.771576]@3 mdss_dsi_ctrl_probe: Dsi Ctrl->0 initialized, DSI rev:0x10040001, PHY rev:0x2
606<6>[ 0.772948]@3 mdss_dsi_status_init: DSI status check interval:5000
607<6>[ 0.773361]@3 mdss_register_panel: adding framebuffer device soc:qcom,mdss_wb_panel
608<6>[ 0.774956]@3 mdss_fb_probe: fb0: split_mode:0 left:0 right:0
609<6>[ 0.775414]@3 mdss_fb_register: FrameBuffer[0] 1080x1920 registered successfully!
610<6>[ 0.776238]@3 mdss_fb_probe: fb1: split_mode:0 left:0 right:0
611<6>[ 0.776317]@3 mdss_fb_register: FrameBuffer[1] 640x480 registered successfully!
612<3>[ 0.776371]@3 mdss_mdp_splash_parse_dt: splash mem child node is not present
613<6>[ 0.786510]@3 In memshare_probe, Memshare probe success
614<6>[ 0.791251]@3 l2cache-pmu soc:l2-pmu: Registered L2 cache PMU using 2 HW PMUs
615<5>[ 0.792167]@3 msm_rpm_log_probe: OK
616<6>[ 0.795873]@0 subsys-pil-tz ce0000.qcom,venus: for venus segments only will be dumped.
617<6>subsys-pil-tz soc:qcom,kgsl-hyp: for a530_zap segments only will be dumped.
618<3>uart_tx_gpio is not available
619<3>[ 0.801312]@2 uart_rx_gpio is not available
620<3>[ 0.801321]@2 uart_cts_gpio is not available
621<3>[ 0.801326]@2 uart_rfr_gpio is not available
622<3>[ 0.802162]@3 sps: BAM device 0x0000000007544000 is not registered yet.
623<6>[ 0.802318]@3 sps:BAM 0x0000000007544000 is registered.
624<3>smd_channel_probe_now: allocation table not initialized
625<6>[ 0.803879]@3 7570000.uart: ttyHS0 at MMIO 0x7570000 (irq = 20, base_baud = 460800) is a MSM HS UART
626<6>[ 0.805823]@3 msm_serial_hs module loaded
627<6>[ 0.806596]@3 msm_serial_hsl_probe: detected port #0 (ttyHSL0)
628<3>[ 0.806727]@3 AXI: get_pdata(): Error: Client name not found
629<3>[ 0.806735]@3 AXI: msm_bus_cl_get_pdata(): client has to provide missing entry for successful registration
630<3>[ 0.806742]@3 msm_serial_hsl_probe: Bus scaling is disabled
631<6>[ 0.806847]@3 75b0000.serial: ttyHSL0 at MMIO 0x75b0000 (irq = 12, base_baud = 460800) is a MSM
632<6>[ 0.806927]@3 msm_hsl_console_setup: console setup on port #0
633<6>[ 5.349406]@3 console [ttyHSL0] enabled
634<6>[ 5.354358]@3 msm_serial_hsl_init: driver initialized
635<6>[ 5.378126]@3 brd: module loaded
636<6>[ 5.381323]@3 loop: module loaded
637<6>[ 5.383707]@3 at24 6-0051: 4096 byte 24c32 EEPROM, writable, 1 bytes/write
638<6>[ 5.391457]@3 QSEECOM: qseecom_probe: qseecom.qsee_version = 0x1000000
639<4>[ 5.397034]@3 QSEECOM: qseecom_retrieve_ce_data: Device does not support PFE
640<6>QSEECOM: qseecom_probe: no-clock-support=0x1<4>QSEECOM: qseecom_probe: qseecom.qsee_reentrancy_support = 2
641<3>[ 5.413789]@3 scm_call failed: func id 0x70000006, ret: -2, syscall returns: 0xffffffffffffffed, 0x0, 0x0
642<4>[ 5.422707]@3 QSEECOM: qseecom_probe: qseecom.whitelist_support = 1
643<4>[ 5.429977]@3 i2c-core: driver [tusb320] using legacy suspend method
644<4>[ 5.435323]@3 i2c-core: driver [tusb320] using legacy resume method
645<4>[ 5.441586]@3 i2c-core: driver [fusb301] using legacy suspend method
646<4>[ 5.447877]@3 i2c-core: driver [fusb301] using legacy resume method
647<4>[ 5.454170]@3 i2c-core: driver [ptn5150] using legacy suspend method
648<4>[ 5.460473]@3 i2c-core: driver [ptn5150] using legacy resume method
649<3>[ 5.468320]@3 gpio_dev_probe
650<3>[ 5.470255]@3 i= 1 gpio=: 97
651<3>[ 5.473065]@3 i= 2 gpio=: 98
652<3>[ 5.475939]@3 i= 3 gpio=: 100
653<3>[ 5.478904]@3 i= 4 gpio=: 115
654<3>[ 5.481881]@3 i= 5 gpio=: 127
655<3>[ 5.484831]@3 i= 6 gpio=: 133
656<3>[ 5.487798]@3 i= 7 gpio=: 136
657<4>[ 5.490694]@3 gpio_pinctrl_init
658<4>[ 5.494273]@3 gpio_dev_probe ok!
659<6>[ 5.497384]@3 Loading pn544 driver
660<6>[ 5.500655]@3 Enter pn544_probe !!!
661<6>[ 5.504140]@3 pn544_parse_dt: 9, 94, 12, 1015 ,1018, 0
662<6>[ 5.509252]@3 successfully got regulator_s4
663<6>[ 5.513517]@3 successfully set regulator voltage_s4
664<6>[ 5.518174]@3 get BBCLK2!!!
665<6>[ 5.520997]@3 clk_prepare_enable. ret = 0
666<6>[ 5.525078]@3 pn544_probe : requesting IRQ 273
667<6>[ 5.529484]@3 pn544_probe pn544_dev->clk_gpio = 0
668<6>[ 5.534114]@3 pn544_probe : requesting IRQ 542
669<4>[ 5.538550]@3 ###clkreq_disable_irq###
670<4>i2c-core: driver [pn544] using legacy suspend method
671<4>[ 5.546907]@3 i2c-core: driver [pn544] using legacy resume method
672<6>[ 5.553006]@3 [NXP-P61] : Entry : p61_dev_init
673<6>[ 5.558743]@3 qce 660000.qcedev: Qualcomm Crypto 5.3.1 device found @0x660000
674<6>[ 5.564941]@3 qce 660000.qcedev: CE device = 0x0
675<6>, IO base, CE = 0xffffff8003780000
676<6>, Consumer (IN) PIPE 2, Producer (OUT) PIPE 3
677<6>IO base BAM = 0x (null)
678<6>BAM IRQ 156
679<6>Engines Availability = 0x2011053
680<6>[ 5.584175]@3 sps:BAM 0x0000000000644000 is registered.
681<6>sps:BAM 0x0000000000644000 (va:0xffffff8003800000) enabled: ver:0x27, number of pipes:16
682<6>[ 5.597261]@3 QCE50: qce_sps_init: Qualcomm MSM CE-BAM at 0x0000000000644000 irq 156
683<6>[ 5.613491]@3 qcrypto 660000.qcrypto: Qualcomm Crypto 5.3.1 device found @0x660000
684<6>[ 5.620089]@3 qcrypto 660000.qcrypto: CE device = 0x0
685<6>, IO base, CE = 0xffffff8003840000
686<6>, Consumer (IN) PIPE 4, Producer (OUT) PIPE 5
687<6>IO base BAM = 0x (null)
688<6>BAM IRQ 156
689<6>Engines Availability = 0x2011053
690<6>[ 5.639995]@3 QCE50: qce_sps_init: Qualcomm MSM CE-BAM at 0x0000000000644000 irq 156
691<6>[ 5.653067]@3 qcrypto 660000.qcrypto: qcrypto-ecb-aes
692<6>[ 5.657150]@3 qcrypto 660000.qcrypto: qcrypto-cbc-aes
693<6>[ 5.662207]@3 qcrypto 660000.qcrypto: qcrypto-ctr-aes
694<6>[ 5.667211]@3 qcrypto 660000.qcrypto: qcrypto-ecb-des
695<6>[ 5.672264]@3 qcrypto 660000.qcrypto: qcrypto-cbc-des
696<6>[ 5.677285]@3 qcrypto 660000.qcrypto: qcrypto-ecb-3des
697<6>[ 5.682420]@3 qcrypto 660000.qcrypto: qcrypto-cbc-3des
698<6>[ 5.687528]@3 qcrypto 660000.qcrypto: qcrypto-xts-aes
699<6>[ 5.692589]@3 qcrypto 660000.qcrypto: qcrypto-sha1
700<6>[ 5.697332]@3 qcrypto 660000.qcrypto: qcrypto-sha256
701<6>[ 5.702296]@3 qcrypto 660000.qcrypto: qcrypto-aead-hmac-sha1-cbc-aes
702<6>[ 5.708619]@3 qcrypto 660000.qcrypto: qcrypto-aead-hmac-sha1-cbc-des
703<6>[ 5.714968]@3 qcrypto 660000.qcrypto: qcrypto-aead-hmac-sha1-cbc-3des
704<6>[ 5.721394]@3 qcrypto 660000.qcrypto: qcrypto-aead-hmac-sha256-cbc-aes
705<6>[ 5.727886]@3 qcrypto 660000.qcrypto: qcrypto-aead-hmac-sha256-cbc-des
706<6>[ 5.734412]@3 qcrypto 660000.qcrypto: qcrypto-aead-hmac-sha256-cbc-3des
707<6>[ 5.741008]@3 qcrypto 660000.qcrypto: qcrypto-hmac-sha1
708<6>[ 5.746204]@3 qcrypto 660000.qcrypto: qcrypto-hmac-sha256
709<6>[ 5.751598]@3 qcrypto 660000.qcrypto: qcrypto-aes-ccm
710<6>[ 5.756620]@3 qcrypto 660000.qcrypto: qcrypto-rfc4309-aes-ccm
711<6>[ 5.764916]@3 ICE IRQ = 28
712<6>[ 5.770758]@3 qcom_ice_get_pdevice: found ice device ffffffc0b5ddd600
713<6>[ 5.776178]@3 qcom_ice_get_pdevice: matching platform device ffffffc175bce800
714<3>[ 5.783798]@3 scm_call failed: func id 0x42000c02, ret: -2, syscall returns: 0xfffffffffffffffc, 0x0, 0x0
715<3>[ 5.793412]@3 ufs_qcom_phy_qmp_14nm 627000.ufsphy: failed to get tx_iface_clk err -2
716<3>ufs_qcom_phy_qmp_14nm 627000.ufsphy: failed to get rx_iface_clk err -2
717<6>scsi host0: ufshcd
718<6>[ 5.812291]@3 qcom_ice 630000.ufsice: QC ICE 2.1.44 device found @0xffffff8002890000
719<6>[ 5.831581]@3 SCSI Media Changer driver v0.25
720<6>[ 5.838686]@3 sps:BAM 0x0000000007544000 (va:0xffffff80025c0000) enabled: ver:0x19, number of pipes:24
721<6>[ 5.847255]@3 [NXP-P61] : p61_probe chip select : 1 , bus number = 0
722<3>[ 5.849251]@1 ufshcd 624000.ufshc: ufshcd_print_pwr_info:[RX, TX]: gear=[1, 1], lane[1, 1], pwr[SLOWAUTO_MODE, SLOWAUTO_MODE], rate = 0
723<6>[ 5.865833]@3 p61_parse_dt: 34, 21 0
724<6>[ 5.869188]@3 [NXP-P61] : Entry : p61_hw_setup
725<6>[ 5.873742]@3 [NXP-P61] : Exit : p61_hw_setup
726<6>[ 5.878234]@3 [NXP-P61] : Entry : p61_disable_irq
727<6>[ 5.882914]@3 [NXP-P61] : Exit : p61_disable_irq
728<6>[ 5.887589]@3 [NXP-P61] : Exit : p61_probe
729<6>[ 5.893354]@3 msm_sharedmem: sharedmem_register_qmi: qmi init successful
730<6>[ 5.896059]@2 msm_sharedmem: msm_sharedmem_probe: Device created for client 'rmtfs'
731<4>[ 5.900232]@2 7411000.qusb supply USB3_GDSC not found, using dummy regulator
732<3>[ 5.903332]@2 msm-dwc3 6a00000.ssusb: unable to get dbm device
733<6>[ 5.906305]@2 ehci_hcd: USB 2.0 'Enhanced' Host Controller (EHCI) Driver
734<6>[ 5.906315]@2 ehci-pci: EHCI PCI platform driver
735<6>[ 5.906354]@2 usbcore: registered new interface driver uas
736<6>[ 5.906370]@2 usbcore: registered new interface driver usb-storage
737<6>[ 5.906382]@2 usbcore: registered new interface driver ums-alauda
738<6>[ 5.906396]@2 usbcore: registered new interface driver ums-cypress
739<6>[ 5.906407]@2 usbcore: registered new interface driver ums-datafab
740<6>[ 5.906417]@2 usbcore: registered new interface driver ums_eneub6250
741<6>[ 5.906429]@2 usbcore: registered new interface driver ums-freecom
742<6>[ 5.906438]@2 usbcore: registered new interface driver ums-isd200
743<6>[ 5.906448]@2 usbcore: registered new interface driver ums-jumpshot
744<6>[ 5.906457]@2 usbcore: registered new interface driver ums-karma
745<6>[ 5.906467]@2 usbcore: registered new interface driver ums-onetouch
746<6>[ 5.906477]@2 usbcore: registered new interface driver ums-realtek
747<6>[ 5.906488]@2 usbcore: registered new interface driver ums-sddr09
748<6>[ 5.906499]@2 usbcore: registered new interface driver ums-sddr55
749<6>[ 5.906510]@2 usbcore: registered new interface driver ums-usbat
750<6>[ 5.906568]@2 usbcore: registered new interface driver usbserial
751<6>[ 5.907133]@0 gbridge_init: gbridge_init successs.
752<6>[ 5.907237]@0 mousedev: PS/2 mouse device common for all mice
753<6>[ 5.907358]@0 usbcore: registered new interface driver xpad
754<3>[ 5.907362]@0 synaptics,s3320: tpd_driver_init enter
755<3>[ 5.908424]@0 synaptics,s3320: before on cpu [0]
756<3>[ 5.908437]@0 synaptics,s3320: check CPU[0] is [online]
757<3>[ 5.908440]@0 synaptics,s3320: check CPU[1] is [online]
758<3>[ 5.909467]@0 touchkey,s1302: boot_time: before optimize [synaptics_ts_probe] on cpu 0
759<3>[ 5.909481]@0 touchkey,s1302: boot_time: [synaptics_ts_probe] CPU0 is online
760<3>[ 5.909484]@0 touchkey,s1302: boot_time: [synaptics_ts_probe] CPU1 is online
761<3>[ 5.911262]@2 switch_data->key3_gpio=1013
762<3>[ 5.911279]@2 switch_data->key2_gpio=1012
763<3>[ 5.911289]@2 switch_data->key1_gpio=1014
764<6>[ 5.912490]@2 fpc1020_probe
765<6>[ 5.912713]@2 fpc1020 soc:fpc_fpc1020: fpc,irq-gpio - gpio: 95
766<6>[ 5.912748]@2 fpc1020 soc:fpc_fpc1020: fpc,reset-gpio - gpio: 86
767<6>[ 5.912768]@2 fpc1020 soc:fpc_fpc1020: fpc,gpio_id0 - gpio: 25
768<3>[ 5.912771]@2 fpc1020 soc:fpc_fpc1020: fpc1020_probe: gpio_is_valid(fpc1020->id0_gpio=25)
769<6>[ 5.912802]@2 fpc1020 soc:fpc_fpc1020: fpc,gpio_id1 - gpio: 143
770<3>[ 5.912804]@2 fpc1020 soc:fpc_fpc1020: fpc1020_probe: gpio_is_valid(fpc1020->id1_gpio=143)
771<6>[ 5.912829]@2 fpc1020 soc:fpc_fpc1020: fpc,gpio_1V8_EN - gpio: 14
772<6>[ 5.912940]@2 input: fpc1020 as /devices/virtual/input/input1
773<6>[ 5.913243]@0 fpc1020 soc:fpc_fpc1020: requested irq 359
774<6>[ 5.913306]@0 fpc1020 soc:fpc_fpc1020: fpc1020_probe: ok
775<6>[ 5.914666]@2 qcom,qpnp-rtc qpnp-rtc-8: rtc core: registered qpnp_rtc as rtc0
776<6>[ 5.914848]@2 i2c /dev entries driver
777<3>[ 5.916343]@0 SMBCHG: load_data: chip is NULL !
778<3>[ 5.916728]@0 SMBCHG: load_data: chip is NULL !
779<6>[ 5.916852]@0 FG: fg_probe: FG Probe success - FG Revision DIG:3.1 ANA:1.2 PMIC subtype=19
780<6>[ 5.918280]@1 BQ: bq27541_battery_probe: probe sucdess
781<3>[ 5.918854]@1 i2c-msm-v2 757a000.i2c: msm_bus_scale_register_client(mstr-id:86):0x11 (ok)
782<6>BQ: check_bat_type: is_4p4v_bat=1,support_4p4v_bat=1
783<4>[ 5.920745]@2 i2c-core: driver [bq27541-battery] using legacy suspend method
784<4>[ 5.920748]@2 i2c-core: driver [bq27541-battery] using legacy resume method
785<6>[ 5.921314]@2 FASTCHG: dash_probe: dash_probe
786<6>[ 5.960045]@2 FASTCHG: dash_probe: dash_probe success
787<3>[ 5.961960]@2 unable to find DT imem DLOAD mode node
788<3>[ 5.963200]@2 unable to find DT imem EDLOAD mode node
789<4>[ 5.963899]@2 set_dload_mode ON
790<6>[ 5.995909]@0 device-mapper: uevent: version 1.0.3
791<6>[ 5.996070]@0 device-mapper: ioctl: 4.28.0-ioctl (2014-09-17) initialised: dm-devel@redhat.com
792<6>[ 5.996077]@0 device-mapper: req-crypt: dm-req-crypt successfully initalized.
793<6>
794<6>[ 5.996300]@0 sdhci: Secure Digital Host Controller Interface driver
795<6>[ 5.996302]@0 sdhci: Copyright(c) Pierre Ossman
796<6>[ 5.996304]@0 sdhci-pltfm: SDHCI platform and OF driver helper
797<6>[ 6.001502]@0 hidraw: raw HID events driver (C) Jiri Kosina
798<6>[ 6.001758]@0 usbcore: registered new interface driver usbhid
799<6>[ 6.001761]@0 usbhid: USB HID core driver
800<6>[ 6.002251]@0 ashmem: initialized
801<6>[ 6.002349]@0 logger: created 256K log 'log_main'
802<6>[ 6.002406]@0 logger: created 256K log 'log_events'
803<6>[ 6.002462]@0 logger: created 256K log 'log_radio'
804<6>[ 6.002529]@0 logger: created 256K log 'log_system'
805<6>[ 6.005747]@0 qpnp_coincell_charger_show_state: enabled=Y, voltage=3200 mV, resistance=2100 ohm
806<6>[ 6.012300]@2 bimc-bwmon 408000.qcom,cpu-bwmon: BW HWmon governor registered.
807<6>[ 6.013267]@2 arm-memlat-mon soc:qcom,arm-memlat-mon-0: Memory Latency governor registered.
808<6>[ 6.013297]@2 arm-memlat-mon soc:qcom,arm-memlat-mon-2: Memory Latency governor registered.
809<6>[ 6.015040]@2 m4m-hwmon 6530000.qcom,m4m-hwmon: Cache HWmon governor registered.
810<3>[ 6.018385]@2 devfreq soc:qcom,cpubw: Couldn't update frequency transition information.
811<3>[ 6.018482]@2 devfreq soc:qcom,mincpubw: Couldn't update frequency transition information.
812<3>[ 6.018569]@2 devfreq soc:qcom,memlat-cpu0: Couldn't update frequency transition information.
813<3>[ 6.018654]@2 devfreq soc:qcom,memlat-cpu2: Couldn't update frequency transition information.
814<6>[ 6.021939]@2 otracer: initialized
815<6>[ 6.022028]@0 op_netlink_init
816<3>[ 6.022819]@0 tfa98xx_i2c_probe
817<6>[ 6.023303]@0 TCP: cubic registered
818<6>[ 6.023476]@0 NET: Registered protocol family 10
819<6>[ 6.023870]@0 NET: Registered protocol family 17
820<6>[ 6.024538]@0 NET: Registered protocol family 27
821<6>[ 6.026744]@0 subsys-pil-tz 9300000.qcom,lpass: for adsp segments only will be dumped.
822<6>subsys-pil-tz 1c00000.qcom,ssc: for slpi segments only will be dumped.
823<6>sps:BAM 0x0000000006b04000 is registered.
824<3>qpnp-smbcharger qpnp-smbcharger-17: node /soc/qcom,spmi@400f000/qcom,pmi8994@2/qcom,qpnp-smbcharger IO resource absent!
825<6>[ 6.032043]@0 SMBCHG: qpnp_battery_temp_region_set: set temp_region = 5
826<6>[ 6.032117]@0 smbcharger_charger_otg: no parameters
827<6>[ 6.032215]@0 smbcharger_external_otg: no parameters
828<6>[ 6.032239]@0 smbcharger_external_otg: supplied by pmi8994_boost_5v
829<6>[ 6.032312]@0 SMBCHG: smbchg_hw_init: enable APSD
830<6>[ 6.032360]@0 SMBCHG: smbchg_hw_init: disabe HVDCP
831<6>[ 6.032602]@0 SMBCHG: smbchg_charging_en: enable=1
832<6>[ 6.032717]@0 SMBCHG: smbchg_charging_en: enable=0
833<6>[ 6.032743]@0 SMBCHG: smbchg_usb_suspend: suspend=0
834<6>[ 6.033216]@0 SMBCHG: smbchg_set_fastchg_current_raw: fastcharge current requested 500, set to 500
835<6>[ 6.060572]@0 SMBCHG: handle_usb_insertion: inserted type = 4 (SDP)
836<6>[ 6.060576]@0 SMBCHG: smbchg_charging_en: enable=1
837<6>[ 6.060601]@0 FG: oneplus_set_allow_read_iic: set allow read extern fg iic fail
838<6>[ 6.060606]@0 SMBCHG: smbchg_set_usb_current_max: USB current_ma = 500, typeC_support_current_ma = 4000
839<6>[ 6.060953]@0 SMBCHG: smbchg_usb_update_online_work: chip->usb_online = -22, online = 1
840<6>[ 6.061082]@0 SMBCHG: load_data: stored_soc[0xb1], shutdown_soc[88]
841<6>[ 6.061183]@0 SMBCHG: load_data: stored_soc[0xb1], shutdown_soc[88]
842<3>[ 6.074935]@1 ufshcd 624000.ufshc: ufshcd_print_pwr_info:[RX, TX]: gear=[3, 3], lane[1, 1], pwr[FAST MODE, FAST MODE], rate = 2
843<5>[ 6.075332]@1 scsi 0:0:0:49488: Well-known LUN SAMSUNG KLUCG4J1CB-B0B1 0800 PQ: 0 ANSI: 6
844<5>[ 6.075888]@1 scsi 0:0:0:49456: Well-known LUN SAMSUNG KLUCG4J1CB-B0B1 0800 PQ: 0 ANSI: 6
845<5>[ 6.076396]@1 scsi 0:0:0:49476: Well-known LUN SAMSUNG KLUCG4J1CB-B0B1 0800 PQ: 0 ANSI: 6
846<4>[ 6.076889]@1 ufs_get_capacity_info size = 0x7734000
847<5>scsi 0:0:0:0: Direct-Access SAMSUNG KLUCG4J1CB-B0B1 0800 PQ: 0 ANSI: 6
848<5>[ 6.077629]@1 scsi 0:0:0:1: Direct-Access SAMSUNG KLUCG4J1CB-B0B1 0800 PQ: 0 ANSI: 6
849<5>[ 6.077965]@1 scsi 0:0:0:2: Direct-Access SAMSUNG KLUCG4J1CB-B0B1 0800 PQ: 0 ANSI: 6
850<6>[ 6.078200]@0 SMBCHG: load_data: stored_soc[0xb1], shutdown_soc[88]
851<5>[ 6.078359]@1 scsi 0:0:0:3: Direct-Access SAMSUNG KLUCG4J1CB-B0B1 0800 PQ: 0 ANSI: 6
852<5>[ 6.078739]@1 scsi 0:0:0:4: Direct-Access SAMSUNG KLUCG4J1CB-B0B1 0800 PQ: 0 ANSI: 6
853<6>[ 6.078759]@0 SMBCHG: load_data: stored_soc[0xb1], shutdown_soc[88]
854<6>[ 6.079047]@0 SMBCHG: load_data: stored_soc[0xb1], shutdown_soc[88]
855<5>[ 6.079172]@0 scsi 0:0:0:5: Direct-Access SAMSUNG KLUCG4J1CB-B0B1 0800 PQ: 0 ANSI: 6
856<5>[ 6.079951]@1 sd 0:0:0:0: [sda] 16384-byte physical blocks
857<5>[ 6.080341]@1 sd 0:0:0:1: [sdb] 16384-byte physical blocks
858<5>[ 6.080710]@2 sd 0:0:0:2: [sdc] 16384-byte physical blocks
859<5>[ 6.081093]@1 sd 0:0:0:3: [sdd] 16384-byte physical blocks
860<6>[ 6.081654]@0 SMBCHG: load_data: stored_soc[0xb1], shutdown_soc[88]
861<5>[ 6.082658]@2 sd 0:0:0:4: [sde] 16384-byte physical blocks
862<5>[ 6.082899]@2 sd 0:0:0:5: [sdf] 16384-byte physical blocks
863<5>[ 6.083771]@1 sd 0:0:0:1: [sdb] 16384-byte physical blocks
864<3>[ 6.083970]@1 qpnp-smbcharger qpnp-smbcharger-17: node /soc/qcom,spmi@400f000/qcom,pmi8994@2/qcom,qpnp-smbcharger IO resource absent!
865<5>[ 6.084152]@1 sd 0:0:0:0: [sda] 16384-byte physical blocks
866<5>[ 6.084694]@1 sd 0:0:0:2: [sdc] 16384-byte physical blocks
867<6>[ 6.084745]@0 SMBCHG: load_data: stored_soc[0xb1], shutdown_soc[88]
868<5>[ 6.085241]@1 sd 0:0:0:3: [sdd] 16384-byte physical blocks
869<5>[ 6.086875]@2 sd 0:0:0:5: [sdf] 16384-byte physical blocks
870<5>[ 6.086950]@0 sd 0:0:0:4: [sde] 16384-byte physical blocks
871<6>[ 6.088499]@1 sda: sda1 sda2 sda3 sda4 sda5 sda6 sda7 sda8 sda9 sda10 sda11 sda12 sda13 sda14 sda15
872<6>[ 6.088701]@2 sdc: sdc1
873<5>[ 6.089132]@2 sd 0:0:0:2: [sdc] 16384-byte physical blocks
874<5>[ 6.089856]@2 sd 0:0:0:0: [sda] 16384-byte physical blocks
875<6>[ 6.090148]@2 sdd: sdd1 sdd2 sdd3
876<6>[ 6.090389]@1 sdf: sdf1 sdf2 sdf3 sdf4
877<5>[ 6.090910]@2 sd 0:0:0:3: [sdd] 16384-byte physical blocks
878<6>[ 6.091296]@0 sdb: sdb1
879<5>[ 6.091819]@1 sd 0:0:0:5: [sdf] 16384-byte physical blocks
880<6>[ 6.092322]@1 sde: sde1 sde2 sde3 sde4 sde5 sde6 sde7 sde8 sde9 sde10 sde11 sde12 sde13 sde14 sde15 sde16 sde17 sde18 sde19 sde20 sde21 sde22 sde23 sde24 sde25 sde26 sde27 sde28 sde29 sde30 sde31 sde32 sde33 sde34
881<5>[ 6.092824]@0 sd 0:0:0:1: [sdb] 16384-byte physical blocks
882<5>[ 6.094231]@1 sd 0:0:0:4: [sde] 16384-byte physical blocks
883<3>[ 6.104802]@0 msm-usb-ssphy-qmp 7410000.ssphy: QMP PHY initialization timeout
884<3>[ 6.104808]@0 msm-usb-ssphy-qmp 7410000.ssphy: USB3_PHY_PCS_STATUS:69696969
885<6>[ 6.106202]@1 SMBCHG: load_data: stored_soc[0xb1], shutdown_soc[88]
886<6>[ 6.106261]@1 SMBCHG: load_data: stored_soc[0xb1], shutdown_soc[88]
887<6>[ 6.106336]@1 SMBCHG: load_data: stored_soc[0xb1], shutdown_soc[88]
888<6>[ 6.106434]@1 SMBCHG: load_data: stored_soc[0xb1], shutdown_soc[88]
889<6>[ 6.107420]@1 qpnp-smbcharger qpnp-smbcharger-17: SMBCHG successfully probe Charger version=SCHG Revision DIG:2.0 ANA:2.1 batt=1 dc=0 usb=1
890<3>[ 6.107459]@1 tusb320 7-0060: tusb320_probe
891<3>[ 6.108083]@1 i2c-msm-v2 75b5000.i2c: msm_bus_scale_register_client(mstr-id:84):0x19 (ok)
892<3>i2c-msm-v2 75b5000.i2c: NACK: slave not responding, ensure its powered: msgs(n:2 cur:0 tx) bc(rx:1 tx:1) mode:FIFO slv_addr:0x60 MSTR_STS:0x0d1300c8 OPER:0x00000010
893<4>[ 6.108225]@1 tusb320_read_reg:reg(0x0), ret(-107)
894<3>[ 6.108229]@1 tusb320 7-0060: DEV_ID(0x0)!= 0x30
895<4>[ 6.108239]@1 tusb320: probe of 7-0060 failed with error -22
896<3>[ 6.108282]@1 fusb301 7-0021: fusb301_probe
897<3>[ 6.108534]@1 fusb301 7-0021: fusb301_gpio_configure OK!
898<6>[ 6.109223]@1 SMBCHG: load_data: stored_soc[0xb1], shutdown_soc[88]
899<3>[ 6.109352]@1 fusb301 7-0021: fusb301_probe OK!
900<3>[ 6.109409]@1 ptn5150 7-001d: ptn5150_probe
901<3>[ 6.109466]@0 i2c-msm-v2 75b5000.i2c: NACK: slave not responding, ensure its powered: msgs(n:2 cur:0 tx) bc(rx:1 tx:1) mode:FIFO slv_addr:0x1d MSTR_STS:0x091343c8 OPER:0x00000010
902<3>[ 6.109491]@1 ptn5150_read_reg: i2c read error: -5
903<3>[ 6.109495]@1 ptn5150 7-001d: DEV_ID(0x00)!= 0x0b || 0x09
904<4>[ 6.109501]@1 ptn5150: probe of 7-001d failed with error -22
905<6>[ 6.124572]@0 project_info_init_sysfs success
906<6>[ 6.124980]@0 fastrpc soc:qcom,msm-adsprpc-mem: for adsp_rh segments only will be dumped.
907<6>adsprpc: channel link type: 0
908<6>[ 6.135467]@0 file system registered
909<6>[ 6.135497]@0 mbim_init: initialize 1 instances
910<6>[ 6.135530]@0 mbim_init: Initialized 1 ports
911<6>[ 6.136270]@0 rndis_qc_init: initialize rndis QC instance
912<6>[ 6.136378]@0 Number of LUNs=8
913<6>[ 6.136383]@0 Mass Storage Function, version: 2009/09/11
914<6>[ 6.136386]@0 LUN: removable file: (no medium)
915<6>[ 6.136395]@0 Number of LUNs=1
916<6>[ 6.136420]@0 LUN: removable read only CD-ROM file: (no medium)
917<6>[ 6.136422]@0 Number of LUNs=1
918<6>[ 6.136522]@0 android_usb gadget: android_usb ready
919<6>[ 6.138032]@0 input: gpio-keys as /devices/soc/soc:gpio_keys/input/input2
920<6>[ 6.141217]@0 qcom,qpnp-rtc qpnp-rtc-8: setting system clock to 1970-01-31 22:35:48 UTC (2673348)
921<6>[ 6.141591]@2 SMBCHG: load_data: stored_soc[0xb1], shutdown_soc[88]
922<6>[ 6.145326]@2 lmh_lite:lmh_parse_sensor Registering sensor:[DLMt_APC1]
923<6>[ 6.145530]@0 lmh_lite:lmh_parse_sensor Registering sensor:[LLM_cp00]
924<6>[ 6.145684]@0 lmh_lite:lmh_parse_sensor Registering sensor:[LLM_cp01]
925<6>[ 6.145812]@0 lmh_lite:lmh_parse_sensor Registering sensor:[LLM_cp10]
926<6>[ 6.145935]@0 lmh_lite:lmh_parse_sensor Registering sensor:[LLM_cp11]
927<6>[ 6.146054]@0 lmh_lite:lmh_parse_sensor Registering sensor:[LLM_m4m0]
928<6>[ 6.146173]@0 lmh_lite:lmh_parse_sensor Registering sensor:[LLM_l21-]
929<6>[ 6.146292]@0 lmh_lite:lmh_parse_sensor Registering sensor:[LLM_l20-]
930<3>[ 6.148116]@0 parse_cpu_levels: idx 1 545
931<3>[ 6.148123]@0 parse_cpu_levels: idx 2 6022
932<3>[ 6.148125]@0 parse_cpu_levels: idx 2 11499
933<3>[ 6.148167]@0 parse_cpu_levels: idx 1 545
934<3>[ 6.148169]@0 parse_cpu_levels: idx 2 6022
935<3>[ 6.148171]@0 parse_cpu_levels: idx 2 11499
936<3>[ 6.154354]@2 qcom,qpnp-flash-led qpnp-flash-led-25: Unable to acquire pinctrl
937<6>[ 6.155589]@2 rmnet_ipa started initialization
938<6>[ 6.155594]@2 IPA SSR support = True
939<6>[ 6.155595]@2 IPA ipa-loaduC = True
940<6>[ 6.155597]@2 IPA SG support = True
941<3>[ 6.157120]@0 ipa ipa_sps_irq_control_all:938 EP (5) not allocated.
942<3>[ 6.157124]@0 ipa ipa2_uc_state_check:301 uC is not loaded
943<6>[ 6.157912]@2 SMBCHG: load_data: stored_soc[0xb1], shutdown_soc[88]
944<6>[ 6.157972]@0 rmnet_ipa completed initialization
945<6>[ 6.157976]@2 SMBCHG: load_data: stored_soc[0xb1], shutdown_soc[88]
946<6>[ 6.158061]@2 SMBCHG: load_data: stored_soc[0xb1], shutdown_soc[88]
947<6>[ 6.160753]@2 SMBCHG: load_data: stored_soc[0xb1], shutdown_soc[88]
948<6>[ 6.161938]@2 qcom,cc-debug-8996 362000.qcom,cc-debug: Registered debug mux.
949<6>[ 6.162590]@2 wlan_en_vreg: disabling
950<6>[ 6.162595]@2 rome_vreg: disabling
951<6>[ 6.162597]@2 gdsc_mmagic_bimc: disabling
952<6>[ 6.162632]@2 kryo1-retention: disabling
953<6>[ 6.162634]@2 kryo0-retention: disabling
954<6>[ 6.162636]@2 gfx_mem_acc_corner: disabling
955<6>[ 6.162638]@2 apcc_l3_mem_acc_corner: disabling
956<6>[ 6.162640]@2 apc1_perfcl_mem_acc_corner: disabling
957<6>[ 6.162642]@2 apc0_pwrcl_mem_acc_corner: disabling
958<6>[ 6.162645]@2 regulator_proxy_consumer_remove_all: removing regulator proxy consumer requests
959<6>[ 6.162899]@2 clock_late_init: Removing enables held for handed-off clocks
960<6>[ 6.166079]@2 ALSA device list:
961<6>[ 6.166082]@2 No soundcards found.
962<3>[ 6.210028]@1 synaptics,s3320: after on cpu [1]
963<3>[ 6.210033]@1 synaptics,s3320: synaptics_ts_probe is called
964<3>[ 6.210191]@1 synaptics,s3320: synaptics_parse_dts ts->support_hw_poweroff =1
965<3>[ 6.210194]@1 synaptics,s3320: ts->enable2v8_gpio not specified
966<3>[ 6.210197]@1 synaptics,s3320: ts->max_num not specified
967<3>[ 6.210199]@1 synaptics,s3320: button-map not specified
968<3>[ 6.210200]@1 synaptics,s3320: synaptics:button map readed is 0 0 0
969<3>[ 6.210203]@1 synaptics,s3320: synaptics,tx-rx-num is 16 28
970<4>[ 6.210206]@1 synaptics,s3320: synaptic:ts->irq_gpio:125 irq_flags:8200 max_num 10
971<3>[ 6.210423]@1 touchkey,s1302: boot_time: after optimize call [synaptics_ts_probe] on cpu 1
972<3>[ 6.210427]@1 touchkey,s1302: synaptics_ts_probe is called
973<3>[ 6.210916]@1 synaptics,s3320: synaptics:enable the v1p8_gpio
974<3>[ 6.290038]@1 synaptics,s3320: synaptics:enable the reset_gpio
975<3>[ 6.400322]@1 i2c-msm-v2 75ba000.i2c: msm_bus_scale_register_client(mstr-id:84):0x1b (ok)
976<3>synaptics,s3320: F12_2D_QUERY_BASE = 47
977<3> F12_2D_CMD_BASE = 0
978<3> F12_2D_CTRL_BASE = 15
979<3> F12_2D_DATA_BASE = 6
980<3>
981<3>synaptics,s3320: F01_RMI_QUERY_BASE = 2a
982<3> F01_RMI_CMD_BASE = 25
983<3> F01_RMI_CTRL_BASE = e
984<3> F01_RMI_DATA_BASE = 4
985<3>
986<3>synaptics,s3320: F34_FLASH_QUERY_BASE = 26
987<3> F34_FLASH_CMD_BASE = 0
988<3> F34_FLASH_CTRL_BASE = a
989<3> F34_FLASH_DATA_BASE = 0
990<3>
991<3>synaptics,s3320: F51_CUSTOM_QUERY_BASE = 3a
992<3> F51_CUSTOM_CMD_BASE = 0
993<3> F51_CUSTOM_CTRL_BASE = 1a
994<3> F51_CUSTOM_DATA_BASE = 0
995<3>
996<3>synaptics,s3320: F54_QUERY_BASE = 47
997<3> F54_CMD_BASE = 46
998<3> F54_CTRL_BASE = e
999<3> F54_DATA_BASE = 0
1000<3>
1001<3>synaptics,s3320: before fw update bootloader_mode[0x0]
1002<3>[ 6.402393]@1 synaptics,s3320: CURRENT_FIRMWARE_ID = 0x15811001
1003<3>[ 6.402802]@1 synaptics,s3320: 0synatpitcs_fw: fw_name = tp/fw_synaptics_15811.img,ts->manu_name:S350815811
1004<3>[ 6.402970]@1 synaptics,s3320: synaptics_init_panel is called!
1005<3>[ 6.403227]@1 synaptics,s3320: synaptics_mode_change: set TP to mode[0x80]
1006<3>[ 6.404851]@1 synaptics,s3320: max_x = 1080,max_y = 1920; max_x_ic = 1079,max_y_ic = 1919
1007<3>[ 6.404997]@1 synaptics,s3320: afte fw update,program memory self-check bootloader_mode = 0x0
1008<3>[ 6.405448]@1 synaptics,s3320: synaptics_soft_reset !!!
1009<3>[ 6.580284]@1 synaptics,s3320: synaptics_tpedge_limitfunc limit_enable =1,mode:0x4b !
1010<3>[ 6.580491]@1 synaptics,s3320: synaptics_input_init is called
1011<6>[ 6.580585]@1 input: synaptics,s3320 as /devices/soc/75ba000.i2c/i2c-12/12-0020/input/input3
1012<3>[ 6.640036]@1 synaptics,s3320: synaptic:ts->irq is 389
1013<3>[ 6.640472]@1 synaptics,s3320: enter reset tp status,and ts->in_gesture_mode is:0
1014<3>[ 6.640475]@1 synaptics,s3320: synaptics_init_panel is called!
1015<3>[ 6.640721]@1 synaptics,s3320: synaptics_mode_change: set TP to mode[0x80]
1016<3>[ 6.670544]@1 synaptics,s3320: synaptics_ts_probe: going to create files--tp_fw_update
1017<4>[ 6.670634]@1 synaptics,s3320: synaptics_ts_probe 3203: normal end
1018<3>[ 6.760320]@1 i2c-msm-v2 75b6000.i2c: msm_bus_scale_register_client(mstr-id:84):0x1c (ok)
1019<3>touchkey,s1302: product id is s1302
1020<3>[ 6.761188]@1 touchkey,s1302: F11_2D_QUERY_BASE = 95
1021<3> F11_2D_CMD_BASE = 6e
1022<3> F11_2D_CTRL_BASE = 3d
1023<3> F11_2D_DATA_BASE = 15
1024<3>
1025<3>touchkey,s1302: CURRENT_FIRMWARE_ID = 0x4
1026<3>[ 6.762606]@1 touchkey,s1302: before fw update,bootloader_mode = 0x0
1027<6>[ 6.762694]@1 input: HWK,synaptics,s1302 as /devices/soc/75b6000.i2c/i2c-8/8-0020/input/input4
1028<3>[ 6.860031]@1 touchkey,s1302: synaptic:ts->irq is 396
1029<3>[ 6.860148]@1 touchkey,s1302: touchkey using poll status:0
1030<3>[ 6.860384]@1 touchkey,s1302: synaptics_soft_reset !!!
1031<3>[ 6.860406]@1 touchkey,s1302: create nodes is successe!
1032<4>[ 6.860461]@1 touchkey,s1302: synaptics_ts_probe s1302: normal end
1033<3>[ 6.860463]@1 touchkey,s1302: boot_time: synaptics_ts_probe return 0
1034<6>[ 6.918019]@1 BQ: bq27541_hw_config: DEVICE_TYPE is 0x541, FIRMWARE_VERSION is 0x200
1035<6>[ 6.918023]@1 BQ: bq27541_hw_config: Complete bq27541 configuration 0x600B
1036<6>[ 7.615781]@2 Freeing unused kernel memory: 396K (ffffffc000af6000 - ffffffc000b59000)
1037<6>[ 7.622696]@2 Freeing alternatives memory: 68K (ffffffc000b59000 - ffffffc000b6a000)
1038<13>[ 7.650138]@2 init: init started!
1039<7>[ 7.653816]@2 SELinux: 2048 avtab hash slots, 4859 rules.
1040<6>[ 7.653843]@2 SELinux: Android master kernel running Android M policy in compatibility mode.
1041<7>[ 7.661992]@2 SELinux: 2048 avtab hash slots, 4859 rules.
1042<7>[ 7.662002]@2 SELinux: 1 users, 2 roles, 530 types, 0 bools, 1 sens, 1024 cats
1043<7>[ 7.662007]@2 SELinux: 87 classes, 4859 rules
1044<6>[ 7.662252]@2 SELinux: Permission module_load in class system not defined in policy.
1045<6>[ 7.669302]@2 SELinux: Permission audit_read in class capability2 not defined in policy.
1046<6>[ 7.677349]@2 SELinux: Class can_socket not defined in policy.
1047<6>[ 7.683413]@2 SELinux: the above unknown classes and permissions will be denied
1048<7>[ 7.690520]@2 SELinux: Completing initialization.
1049<7>[ 7.690523]@2 SELinux: Setting up existing superblocks.
1050<7>[ 7.690531]@2 SELinux: initialized (dev tmpfs, type tmpfs), uses transition SIDs
1051<7>[ 7.690546]@2 SELinux: initialized (dev rootfs, type rootfs), uses genfs_contexts
1052<7>[ 7.690955]@2 SELinux: initialized (dev bdev, type bdev), not configured for labeling
1053<7>[ 7.690963]@2 SELinux: initialized (dev proc, type proc), uses genfs_contexts
1054<7>[ 7.690979]@2 SELinux: initialized (dev debugfs, type debugfs), uses genfs_contexts
1055<7>[ 7.713372]@2 SELinux: initialized (dev sockfs, type sockfs), uses task SIDs
1056<7>[ 7.713388]@2 SELinux: initialized (dev pipefs, type pipefs), uses task SIDs
1057<7>[ 7.713395]@2 SELinux: initialized (dev anon_inodefs, type anon_inodefs), not configured for labeling
1058<7>[ 7.713400]@2 SELinux: initialized (dev aio, type aio), not configured for labeling
1059<7>[ 7.713407]@2 SELinux: initialized (dev devpts, type devpts), uses transition SIDs
1060<7>[ 7.713420]@2 SELinux: initialized (dev selinuxfs, type selinuxfs), uses genfs_contexts
1061<7>[ 7.713474]@2 SELinux: initialized (dev tmpfs, type tmpfs), uses transition SIDs
1062<7>[ 7.713488]@2 SELinux: initialized (dev sysfs, type sysfs), uses genfs_contexts
1063<5>[ 7.732774]@2 audit: type=1403 audit(2673350.089:2): policy loaded auid=4294967295 ses=4294967295
1064<13>[ 7.740972]@2 init: (Initializing SELinux non-enforcing took 0.09s.)
1065<13>[ 7.749534]@2 init: init second stage started!
1066<11>[ 7.753162]@2 init: property_set("ro.boot.bootdevice", "624000.ufshc") failed
1067<11>[ 7.760104]@2 init: property_set("ro.boot.selinux", "permissive") failed
1068<11>[ 8.076399]@2 init: waitpid failed: No child processes
1069<13>[ 8.080960]@2 init: (Loading properties from /default.prop took 0.00s.)
1070<11>[ 8.087368]@2 init: /init.rc: 62: invalid command 'load_all_props'
1071<11>[ 8.093357]@2 init: could not import file '/init.recovery.logd.rc' from '/init.rc'
1072<13>[ 8.100890]@2 init: (Parsing /init.recovery.usb.rc took 0.00s.)
1073<13>[ 8.106750]@2 init: (Parsing /init.recovery.service.rc took 0.00s.)
1074<13>[ 8.113036]@2 init: (Parsing /init.recovery.qcom.rc took 0.00s.)
1075<13>[ 8.118966]@2 init: (Parsing /init.rc took 0.03s.)
1076<5>[ 8.123816]@2 audit: type=1400 audit(2673350.479:3): avc: denied { setcheckreqprot } for pid=1 comm="init" scontext=u:r:init:s0 tcontext=u:object_r:kernel:s0 tclass=security permissive=1
1077<5>[ 8.140838]@2 audit: type=1400 audit(2673350.499:4): avc: denied { setcurrent } for pid=1 comm="init" scontext=u:r:init:s0 tcontext=u:r:init:s0 tclass=process permissive=1
1078<5>[ 8.156142]@2 audit: type=1400 audit(2673350.509:5): avc: denied { dyntransition } for pid=1 comm="init" scontext=u:r:init:s0 tcontext=u:r:init:s0 tclass=process permissive=1
1079<11>[ 8.171961]@2 init: SELinux: Could not get canonical path /postinstall restorecon: No such file or directory.
1080<13>[ 8.181848]@2 init: Starting service 'ueventd'...
1081<13>[ 8.186646]@2 init: Starting service 'healthd'...
1082<13>[ 8.187675]@3 ueventd: ueventd started!
1083<13>[ 8.195384]@2 init: Waiting for /dev/.coldboot_done...
1084<3>[ 8.383512]@2 BQ: bq27541_battery_soc: bq27541_battery_soc = 89
1085<3>[ 8.384394]@3 BQ: bq27541_battery_soc: bq27541_battery_soc = 89
1086<6>[ 8.384413]@3 SMBCHG: load_data: stored_soc[0xb1], shutdown_soc[88]
1087<6>[ 8.384416]@3 BQ: fg_soc_calibrate: soc=89, soc_load=88
1088<13>[ 8.971440]@3 ueventd: Coldboot took 0.78s.
1089<13>[ 8.976409]@0 init: Waiting for /dev/.coldboot_done took 0.78s.
1090<7>[ 8.982538]@0 SELinux: initialized (dev tmpfs, type tmpfs), uses transition SIDs
1091<13>[ 8.983180]@0 init: Starting service 'setup-decrypt'...
1092<7>[ 8.987675]@0 SELinux: initialized (dev pstore, type pstore), uses genfs_contexts
1093<7>[ 8.988140]@0 SELinux: initialized (dev functionfs, type functionfs), uses genfs_contexts
1094<3>[ 8.988271]@0 enable_store: android_usb: already disabled
1095<11>[ 8.992959]@2 init: property 'ro.product.model' doesn't exist while expanding '${ro.product.model}'
1096<5>[ 8.998698]@3 audit: type=1400 audit(2673351.349:6): avc: denied { write } for pid=404 comm="setup_decrypt" name="kmsg" dev="tmpfs" ino=9944 scontext=u:r:recovery:s0 tcontext=u:object_r:kmsg_device:s0 tclass=chr_file permissive=1
1097<5>[ 8.998715]@3 audit: type=1400 audit(2673351.349:7): avc: denied { open } for pid=404 comm="setup_decrypt" path="/dev/kmsg" dev="tmpfs" ino=9944 scontext=u:r:recovery:s0 tcontext=u:object_r:kmsg_device:s0 tclass=chr_file permissive=1
1098<12>[ 8.998744]@3 setup_decrypt: Mounting /system read-only
1099<6>[ 9.011075]@0 EXT4-fs (sde20): mounted filesystem with ordered data mode. Opts: (null)
1100<7>[ 9.011092]@0 SELinux: initialized (dev sde20, type ext4), uses xattr
1101<12>[ 9.023876]@3 setup_decrypt: Copying decryption libraries from /system
1102<5>[ 9.027403]@3 audit: type=1400 audit(2673351.379:8): avc: denied { write } for pid=411 comm="cp" name="sbin" dev="rootfs" ino=7909 scontext=u:r:recovery:s0 tcontext=u:object_r:rootfs:s0 tclass=dir permissive=1
1103<5>[ 9.027418]@3 audit: type=1400 audit(2673351.379:9): avc: denied { remove_name } for pid=411 comm="cp" name="qseecomd" dev="rootfs" ino=8147 scontext=u:r:recovery:s0 tcontext=u:object_r:rootfs:s0 tclass=dir permissive=1
1104<5>[ 9.027428]@3 audit: type=1400 audit(2673351.379:10): avc: denied { unlink } for pid=411 comm="cp" name="qseecomd" dev="rootfs" ino=8147 scontext=u:r:recovery:s0 tcontext=u:object_r:rootfs:s0 tclass=file permissive=1
1105<5>[ 9.027461]@3 audit: type=1400 audit(2673351.379:11): avc: denied { add_name } for pid=411 comm="cp" name="qseecomd" scontext=u:r:recovery:s0 tcontext=u:object_r:rootfs:s0 tclass=dir permissive=1
1106<5>[ 9.046540]@3 random: sed urandom read with 91 bits of entropy available
1107<11>[ 9.145495]@1 init: cannot expand '${ro.product.model}' while writing to '/sys/class/android_usb/android0/iProduct'
1108<11>[ 9.156011]@2 init: avc: denied { set } for property=crypto.using_system_libs scontext=u:r:recovery:s0 tcontext=u:object_r:vold_prop:s0 tclass=property_service
1109<3>[ 9.170137]@2 functions_store: android_usb: functions_store'adb'
1110<12>[ 9.170969]@3 setup_decrypt: Using system decryption libraries!
1111<13>[ 9.182057]@2 init: Service 'setup-decrypt' (pid 401) exited with status 0
1112<11>[ 9.190658]@2 init: property_set("ro.build.product", "OnePlus3") failed
1113<11>[ 9.196243]@2 init: property_set("ro.build.user", "OnePlus") failed
1114<11>[ 9.202520]@2 init: property_set("ro.build.flavor", "OnePlus3-user") failed
1115<11>[ 9.209437]@2 init: property_set("ro.build.description", "OnePlus3-user 7.0 NRD90M 138 dev-keys") failed
1116<11>[ 9.218994]@2 init: property_set("ro.product.brand", "OnePlus") failed
1117<11>[ 9.225423]@2 init: property_set("ro.product.manufacturer", "OnePlus") failed
1118<11>[ 9.232648]@2 init: property_set("ro.build.id", "NRD90M") failed
1119<11>[ 9.238517]@2 init: property_set("ro.build.version.incremental", "138") failed
1120<11>[ 9.245911]@2 init: property_set("ro.build.version.sdk", "24") failed
1121<11>[ 9.252160]@2 init: property_set("ro.build.version.preview_sdk", "0") failed
1122<11>[ 9.259178]@2 init: property_set("ro.build.version.codename", "REL") failed
1123<11>[ 9.266132]@2 init: property_set("ro.build.version.all_codenames", "REL") failed
1124<11>[ 9.273513]@2 init: property_set("ro.build.version.release", "7.0") failed
1125<11>[ 9.280369]@2 init: property_set("ro.build.version.security_patch", "2016-12-01") failed
1126<11>[ 9.288431]@2 init: property_set("ro.build.version.base_os", "") failed
1127<11>[ 9.295211]@2 init: property_set("ro.build.date", "Sat Jan 14 01:21:58 CST 2017") failed
1128<11>[ 9.303114]@2 init: property_set("ro.build.date.utc", "1484328118") failed
1129<11>[ 9.309959]@2 init: property_set("ro.build.type", "user") failed
1130<11>[ 9.315960]@2 init: property_set("ro.build.host", "ubuntu-23") failed
1131<11>[ 9.322402]@2 init: property_set("ro.build.tags", "release-keys") failed
1132<11>[ 9.329054]@2 init: property_set("ro.product.board", "QC_Reference_Phone") failed
1133<11>[ 9.336541]@2 init: property_set("ro.product.cpu.abi", "arm64-v8a") failed
1134<11>[ 9.343560]@2 init: property_set("ro.product.cpu.abilist", "arm64-v8a,armeabi-v7a,armeabi") failed
1135<11>[ 9.352332]@2 init: property_set("ro.product.cpu.abilist32", "armeabi-v7a,armeabi") failed
1136<11>[ 9.360576]@2 init: property_set("ro.product.cpu.abilist64", "arm64-v8a") failed
1137<11>[ 9.367944]@2 init: property_set("ro.product.locale", "en-US") failed
1138<11>[ 9.374391]@2 init: property_set("ro.wifi.channels", "") failed
1139<11>[ 9.380289]@2 init: property_set("ro.board.platform", "msm8996") failed
1140<11>[ 9.386869]@2 init: property_set("ro.build.characteristics", "nosdcard") failed
1141<11>[ 9.394867]@2 init: property_set("ro.com.android.dataroaming", "false") failed
1142<11>[ 9.401379]@2 init: property_set("ro.config.ringtone", "oneplus_tune.ogg") failed
1143<11>[ 9.408836]@2 init: property_set("ro.config.notification_sound", "meet.ogg") failed
1144<11>[ 9.416480]@2 init: property_set("ro.config.alarm_alert", "spring.ogg") failed
1145<11>[ 9.423704]@2 init: property_set("ro.carrier", "unknown") failed
1146<11>[ 9.429681]@2 init: property_set("ro.frp.pst", "/dev/block/bootdevice/by-name/frp") failed
1147<11>[ 9.437946]@2 init: property_set("ro.qc.sdk.audio.fluencetype", "none") failed
1148<13>[ 9.445492]@2 init: (Loading properties from /system/build.prop took 0.26s.)
1149<6>[ 9.450212]@0 of_batterydata_get_best_profile: OP_3400mAH found
1150<13>[ 9.458081]@2 init: (Loading properties from /vendor/build.prop took 0.00s.)
1151<6>[ 9.463511]@0 FG: fg_batt_profile_init: Battery SOC: 94, V: 4203771uV
1152<13>[ 9.471535]@2 init: (Loading properties from /factory/factory.prop took 0.00s.)
1153<13>[ 9.480598]@2 init: (Loading properties from /data/local.prop took 0.00s.)
1154<11>[ 9.486444]@2 init: Unable to open persistent property directory "/data/property": No such file or directory
1155<11>[ 9.496460]@2 init: property_set("ro.display.series", "OnePlus 3T") failed
1156<13>[ 9.503367]@2 init: Starting service 'set_permissive'...
1157<13>[ 9.508533]@2 init: Starting service 'recovery'...
1158<3>[ 9.513750]@2 functions_store: android_usb: functions_store'mtp,adb'
1159<13>[ 9.519639]@2 init: Service 'set_permissive' (pid 420) exited with status 0
1160<13>[ 9.526649]@2 init: Starting service 'adbd'...
1161<11>[ 9.531212]@2 init: avc: denied { set } for property=twrp.crash_counter scontext=u:r:recovery:s0 tcontext=u:object_r:default_prop:s0 tclass=property_service
1162<6>[ 9.532671]@0 ep0_open success!
1163<6>[ 9.532682]@0 read descriptors
1164<6>[ 9.532693]@0 read strings
1165<6>[ 9.532710]@0 mtp_bind_config
1166<6>[ 9.532718]@0 mtp_create_bulk_endpoints: useFixAddr:false
1167<3>[ 9.562831]@2 dwc3 6a00000.dwc3: request ffffffc17296e000 was not queued to ep0out
1168<13>[ 9.569914]@2 init: Service 'adbd' is being killed...
1169<6>[ 9.574951]@2 mtp_bind_config
1170<6>[ 9.577762]@2 mtp_create_bulk_endpoints: useFixAddr:false
1171<3>[ 9.583284]@2 ffs_function_bind_config: ffs_function_bind_config(): usb_add_function() fails (err:-19) for ffs
1172<4>[ 9.590510]@3 mdss_dsi_on start
1173<6>[ 9.590514]@3 get_param_by_index_and_offset[75] sid_index = 2 offset = 32 buf = ffffffc173184f70 length = 4
1174<3>[ 9.590518]@3 mdss_dsi_on:srgb mode 0
1175<6>[ 9.590519]@3 get_param_by_index_and_offset[75] sid_index = 2 offset = 36 buf = ffffffc173184fb8 length = 4
1176<3>[ 9.590521]@3 mdss_dsi_on:srgb mode 0
1177<6>[ 9.590523]@3 get_param_by_index_and_offset[75] sid_index = 2 offset = 40 buf = ffffffc173185000 length = 4
1178<3>[ 9.590526]@3 mdss_dsi_on:srgb mode 0
1179<4>[ 9.590528]@3 mdss_dsi_on end
1180<3>[ 9.639832]@2 android_bind_enabled_functions: android_bind_enabled_functions: ffs failed
1181<3>[ 9.647700]@2 android_enable: android_enable: usb_add_config failed : err: -19
1182<3>[ 9.654852]@2 enable_store: enable_store: android_enable failed
1183<3>[ 9.660767]@0 dwc3 6a00000.dwc3: request ffffffc17296e000 was not queued to ep0out
1184<4>[ 9.668306]@0 ------------[ cut here ]------------
1185<4>[ 9.673063]@0 WARNING: CPU: 0 PID: 426 at ../drivers/usb/gadget/composite.c:1028 0xffffffc0005a81e4()
1186<4>[ 9.682265]@0 CPU: 0 PID: 426 Comm: adbd Not tainted 3.18.31-twrp-3.0 #1
1187<4>[ 9.688948]@0 Hardware name: Qualcomm Technologies, Inc. MSM 8996pro + PMI8996 MTP (DT)
1188<0>[ 9.696936]@0 Call trace:
1189<4>[ 9.699538]@0 [<ffffffc000088650>] 0xffffffc000088650
1190<4>[ 9.704572]@0 [<ffffffc000088754>] 0xffffffc000088754
1191<4>[ 9.709607]@0 [<ffffffc0008d8434>] 0xffffffc0008d8434
1192<4>[ 9.714641]@0 [<ffffffc00009f4e4>] 0xffffffc00009f4e4
1193<4>[ 9.719676]@0 [<ffffffc00009f5e8>] 0xffffffc00009f5e8
1194<4>[ 9.724711]@0 [<ffffffc0005a81e4>] 0xffffffc0005a81e4
1195<4>[ 9.729746]@0 [<ffffffc0005d005c>] 0xffffffc0005d005c
1196<4>[ 9.734782]@0 [<ffffffc0005d0658>] 0xffffffc0005d0658
1197<4>[ 9.739817]@0 [<ffffffc0005b7250>] 0xffffffc0005b7250
1198<4>[ 9.744851]@0 [<ffffffc0005b7508>] 0xffffffc0005b7508
1199<4>[ 9.749884]@0 [<ffffffc0005b7590>] 0xffffffc0005b7590
1200<4>[ 9.754921]@0 [<ffffffc00017ffb0>] 0xffffffc00017ffb0
1201<4>[ 9.759954]@0 [<ffffffc0001800b8>] 0xffffffc0001800b8
1202<4>[ 9.764989]@0 [<ffffffc0000b7400>] 0xffffffc0000b7400
1203<4>[ 9.770024]@0 [<ffffffc0000a1ba4>] 0xffffffc0000a1ba4
1204<4>[ 9.775059]@0 [<ffffffc0000a20cc>] 0xffffffc0000a20cc
1205<4>[ 9.780092]@0 [<ffffffc0000abe1c>] 0xffffffc0000abe1c
1206<4>[ 9.785130]@0 [<ffffffc000087b98>] 0xffffffc000087b98
1207<4>[ 9.790163]@0 [<ffffffc000088210>] 0xffffffc000088210
1208<4>[ 9.795199]@0 ---[ end trace a94998ff203cff3b ]---
1209<13>[ 9.800882]@2 init: Service 'adbd' (pid 423) killed by signal 9
1210<13>[ 9.805927]@2 init: Service 'adbd' (pid 423) killing any children in process group
1211<4>[ 9.960732]@1 mdss_dsi_off start
1212<4>[ 9.989505]@1 mdss_dsi_off end
1213<4>[ 9.998965]@1 mdss_dsi_on start
1214<4>[ 10.035291]@1 mdss_dsi_on end
1215<4>[ 10.062830]@1 --------backlight level = 127---------
1216<4>[ 10.105684]@1 blank off start
1217<3>[ 10.105697]@1 fpc1020 soc:fpc_fpc1020: fb_notifier_callback screen off
1218<3>[ 10.105726]@1 synaptics,s3320: fb_notifier_callback blank[4],event[0x10]
1219<3>[ 10.105729]@1 synaptics,s3320: fb_notifier_callback : going TP suspend start
1220<3>[ 10.105733]@1 synaptics,s3320: synaptics_ts_suspend enter
1221<3>[ 10.105740]@1 synaptics,s3320: synaptics_ts_suspend normal end
1222<3>[ 10.105742]@1 synaptics,s3320: fb_notifier_callback : going TP suspend end
1223<4>[ 10.105854]@1 --------backlight level = 0---------
1224<4>[ 10.309308]@1 mdss_dsi_off start
1225<4>[ 10.336379]@0 mdss_dsi_off end
1226<3>[ 10.337716]@1 synaptics,s3320: fb_notifier_callback blank[4],event[0x9]
1227<4>[ 10.338867]@1 blank off end
1228<4>[ 10.399800]@2 blank on start
1229<3>[ 10.401359]@2 fpc1020 soc:fpc_fpc1020: fb_notifier_callback screen on
1230<3>[ 10.401379]@2 synaptics,s3320: fb_notifier_callback blank[0],event[0x10]
1231<3>[ 10.401382]@2 synaptics,s3320: fb_notifier_callback going TP resume start
1232<3>[ 10.401385]@2 synaptics,s3320: synaptics_ts_resume enter!
1233<3>[ 10.401399]@2 synaptics,s3320: synaptics_ts_resume:normal end!
1234<3>[ 10.401401]@2 synaptics,s3320: fb_notifier_callback going TP resume end
1235<4>[ 10.403030]@0 mdss_dsi_on start
1236<3>[ 10.410042]@0 synaptics,s3320: tp_baseline_get start!
1237<3>[ 10.442714]@0 sps: BAM device 0x0000000007584000 is not registered yet.
1238<6>[ 10.442879]@0 sps:BAM 0x0000000007584000 is registered.
1239<6>sps:BAM 0x0000000007584000 (va:0xffffff8006300000) enabled: ver:0x19, number of pipes:24
1240<4>[ 10.444272]@1 mdss_dsi_on end
1241<4>[ 10.465987]@1 --------backlight level = 127---------
1242<6>[ 10.467120]@1 BQ: bq27541_set_lcd_off_status: off=0
1243<3>[ 10.467124]@1 synaptics,s3320: fb_notifier_callback blank[0],event[0x9]
1244<4>[ 10.467360]@1 blank on end
1245<3>[ 10.480383]@0 synaptics,s3320: enter reset tp status,and ts->in_gesture_mode is:0
1246<3>[ 10.480387]@0 synaptics,s3320: synaptics_init_panel is called!
1247<3>[ 10.480634]@0 synaptics,s3320: synaptics_mode_change: set TP to mode[0x80]
1248<3>[ 10.550303]@0 synaptics,s3320: synaptics_tpedge_limitfunc limit_enable =1,mode:0x4b !
1249<3>[ 10.550514]@0 synaptics,s3320: tp_baseline_get end!
1250<3>[ 10.592452]@3 mdss_dsi_post_panel_on:+
1251<3>[ 10.610200]@3 mdss_dsi_post_panel_on:-
1252<6>[ 10.659040]@3 F2FS-fs (sda15): Magic Mismatch, valid(0xf2f52010) - read(0x36930d4d)
1253<3>[ 10.665709]@3 F2FS-fs (sda15): Can't find valid F2FS filesystem in 1th superblock
1254<6>[ 10.674603]@3 F2FS-fs (sda15): Magic Mismatch, valid(0xf2f52010) - read(0xec2401d5)
1255<3>[ 10.681264]@3 F2FS-fs (sda15): Can't find valid F2FS filesystem in 2th superblock
1256<6>[ 10.688687]@3 F2FS-fs (sda15): Magic Mismatch, valid(0xf2f52010) - read(0x36930d4d)
1257<3>[ 10.696336]@3 F2FS-fs (sda15): Can't find valid F2FS filesystem in 1th superblock
1258<6>[ 10.703802]@3 F2FS-fs (sda15): Magic Mismatch, valid(0xf2f52010) - read(0xec2401d5)
1259<3>[ 10.711449]@3 F2FS-fs (sda15): Can't find valid F2FS filesystem in 2th superblock
1260<6>[ 10.720557]@3 F2FS-fs (sda15): Magic Mismatch, valid(0xf2f52010) - read(0x36930d4d)
1261<3>[ 10.727170]@3 F2FS-fs (sda15): Can't find valid F2FS filesystem in 1th superblock
1262<6>[ 10.734900]@2 F2FS-fs (sda15): Magic Mismatch, valid(0xf2f52010) - read(0xec2401d5)
1263<3>[ 10.742287]@2 F2FS-fs (sda15): Can't find valid F2FS filesystem in 2th superblock
1264<6>[ 10.749748]@2 F2FS-fs (sda15): Magic Mismatch, valid(0xf2f52010) - read(0x36930d4d)
1265<3>[ 10.757389]@2 F2FS-fs (sda15): Can't find valid F2FS filesystem in 1th superblock
1266<6>[ 10.764879]@2 F2FS-fs (sda15): Magic Mismatch, valid(0xf2f52010) - read(0xec2401d5)
1267<3>[ 10.772494]@2 F2FS-fs (sda15): Can't find valid F2FS filesystem in 2th superblock
1268<6>[ 10.789183]@2 F2FS-fs (sda15): Magic Mismatch, valid(0xf2f52010) - read(0x36930d4d)
1269<3>[ 10.795841]@2 F2FS-fs (sda15): Can't find valid F2FS filesystem in 1th superblock
1270<6>[ 10.804895]@2 F2FS-fs (sda15): Magic Mismatch, valid(0xf2f52010) - read(0xec2401d5)
1271<3>[ 10.811534]@2 F2FS-fs (sda15): Can't find valid F2FS filesystem in 2th superblock
1272<6>[ 10.818984]@2 F2FS-fs (sda15): Magic Mismatch, valid(0xf2f52010) - read(0x36930d4d)
1273<3>[ 10.826646]@2 F2FS-fs (sda15): Can't find valid F2FS filesystem in 1th superblock
1274<6>[ 10.834279]@2 F2FS-fs (sda15): Magic Mismatch, valid(0xf2f52010) - read(0xec2401d5)
1275<3>[ 10.841741]@2 F2FS-fs (sda15): Can't find valid F2FS filesystem in 2th superblock
1276<6>[ 10.850915]@2 F2FS-fs (sda15): Magic Mismatch, valid(0xf2f52010) - read(0x36930d4d)
1277<3>[ 10.857535]@2 F2FS-fs (sda15): Can't find valid F2FS filesystem in 1th superblock
1278<6>[ 10.865170]@2 F2FS-fs (sda15): Magic Mismatch, valid(0xf2f52010) - read(0xec2401d5)
1279<3>[ 10.872651]@2 F2FS-fs (sda15): Can't find valid F2FS filesystem in 2th superblock
1280<6>[ 10.880291]@2 F2FS-fs (sda15): Magic Mismatch, valid(0xf2f52010) - read(0x36930d4d)
1281<3>[ 10.887740]@2 F2FS-fs (sda15): Can't find valid F2FS filesystem in 1th superblock
1282<6>[ 10.895217]@2 F2FS-fs (sda15): Magic Mismatch, valid(0xf2f52010) - read(0xec2401d5)
1283<3>[ 10.902884]@2 F2FS-fs (sda15): Can't find valid F2FS filesystem in 2th superblock
1284<6>[ 10.919371]@3 EXT4-fs (sda3): mounted filesystem with ordered data mode. Opts:
1285<3>[ 10.920142]@2 switch_dev_work ,tristatekey set to state(3)
1286<7>[ 10.931218]@3 SELinux: initialized (dev sda3, type ext4), uses xattr
1287<6>[ 10.933047]@3 SELinux: Context u:object_r:cache_recovery_file:s0 is not valid (left unmapped).
1288<13>[ 10.941344]@0 init: Starting service 'qseecomd'...
1289<6>[ 10.952486]@2 capability: warning: `qseecomd' uses 32-bit capabilities (legacy support in use)
1290<11>[ 10.964319]@0 init: avc: denied { set } for property=sys.listeners.registered scontext=u:r:recovery:s0 tcontext=u:object_r:system_prop:s0 tclass=property_service
1291<3>[ 11.110206]@1 SMBCHG: smbchg_re_det_chg_type: Re-detect charger type
1292<6>[ 11.115582]@1 SMBCHG: smbchg_set_usb_current_max: USB current_ma = 300, typeC_support_current_ma = 4000
1293<3>[ 11.125069]@1 SMBCHG: smbchg_re_det_chg_type: Faking Removal
1294<6>[ 11.131040]@1 SMBCHG: usbin_uv_handler: triggered
1295<6>[ 11.131126]@2 SMBCHG: src_detect_handler: chip->usb_present = 1 usb_present = 0 src_detect = 0 hvdcp_3_det_ignore_uv=0
1296<6>[ 11.131198]@2 SMBCHG: handle_usb_removal: triggered
1297<6>[ 11.131798]@2 SMBCHG: smbchg_usb_update_online_work: chip->usb_online = 1, online = 0
1298<3>[ 11.158720]@1 SMBCHG: usbin_uv_handler: chip->usb_present = 0 rt_sts = 0x01 hvdcp_3_det_ignore_uv = 0 aicl = 1500
1299<6>[ 11.251220]@0 msm-dwc3 6a00000.ssusb: DWC3 in low power mode
1300<6>[ 11.256059]@0 android_work: android_work: did not send uevent (0 0 (null))
1301<3>[ 11.670216]@1 SMBCHG: smbchg_re_det_chg_type: Faking Insertion
1302<6>[ 11.675298]@1 SMBCHG: usbin_uv_handler: triggered
1303<3>[ 11.679774]@1 SMBCHG: usbin_uv_handler: chip->usb_present = 0 rt_sts = 0x00 hvdcp_3_det_ignore_uv = 0 aicl = 1500
1304<6>[ 12.130245]@2 msm_thermal:do_cluster_freq_ctrl Limiting CPU0 max frequency to 1363200. Temp:84
1305<6>[ 12.137835]@2 msm_thermal:do_cluster_freq_ctrl Limiting CPU1 max frequency to 1363200. Temp:84
1306<6>[ 12.146470]@2 msm_thermal:do_cluster_freq_ctrl Limiting CPU2 max frequency to 1977600. Temp:84
1307<6>[ 12.155057]@2 msm_thermal:do_cluster_freq_ctrl Limiting CPU3 max frequency to 1977600. Temp:84
1308<6>[ 12.210282]@2 msm_thermal:do_cluster_freq_ctrl Limiting CPU0 max frequency to 2188800. Temp:54
1309<6>[ 12.217871]@2 msm_thermal:do_cluster_freq_ctrl Limiting CPU1 max frequency to 2188800. Temp:54
1310<6>[ 12.240070]@2 msm_thermal:do_cluster_freq_ctrl Limiting CPU2 max frequency to 2342400. Temp:54
1311<6>[ 12.247657]@2 msm_thermal:do_cluster_freq_ctrl Limiting CPU3 max frequency to 2342400. Temp:54
1312<5>[ 12.332870]@0 random: nonblocking pool is initialized
1313<6>[ 12.510336]@2 msm_thermal:do_cluster_freq_ctrl Limiting CPU0 max frequency to 1363200. Temp:81
1314<6>[ 12.517927]@2 msm_thermal:do_cluster_freq_ctrl Limiting CPU1 max frequency to 1363200. Temp:81
1315<6>[ 12.526556]@2 msm_thermal:do_cluster_freq_ctrl Limiting CPU2 max frequency to 1977600. Temp:81
1316<6>[ 12.534241]@0 SMBCHG: src_detect_handler: chip->usb_present = 0 usb_present = 1 src_detect = 1 hvdcp_3_det_ignore_uv=0
1317<6>[ 12.534331]@0 SMBCHG: handle_usb_insertion: inserted type = 4 (SDP)
1318<6>[ 12.534348]@1 SMBCHG: smbchg_set_usb_current_max: USB current_ma = 1800, typeC_support_current_ma = 4000
1319<6>[ 12.534349]@0 SMBCHG: smbchg_charging_en: enable=1
1320<6>[ 12.534485]@1 SMBCHG: smbchg_rerun_aicl: Rerunning AICL...
1321<6>[ 12.571849]@2 msm_thermal:do_cluster_freq_ctrl Limiting CPU3 max frequency to 1977600. Temp:81
1322<6>[ 12.590227]@0 SMBCHG: smbchg_set_usb_current_max: USB current_ma = 500, typeC_support_current_ma = 4000
1323<6>[ 12.599756]@0 SMBCHG: smbchg_usb_update_online_work: chip->usb_online = 0, online = 1
1324<6>[ 12.630301]@2 msm_thermal:do_cluster_freq_ctrl Limiting CPU0 max frequency to 2188800. Temp:56
1325<6>[ 12.637883]@2 msm_thermal:do_cluster_freq_ctrl Limiting CPU1 max frequency to 2188800. Temp:56
1326<6>[ 12.646521]@2 msm_thermal:do_cluster_freq_ctrl Limiting CPU2 max frequency to 2342400. Temp:56
1327<6>[ 12.655142]@2 msm_thermal:do_cluster_freq_ctrl Limiting CPU3 max frequency to 2342400. Temp:56
1328<6>[ 12.710249]@2 msm_thermal:do_cluster_freq_ctrl Limiting CPU0 max frequency to 1363200. Temp:83
1329<6>[ 12.717827]@2 msm_thermal:do_cluster_freq_ctrl Limiting CPU1 max frequency to 1363200. Temp:83
1330<6>[ 12.726462]@2 msm_thermal:do_cluster_freq_ctrl Limiting CPU2 max frequency to 1977600. Temp:83
1331<6>[ 12.735109]@2 msm_thermal:do_cluster_freq_ctrl Limiting CPU3 max frequency to 1977600. Temp:83
1332<3>[ 12.754287]@0 msm-usb-ssphy-qmp 7410000.ssphy: QMP PHY initialization timeout
1333<3>[ 12.760437]@0 msm-usb-ssphy-qmp 7410000.ssphy: USB3_PHY_PCS_STATUS:69696969
1334<6>[ 12.767482]@0 msm-dwc3 6a00000.ssusb: DWC3 exited from low power mode
1335<6>[ 12.890271]@2 msm_thermal:do_cluster_freq_ctrl Limiting CPU0 max frequency to 2188800. Temp:68
1336<6>[ 12.897853]@2 msm_thermal:do_cluster_freq_ctrl Limiting CPU1 max frequency to 2188800. Temp:68
1337<6>[ 12.906490]@2 msm_thermal:do_cluster_freq_ctrl Limiting CPU2 max frequency to 2342400. Temp:68
1338<6>[ 12.915073]@2 msm_thermal:do_cluster_freq_ctrl Limiting CPU3 max frequency to 2342400. Temp:68
1339<6>[ 12.970255]@2 msm_thermal:do_cluster_freq_ctrl Limiting CPU0 max frequency to 1363200. Temp:88
1340<6>[ 12.977844]@2 msm_thermal:do_cluster_freq_ctrl Limiting CPU1 max frequency to 1363200. Temp:88
1341<6>[ 12.986483]@2 msm_thermal:do_cluster_freq_ctrl Limiting CPU2 max frequency to 1977600. Temp:88
1342<6>[ 12.995068]@2 msm_thermal:do_cluster_freq_ctrl Limiting CPU3 max frequency to 1977600. Temp:88
1343<6>[ 13.100447]@2 msm_thermal:do_cluster_freq_ctrl Limiting CPU0 max frequency to 2188800. Temp:63
1344<6>[ 13.108034]@2 msm_thermal:do_cluster_freq_ctrl Limiting CPU1 max frequency to 2188800. Temp:63
1345<6>[ 13.116670]@2 msm_thermal:do_cluster_freq_ctrl Limiting CPU2 max frequency to 2342400. Temp:63
1346<6>[ 13.125231]@2 msm_thermal:do_cluster_freq_ctrl Limiting CPU3 max frequency to 2342400. Temp:63
1347<6>[ 14.440253]@2 msm_thermal:do_cluster_freq_ctrl Limiting CPU0 max frequency to 1363200. Temp:86
1348<6>[ 14.447840]@2 msm_thermal:do_cluster_freq_ctrl Limiting CPU1 max frequency to 1363200. Temp:86
1349<6>[ 14.456475]@2 msm_thermal:do_cluster_freq_ctrl Limiting CPU2 max frequency to 1977600. Temp:86
1350<6>[ 14.465059]@2 msm_thermal:do_cluster_freq_ctrl Limiting CPU3 max frequency to 1977600. Temp:86
1351<6>[ 14.520264]@2 msm_thermal:do_cluster_freq_ctrl Limiting CPU0 max frequency to 2188800. Temp:55
1352<6>[ 14.527857]@2 msm_thermal:do_cluster_freq_ctrl Limiting CPU1 max frequency to 2188800. Temp:55
1353<6>[ 14.536501]@2 msm_thermal:do_cluster_freq_ctrl Limiting CPU2 max frequency to 2342400. Temp:55
1354<6>[ 14.545105]@2 msm_thermal:do_cluster_freq_ctrl Limiting CPU3 max frequency to 2342400. Temp:55
1355<3>[ 14.675456]@3 QSEECOM: __qseecom_process_incomplete_cmd: fail:resp res= -65,app_id = 0,lstr = 12288
1356<6>[ 14.683575]@3 get_ice_device_from_storage_type: found ice device ffffffc0b5ddd600
1357<4>[ 14.690029]@1 synap rmidev_create_attr
1358<3>[ 14.816535]@3 QSEECOM: __qseecom_process_incomplete_cmd: fail:resp res= -71,app_id = 0,lstr = 12288
1359<3>[ 14.824636]@3 QSEECOM: __qseecom_set_clear_ce_key: process_incomplete_cmd FAILED, resp.result -71
1360<6>[ 14.833429]@3 get_ice_device_from_storage_type: found ice device ffffffc0b5ddd600
1361<3>[ 14.843106]@3 QSEECOM: qseecom_create_key: Failed to create key: pipe 2, ce 0: -22
1362<3>[ 14.849643]@3 QSEECOM: qseecom_ioctl: failed to create encryption key: -22
1363<4>[ 14.880134]@1 synap rmidev_create_attr
1364<6>[ 14.900341]@2 msm_thermal:do_cluster_freq_ctrl Limiting CPU0 max frequency to 1363200. Temp:80
1365<6>[ 14.907928]@2 msm_thermal:do_cluster_freq_ctrl Limiting CPU1 max frequency to 1363200. Temp:80
1366<6>[ 14.916564]@2 msm_thermal:do_cluster_freq_ctrl Limiting CPU2 max frequency to 1977600. Temp:80
1367<6>[ 14.925147]@2 msm_thermal:do_cluster_freq_ctrl Limiting CPU3 max frequency to 1977600. Temp:80
1368<6>[ 14.980282]@2 msm_thermal:do_cluster_freq_ctrl Limiting CPU0 max frequency to 2188800. Temp:55
1369<13>[ 14.982707]@3 init: Starting service 'adbd'...
1370<6>[ 14.989698]@1 ep0_open success!
1371<6>[ 14.989744]@1 read descriptors
1372<6>[ 14.989789]@1 read strings
1373<6>[ 14.989854]@1 mtp_bind_config
1374<6>[ 14.989886]@1 mtp_create_bulk_endpoints: useFixAddr:false
1375<6>[ 15.009493]@2 msm_thermal:do_cluster_freq_ctrl Limiting CPU1 max frequency to 2188800. Temp:55
1376<6>[ 15.018139]@2 msm_thermal:do_cluster_freq_ctrl Limiting CPU2 max frequency to 2342400. Temp:55
1377<6>[ 15.026742]@2 msm_thermal:do_cluster_freq_ctrl Limiting CPU3 max frequency to 2342400. Temp:55
1378<6>[ 15.080256]@2 msm_thermal:do_cluster_freq_ctrl Limiting CPU0 max frequency to 1363200. Temp:89
1379<6>[ 15.087846]@2 msm_thermal:do_cluster_freq_ctrl Limiting CPU1 max frequency to 1363200. Temp:89
1380<6>[ 15.096483]@2 msm_thermal:do_cluster_freq_ctrl Limiting CPU2 max frequency to 1977600. Temp:89
1381<6>[ 15.105067]@2 msm_thermal:do_cluster_freq_ctrl Limiting CPU3 max frequency to 1977600. Temp:89
1382<6>[ 15.187535]@0 android_work: android_work: sent uevent USB_STATE=CONNECTED
1383<6>[ 15.193500]@0 SMBCHG: notify_usb_enumeration_function: status=1
1384<6>[ 15.210313]@2 msm_thermal:do_cluster_freq_ctrl Limiting CPU0 max frequency to 2188800. Temp:53
1385<6>[ 15.217901]@2 msm_thermal:do_cluster_freq_ctrl Limiting CPU1 max frequency to 2188800. Temp:53
1386<6>[ 15.220976]@0 android_usb gadget: high-speed config #1: 66bf0c8.android_usb
1387<6>[ 15.221187]@0 usb_gadget_vbus_draw USB setting current is 500mA
1388<6>[ 15.221216]@0 msm-dwc3 6a00000.ssusb: Avail curr from USB = 500
1389<6>[ 15.225611]@0 SMBCHG: set_chg_ibat_vbat_max: vote ibatmax = 1910 and set vbatmax = 4370
1390<6>[ 15.225693]@0 SMBCHG: smbchg_set_fastchg_current_raw: fastcharge current requested 1910, set to 1900
1391<6>[ 15.226842]@0 SMBCHG: qpnp_battery_temp_region_set: set temp_region = 5
1392<6>[ 15.226860]@0 SMBCHG: smbchg_external_power_changed: change usb_target_current_ma = 500
1393<6>[ 15.276951]@2 msm_thermal:do_cluster_freq_ctrl Limiting CPU2 max frequency to 2342400. Temp:53
1394<6>[ 15.280251]@0 android_work: android_work: sent uevent USB_STATE=CONFIGURED
1395<6>[ 15.292403]@2 msm_thermal:do_cluster_freq_ctrl Limiting CPU3 max frequency to 2342400. Temp:53
1396<6>[ 15.350346]@2 msm_thermal:do_cluster_freq_ctrl Limiting CPU0 max frequency to 1363200. Temp:83
1397<6>[ 15.357925]@2 msm_thermal:do_cluster_freq_ctrl Limiting CPU1 max frequency to 1363200. Temp:83
1398<6>[ 15.366563]@2 msm_thermal:do_cluster_freq_ctrl Limiting CPU2 max frequency to 1977600. Temp:83
1399<6>[ 15.375171]@2 msm_thermal:do_cluster_freq_ctrl Limiting CPU3 max frequency to 1977600. Temp:83
1400<6>[ 15.730323]@2 msm_thermal:do_cluster_freq_ctrl Limiting CPU0 max frequency to 2188800. Temp:68
1401<6>[ 15.737913]@2 msm_thermal:do_cluster_freq_ctrl Limiting CPU1 max frequency to 2188800. Temp:68
1402<6>[ 15.746549]@2 msm_thermal:do_cluster_freq_ctrl Limiting CPU2 max frequency to 2342400. Temp:68
1403<6>[ 15.755133]@2 msm_thermal:do_cluster_freq_ctrl Limiting CPU3 max frequency to 2342400. Temp:68
1404<6>[ 15.810301]@2 msm_thermal:do_cluster_freq_ctrl Limiting CPU0 max frequency to 1363200. Temp:86
1405<6>[ 15.817889]@2 msm_thermal:do_cluster_freq_ctrl Limiting CPU1 max frequency to 1363200. Temp:86
1406<6>[ 15.826525]@2 msm_thermal:do_cluster_freq_ctrl Limiting CPU2 max frequency to 1977600. Temp:86
1407<6>[ 15.835113]@2 msm_thermal:do_cluster_freq_ctrl Limiting CPU3 max frequency to 1977600. Temp:86
1408<6>[ 15.940324]@2 msm_thermal:do_cluster_freq_ctrl Limiting CPU0 max frequency to 2188800. Temp:69
1409<6>[ 15.947914]@2 msm_thermal:do_cluster_freq_ctrl Limiting CPU1 max frequency to 2188800. Temp:69
1410<6>[ 15.956553]@2 msm_thermal:do_cluster_freq_ctrl Limiting CPU2 max frequency to 2342400. Temp:69
1411<6>[ 15.965134]@2 msm_thermal:do_cluster_freq_ctrl Limiting CPU3 max frequency to 2342400. Temp:69
1412<6>[ 17.270292]@2 msm_thermal:do_cluster_freq_ctrl Limiting CPU0 max frequency to 1363200. Temp:84
1413<6>[ 17.277881]@2 msm_thermal:do_cluster_freq_ctrl Limiting CPU1 max frequency to 1363200. Temp:84
1414<6>[ 17.286521]@2 msm_thermal:do_cluster_freq_ctrl Limiting CPU2 max frequency to 1977600. Temp:84
1415<6>[ 17.295103]@2 msm_thermal:do_cluster_freq_ctrl Limiting CPU3 max frequency to 1977600. Temp:84
1416<6>[ 17.400324]@2 msm_thermal:do_cluster_freq_ctrl Limiting CPU0 max frequency to 2188800. Temp:68
1417<6>[ 17.407912]@2 msm_thermal:do_cluster_freq_ctrl Limiting CPU1 max frequency to 2188800. Temp:68
1418<6>[ 17.416547]@2 msm_thermal:do_cluster_freq_ctrl Limiting CPU2 max frequency to 2342400. Temp:68
1419<6>[ 17.425136]@2 msm_thermal:do_cluster_freq_ctrl Limiting CPU3 max frequency to 2342400. Temp:68
1420<6>[ 17.480261]@2 msm_thermal:do_cluster_freq_ctrl Limiting CPU0 max frequency to 1363200. Temp:80
1421<6>[ 17.487838]@2 msm_thermal:do_cluster_freq_ctrl Limiting CPU1 max frequency to 1363200. Temp:80
1422<6>[ 17.496443]@2 msm_thermal:do_cluster_freq_ctrl Limiting CPU2 max frequency to 1977600. Temp:80
1423<3>[ 17.497715]@3 scm_call failed: func id 0x72000501, ret: -2, syscall returns: 0xffffffffffffffbf, 0x0, 0x0
1424<6>[ 17.497722]@3 get_ice_device_from_storage_type: found ice device ffffffc0b5ddd600
1425<6>[ 17.522048]@2 msm_thermal:do_cluster_freq_ctrl Limiting CPU3 max frequency to 1977600. Temp:80
1426<6>[ 17.580278]@2 msm_thermal:do_cluster_freq_ctrl Limiting CPU0 max frequency to 2188800. Temp:69
1427<6>[ 17.587856]@2 msm_thermal:do_cluster_freq_ctrl Limiting CPU1 max frequency to 2188800. Temp:69
1428<6>[ 17.596460]@2 msm_thermal:do_cluster_freq_ctrl Limiting CPU2 max frequency to 2342400. Temp:69
1429<6>[ 17.605076]@2 msm_thermal:do_cluster_freq_ctrl Limiting CPU3 max frequency to 2342400. Temp:69
1430<6>[ 17.629525]@3 get_ice_device_from_storage_type: found ice device ffffffc0b5ddd600
1431<3>[ 17.636567]@3 QSEECOM: qseecom_create_key: Set the key successfully
1432<4>[ 17.642403]@3 audit_printk_skb: 42 callbacks suppressed
1433<5>[ 17.647434]@3 audit: type=1400 audit(2673359.999:26): avc: denied { read write } for pid=422 comm="recovery" name="device-mapper" dev="tmpfs" ino=10010 scontext=u:r:recovery:s0 tcontext=u:object_r:dm_device:s0 tclass=chr_file permissive=1
1434<5>[ 17.668826]@3 audit: type=1400 audit(2673360.019:27): avc: denied { open } for pid=422 comm="recovery" path="/dev/device-mapper" dev="tmpfs" ino=10010 scontext=u:r:recovery:s0 tcontext=u:object_r:dm_device:s0 tclass=chr_file permissive=1
1435<5>[ 17.690120]@3 audit: type=1400 audit(2673360.049:28): avc: denied { ioctl } for pid=422 comm="recovery" path="/dev/device-mapper" dev="tmpfs" ino=10010 ioctlcmd=fd03 scontext=u:r:recovery:s0 tcontext=u:object_r:dm_device:s0 tclass=chr_file permissive=1
1436<6>[ 17.714321]@0 device-mapper: req-crypt: req_crypt_ctr: Mapping block_device /dev/block/sda15 to dm-req-crypt ok!
1437<6>
1438<4>[ 17.724093]@3 device-mapper: table: 254:0: adding target device sda15 caused an alignment inconsistency: physical_block_size=16384, logical_block_size=4096, alignment_offset=0, start=0
1439<4>[ 17.740092]@3 device-mapper: table: 254:0: adding target device sda15 caused an alignment inconsistency: physical_block_size=16384, logical_block_size=4096, alignment_offset=0, start=0
1440<6>[ 17.810245]@2 msm_thermal:do_cluster_freq_ctrl Limiting CPU0 max frequency to 1363200. Temp:82
1441<6>[ 17.817835]@2 msm_thermal:do_cluster_freq_ctrl Limiting CPU1 max frequency to 1363200. Temp:82
1442<6>[ 17.826469]@2 msm_thermal:do_cluster_freq_ctrl Limiting CPU2 max frequency to 1977600. Temp:82
1443<6>[ 17.835057]@2 msm_thermal:do_cluster_freq_ctrl Limiting CPU3 max frequency to 1977600. Temp:82
1444<6>[ 17.890273]@2 msm_thermal:do_cluster_freq_ctrl Limiting CPU0 max frequency to 2188800. Temp:69
1445<6>[ 17.897861]@2 msm_thermal:do_cluster_freq_ctrl Limiting CPU1 max frequency to 2188800. Temp:69
1446<6>[ 17.906497]@2 msm_thermal:do_cluster_freq_ctrl Limiting CPU2 max frequency to 2342400. Temp:69
1447<6>[ 17.915079]@2 msm_thermal:do_cluster_freq_ctrl Limiting CPU3 max frequency to 2342400. Temp:69
1448<6>[ 17.970331]@2 msm_thermal:do_cluster_freq_ctrl Limiting CPU0 max frequency to 1363200. Temp:89
1449<6>[ 17.977920]@2 msm_thermal:do_cluster_freq_ctrl Limiting CPU1 max frequency to 1363200. Temp:89
1450<6>[ 17.986555]@2 msm_thermal:do_cluster_freq_ctrl Limiting CPU2 max frequency to 1977600. Temp:89
1451<6>[ 17.995138]@2 msm_thermal:do_cluster_freq_ctrl Limiting CPU3 max frequency to 1977600. Temp:89
1452<6>[ 18.036334]@1 SMBCHG: update_heartbeat: inserted charger type = 4 (SDP), charger_type = 4
1453<6>[ 18.059637]@1 SMBCHG: update_heartbeat: charger_type:4,bat_voltage:4228,charger_voltage:5024,current:166,temp:325,capacity:88
1454<6>[ 18.101069]@2 msm_thermal:do_cluster_freq_ctrl Limiting CPU0 max frequency to 2188800. Temp:53
1455<6>[ 18.108703]@2 msm_thermal:do_cluster_freq_ctrl Limiting CPU1 max frequency to 2188800. Temp:53
1456<6>[ 18.117453]@2 msm_thermal:do_cluster_freq_ctrl Limiting CPU2 max frequency to 2342400. Temp:53
1457<6>[ 18.125950]@2 msm_thermal:do_cluster_freq_ctrl Limiting CPU3 max frequency to 2342400. Temp:53
1458<3>[ 19.094597]@2 F2FS-fs (dm-0): Unrecognized mount option "noatime" or missing value
1459<3>[ 19.101340]@2 F2FS-fs (dm-0): Unrecognized mount option "noatime" or missing value
1460<7>[ 19.210781]@3 SELinux: initialized (dev dm-0, type f2fs), uses xattr
1461<5>[ 19.211450]@3 audit: type=1400 audit(2673361.569:29): avc: denied { getattr } for pid=422 comm="recovery" path="/data/media" dev="dm-0" ino=301 scontext=u:r:recovery:s0 tcontext=u:object_r:media_rw_data_file:s0 tclass=dir permissive=1
1462<3>[ 19.267753]@3 F2FS-fs (dm-0): Unrecognized mount option "noatime" or missing value
1463<3>[ 19.274330]@3 F2FS-fs (dm-0): Unrecognized mount option "noatime" or missing value
1464<7>[ 19.320907]@3 SELinux: initialized (dev dm-0, type f2fs), uses xattr
1465<5>[ 19.331528]@3 audit: type=1400 audit(2673361.689:30): avc: denied { read } for pid=422 comm="recovery" name="/" dev="dm-0" ino=3 scontext=u:r:recovery:s0 tcontext=u:object_r:system_data_file:s0 tclass=dir permissive=1
1466<5>[ 19.350087]@3 audit: type=1400 audit(2673361.709:31): avc: denied { open } for pid=422 comm="recovery" path="/data" dev="dm-0" ino=3 scontext=u:r:recovery:s0 tcontext=u:object_r:system_data_file:s0 tclass=dir permissive=1
1467<5>[ 19.373337]@3 audit: type=1400 audit(2673361.729:32): avc: denied { getattr } for pid=422 comm="recovery" path="/data/bootchart" dev="dm-0" ino=5 scontext=u:r:recovery:s0 tcontext=u:object_r:bootchart_data_file:s0 tclass=dir permissive=1
1468<5>[ 19.393623]@3 audit: type=1400 audit(2673361.749:33): avc: denied { read } for pid=422 comm="recovery" name="bootchart" dev="dm-0" ino=5 scontext=u:r:recovery:s0 tcontext=u:object_r:bootchart_data_file:s0 tclass=dir permissive=1
1469<5>[ 19.414092]@3 audit: type=1400 audit(2673361.769:34): avc: denied { open } for pid=422 comm="recovery" path="/data/bootchart" dev="dm-0" ino=5 scontext=u:r:recovery:s0 tcontext=u:object_r:bootchart_data_file:s0 tclass=dir permissive=1
1470<5>[ 19.439109]@3 audit: type=1400 audit(2673361.789:35): avc: denied { getattr } for pid=422 comm="recovery" path="/data/misc/bluedroid" dev="dm-0" ino=9 scontext=u:r:recovery:s0 tcontext=u:object_r:bluetooth_data_file:s0 tclass=dir permissive=1
1471<6>[ 19.495879]@3 SELinux: Context u:object_r:audioserver_data_file:s0 is not valid (left unmapped).
1472<6>[ 19.505280]@3 SELinux: Context u:object_r:boottrace_data_file:s0 is not valid (left unmapped).
1473<6>[ 19.513605]@3 SELinux: Context u:object_r:update_engine_data_file:s0 is not valid (left unmapped).
1474<6>[ 19.522538]@3 SELinux: Context u:object_r:method_trace_data_file:s0 is not valid (left unmapped).
1475<6>[ 19.532003]@3 SELinux: Context u:object_r:user_profile_data_file:s0 is not valid (left unmapped).
1476<6>[ 19.541249]@3 SELinux: Context u:object_r:user_profile_foreign_dex_data_file:s0 is not valid (left unmapped).
1477<6>[ 19.550962]@3 SELinux: Context u:object_r:user_profile_foreign_dex_data_file:s0:c512,c768 is not valid (left unmapped).
1478<6>[19700131_22:36:02.427297]@0 SELinux: Context u:object_r:profman_dump_data_file:s0 is not valid (left unmapped).
1479<6>[19700131_22:36:02.439370]@0 SELinux: Context u:object_r:qfp-daemon_data_file:s0 is not valid (left unmapped).
1480<6>[19700131_22:36:02.453560]@0 SELinux: Context u:object_r:data_qsee_file:s0 is not valid (left unmapped).
1481<6>[19700131_22:36:02.468884]@0 SELinux: Context u:object_r:ipacm_data_file:s0 is not valid (left unmapped).
1482<6>[19700131_22:36:02.479833]@0 SELinux: Context u:object_r:port_bridge_data_file:s0 is not valid (left unmapped).
1483<6>[19700131_22:36:02.491099]@1 SELinux: Context u:object_r:data_test_data_file:s0 is not valid (left unmapped).
1484<6>[19700131_22:36:02.510149]@1 SELinux: Context u:object_r:display_misc_file:s0 is not valid (left unmapped).
1485<6>[19700131_22:36:02.520739]@1 SELinux: Context u:object_r:location_data_file:s0 is not valid (left unmapped).
1486<6>[19700131_22:36:02.531607]@1 SELinux: Context u:object_r:location_socket:s0 is not valid (left unmapped).
1487<6>[19700131_22:36:02.549152]@0 SELinux: Context u:object_r:fm_data_file:s0 is not valid (left unmapped).
1488<6>[19700131_22:36:02.558812]@0 SELinux: Context u:object_r:RIDL_data_file:s0 is not valid (left unmapped).
1489<6>[19700131_22:36:02.572372]@0 SELinux: Context u:object_r:RIDL_socket:s0 is not valid (left unmapped).
1490<6>[19700131_22:36:02.585091]@1 SELinux: Context u:object_r:iop_data_file:s0 is not valid (left unmapped).
1491<6>[19700131_22:36:02.595271]@1 SELinux: Context u:object_r:qti_logkit_priv_data_file:s0 is not valid (left unmapped).
1492<6>[19700131_22:36:02.606157]@1 SELinux: Context u:object_r:qti_logkit_pub_data_file:s0 is not valid (left unmapped).
1493<6>[19700131_22:36:02.616254]@1 SELinux: Context u:object_r:qti_logkit_priv_socket:s0 is not valid (left unmapped).
1494<6>[19700131_22:36:02.626184]@1 SELinux: Context u:object_r:qti_logkit_pub_socket:s0 is not valid (left unmapped).
1495<6>[19700131_22:36:02.637058]@1 SELinux: Context u:object_r:wapi_data_file:s0 is not valid (left unmapped).
1496<6>[19700131_22:36:02.646176]@1 SELinux: Context u:object_r:dts_data_file:s0 is not valid (left unmapped).
1497<6>[19700131_22:36:02.655467]@1 SELinux: Context u:object_r:seemp_file:s0 is not valid (left unmapped).
1498<6>[19700131_22:36:02.664701]@1 SELinux: Context u:object_r:tlocd_data_file:s0 is not valid (left unmapped).
1499<6>[19700131_22:36:02.673923]@1 SELinux: Context u:object_r:qvop_data_file:s0 is not valid (left unmapped).
1500<6>[19700131_22:36:02.683116]@1 SELinux: Context u:object_r:qvrd_data_file:s0 is not valid (left unmapped).
1501<6>[19700131_22:36:02.692464]@1 SELinux: Context u:object_r:audio_pp_data_file:s0 is not valid (left unmapped).
1502<6>[19700131_22:36:02.702047]@1 SELinux: Context u:object_r:bootstat_data_file:s0 is not valid (left unmapped).
1503<6>[19700131_22:36:02.991220]@1 SELinux: Context u:object_r:qsee_svc_app_data_file:s0 is not valid (left unmapped).
1504<6>[19700131_22:36:03.441952]@0 get_param_by_index_and_offset[75] sid_index = 7 offset = 24 buf = ffffffc172ca3d00 length = 4
1505<6>[19700131_22:36:03.452005]@0 SMBCHG: charger_type_record: charger_type_record: charger_type_record: param_value = 19700131_22:36:03|1,dash_present=0
1506<6>[19700131_22:36:03.465089]@0 set_param_by_index_and_offset[99]sid_index = 7 offset = 608 buf = ffffffc172ca3d60 length = 4
1507<6>[19700131_22:36:03.477553]@0 set_param_by_index_and_offset[99]sid_index = 7 offset = 612 buf = ffffffc172ca3d64 length = 4
1508<6>[19700131_22:36:03.488124]@0 set_param_by_index_and_offset[99]sid_index = 7 offset = 616 buf = ffffffc172ca3d68 length = 4
1509<6>[19700131_22:36:03.498727]@0 set_param_by_index_and_offset[99]sid_index = 7 offset = 620 buf = ffffffc172ca3d6c length = 4
1510<6>[19700131_22:36:03.509476]@0 set_param_by_index_and_offset[99]sid_index = 7 offset = 624 buf = ffffffc172ca3d70 length = 4
1511<6>[19700131_22:36:03.520147]@0 set_param_by_index_and_offset[99]sid_index = 7 offset = 24 buf = ffffffc172ca3d00 length = 4
1512<6>[19700131_22:36:03.980059]@1 SELinux: Context u:object_r:ota_data_file:s0 is not valid (left unmapped).
1513<6>[19700131_22:36:04.025261]@1 SELinux: Context u:object_r:mpctl_data_file:s0 is not valid (left unmapped).
1514<6>[19700131_22:36:04.035552]@1 SELinux: Context u:object_r:swap_data_file:s0 is not valid (left unmapped).
1515<6>[19700131_22:36:04.096206]@1 SELinux: Context u:object_r:ringtone_file:s0 is not valid (left unmapped).
1516<6>[19700131_22:36:04.525260]@0 SELinux: Context u:object_r:cnd_data_file:s0 is not valid (left unmapped).
1517<6>[19700131_22:36:04.536267]@0 SELinux: Context u:object_r:dpmd_data_file:s0 is not valid (left unmapped).
1518<6>[19700131_22:36:04.549037]@1 SELinux: Context u:object_r:time_data_file:s0 is not valid (left unmapped).
1519<6>[19700131_22:36:04.565690]@1 SELinux: Context u:object_r:oem_data_file:s0 is not valid (left unmapped).
1520<6>[19700131_22:36:04.576853]@1 SELinux: Context u:object_r:fpc_images_file:s0 is not valid (left unmapped).
1521<6>[19700131_22:36:04.588224]@1 SELinux: Context u:object_r:fpc_data_file:s0 is not valid (left unmapped).
1522<6>[19700131_22:36:04.598228]@1 SELinux: Context u:object_r:coredump_data_file:s0 is not valid (left unmapped).
1523<6>[19700131_22:36:04.607828]@1 SELinux: Context u:object_r:theme_data_file:s0 is not valid (left unmapped).
1524<6>[19700131_22:36:04.618915]@1 SELinux: Context u:object_r:usf_data_file:s0 is not valid (left unmapped).
1525<3>[19700131_22:36:04.753277]@2 F2FS-fs (dm-0): Unrecognized mount option "noatime" or missing value
1526<3>[19700131_22:36:04.760867]@2 F2FS-fs (dm-0): Unrecognized mount option "noatime" or missing value
1527<7>[19700131_22:36:04.806749]@3 SELinux: initialized (dev dm-0, type f2fs), uses xattr
1528<6>[19700131_22:36:04.826515]@3 EXT4-fs (sde20): mounted filesystem with ordered data mode. Opts:
1529<7>[19700131_22:36:04.833953]@3 SELinux: initialized (dev sde20, type ext4), uses xattr
1530<4>[19700131_22:36:07.898642]@3 audit_printk_skb: 414 callbacks suppressed
1531<5>[19700131_22:36:07.904031]@3 audit: type=1400 audit(2673367.889:174): avc: denied { read } for pid=422 comm="recovery" name="0" dev="dm-0" ino=131 scontext=u:r:recovery:s0 tcontext=u:object_r:media_rw_data_file:s0 tclass=dir permissive=1
1532<5>[19700131_22:36:07.925042]@3 audit: type=1400 audit(2673367.919:175): avc: denied { open } for pid=422 comm="recovery" path="/sdcard" dev="dm-0" ino=131 scontext=u:r:recovery:s0 tcontext=u:object_r:media_rw_data_file:s0 tclass=dir permissive=1
1533<5>[19700131_22:36:07.950822]@3 audit: type=1400 audit(2673367.939:176): avc: denied { getattr } for pid=422 comm="recovery" path="/sdcard/Music" dev="dm-0" ino=3521 scontext=u:r:recovery:s0 tcontext=u:object_r:media_rw_data_file:s0:c512,c768 tclass=dir permissive=1
1534<5>[19700131_22:36:08.357731]@3 audit: type=1400 audit(2673368.349:177): avc: denied { read } for pid=422 comm="recovery" name=".twrps" dev="dm-0" ino=4574 scontext=u:r:recovery:s0 tcontext=u:object_r:media_rw_data_file:s0 tclass=file permissive=1
1535<5>[19700131_22:36:08.378373]@3 audit: type=1400 audit(2673368.369:178): avc: denied { open } for pid=422 comm="recovery" path="/data/media/0/TWRP/.twrps" dev="dm-0" ino=4574 scontext=u:r:recovery:s0 tcontext=u:object_r:media_rw_data_file:s0 tclass=file permissive=1
1536<5>[19700131_22:36:08.401637]@3 audit: type=1400 audit(2673368.389:179): avc: denied { getattr } for pid=422 comm="recovery" path="/data/media/0/TWRP/.twrps" dev="dm-0" ino=4574 scontext=u:r:recovery:s0 tcontext=u:object_r:media_rw_data_file:s0 tclass=file permissive=1
1537<5>[19700131_22:36:08.434895]@3 audit: type=1400 audit(2673368.429:180): avc: denied { sys_time } for pid=422 comm="recovery" capability=25 scontext=u:r:recovery:s0 tcontext=u:r:recovery:s0 tclass=capability permissive=1
1538<5>[20170121_06:57:44.789965]@3 audit: type=1400 audit(1484981864.783:181): avc: denied { create } for pid=422 comm="recovery" name="orsin" scontext=u:r:recovery:s0 tcontext=u:object_r:rootfs:s0 tclass=fifo_file permissive=1
1539<5>[20170121_06:57:44.808630]@3 audit: type=1400 audit(1484981864.793:182): avc: denied { read } for pid=422 comm="recovery" name="orsin" dev="rootfs" ino=15411 scontext=u:r:recovery:s0 tcontext=u:object_r:rootfs:s0 tclass=fifo_file permissive=1
1540<5>[20170121_06:57:44.830028]@3 audit: type=1400 audit(1484981864.813:183): avc: denied { open } for pid=422 comm="recovery" path="/sbin/orsin" dev="rootfs" ino=15411 scontext=u:r:recovery:s0 tcontext=u:object_r:rootfs:s0 tclass=fifo_file permissive=1
1541<6>[20170121_06:57:45.585566]@2 mtp_open
1542<3>[20170121_06:57:47.388957]@1 synaptics,s3320: start get base data:1
1543<3>[20170121_06:57:47.393946]@1 synaptics,s3320: tp_baseline_get start!
1544<3>[20170121_06:57:47.522062]@0 synaptics,s3320: synaptics_tpedge_limitfunc limit_enable =1,mode:0x4b !
1545<3>[20170121_06:57:47.530410]@0 synaptics,s3320: tp_baseline_get end!
1546<3>[20170121_06:57:47.536537]@0 synaptics,s3320: enter reset tp status,and ts->in_gesture_mode is:0
1547<3>[20170121_06:57:47.544477]@0 synaptics,s3320: synaptics_init_panel is called!
1548<3>[20170121_06:57:47.551691]@0 synaptics,s3320: synaptics_mode_change: set TP to mode[0x80]
1549<3>[20170121_06:57:49.118071]@0 synaptics,s3320: all finger up
1550<4>[20170121_06:57:52.322074]@3 audit_printk_skb: 9 callbacks suppressed
1551<5>[20170121_06:57:52.327221]@3 audit: type=1400 audit(1484981872.313:187): avc: denied { write } for pid=422 comm="recovery" name="0" dev="dm-0" ino=131 scontext=u:r:recovery:s0 tcontext=u:object_r:media_rw_data_file:s0 tclass=dir permissive=1
1552<5>[20170121_06:57:52.348603]@3 audit: type=1400 audit(1484981872.333:188): avc: denied { add_name } for pid=422 comm="recovery" name="recovery.log" scontext=u:r:recovery:s0 tcontext=u:object_r:media_rw_data_file:s0 tclass=dir permissive=1
1553<5>[20170121_06:57:52.369525]@3 audit: type=1400 audit(1484981872.353:189): avc: denied { create } for pid=422 comm="recovery" name="recovery.log" scontext=u:r:recovery:s0 tcontext=u:object_r:media_rw_data_file:s0 tclass=file permissive=1
1554<5>[20170121_06:57:52.390458]@3 audit: type=1400 audit(1484981872.373:190): avc: denied { write } for pid=422 comm="recovery" path="/data/media/0/recovery.log" dev="dm-0" ino=7500 scontext=u:r:recovery:s0 tcontext=u:object_r:media_rw_data_file:s0 tclass=file permissive=1
1555<5>[20170121_06:57:52.414520]@3 audit: type=1400 audit(1484981872.403:191): avc: denied { setattr } for pid=422 comm="recovery" name="recovery.log" dev="dm-0" ino=7500 scontext=u:r:recovery:s0 tcontext=u:object_r:media_rw_data_file:s0 tclass=file permissive=1
1556<5>[20170121_06:57:52.436741]@2 audit: type=1400 audit(1484981872.423:192): avc: denied { relabelfrom } for pid=422 comm="recovery" name="recovery.log" dev="dm-0" ino=7500 scontext=u:r:recovery:s0 tcontext=u:object_r:media_rw_data_file:s0 tclass=file permissive=1
1557<5>[20170121_06:57:52.459712]@2 audit: type=1400 audit(1484981872.443:193): avc: denied { relabelto } for pid=422 comm="recovery" name="recovery.log" dev="dm-0" ino=7500 scontext=u:r:recovery:s0 tcontext=u:object_r:media_rw_data_file:s0 tclass=file permissive=1