· 9 years ago · Jan 21, 2017, 02:14 AM
1<6>[ 0.000000]@0 Initializing cgroup subsys cpu
2<6>[ 0.000000]@0 Initializing cgroup subsys cpuacct
3<5>[ 0.000000]@0 Linux version 3.18.31-twrp-0.1 (jc@westerley) (gcc version 6.2.1 20161016 (Linaro GCC 6.2-2016.11) ) #1 SMP PREEMPT Fri Jan 20 18:59:29 EST 2017
4<4>[ 0.000000]@0 CPU: AArch64 Processor [512f2011] revision 1
5<6>[ 0.000000]@0 alternatives: detected feature GIC system register CPU interface
6<6>[ 0.000000]@0 Machine: Qualcomm Technologies, Inc. MSM 8996pro + PMI8996 MTP
7<6>[ 0.000000]@0 efi: Getting EFI parameters from FDT:
8<6>[ 0.000000]@0 efi: UEFI not found.
9<6>[ 0.000000]@0 Reserved memory: reserved region for node 'removed_regions@85800000': base 0x0000000085800000, size 48 MiB
10<6>[ 0.000000]@0 Reserved memory: reserved region for node 'peripheral_region@8ea00000': base 0x000000008ea00000, size 45 MiB
11<6>[ 0.000000]@0 Reserved memory: reserved region for node 'modem_region@88800000': base 0x0000000088800000, size 98 MiB
12<6>[ 0.000000]@0 Reserved memory: reserved region for node 'dfps_data_mem@83400000': base 0x0000000083400000, size 0 MiB
13<6>[ 0.000000]@0 Reserved memory: reserved region for node 'cont_splash_mem@83401000': base 0x0000000083401000, size 35 MiB
14<6>[ 0.000000]@0 Reserved memory: reserved region for node 'ramoops_mem@ac000000': base 0x00000000ac000000, size 2 MiB
15<6>[ 0.000000]@0 Reserved memory: reserved region for node 'param_mem@ac200000': base 0x00000000ac200000, size 1 MiB
16<6>[ 0.000000]@0 Reserved memory: reserved region for node 'bootloader_log_mem@ac300000': base 0x00000000ac300000, size 1 MiB
17<6>[ 0.000000]@0 Reserved memory: reserved region for node 'mtp_mem@ac400000': base 0x00000000ac400000, size 1 MiB
18<6>[ 0.000000]@0 Reserved memory: reserved region for node 'cont_splash_mem_hdmi@b1c00000': base 0x00000000b1c00000, size 35 MiB
19<6>[ 0.000000]@0 Removed memory: created DMA memory pool at 0x0000000085800000, size 48 MiB
20<6>[ 0.000000]@0 Reserved memory: initialized node removed_regions@85800000, compatible id removed-dma-pool
21<6>[ 0.000000]@0 Removed memory: created DMA memory pool at 0x000000008ea00000, size 45 MiB
22<6>[ 0.000000]@0 Reserved memory: initialized node peripheral_region@8ea00000, compatible id removed-dma-pool
23<6>[ 0.000000]@0 Reserved memory: allocated memory for 'adsp_region' node: base 0x00000000ff800000, size 4 MiB
24<6>[ 0.000000]@0 Reserved memory: created CMA memory pool at 0x00000000ff800000, size 4 MiB
25<6>[ 0.000000]@0 Reserved memory: initialized node adsp_region, compatible id shared-dma-pool
26<6>[ 0.000000]@0 Reserved memory: allocated memory for 'qseecom_region' node: base 0x00000000fe400000, size 20 MiB
27<6>[ 0.000000]@0 Reserved memory: created CMA memory pool at 0x00000000fe400000, size 20 MiB
28<6>[ 0.000000]@0 Reserved memory: initialized node qseecom_region, compatible id shared-dma-pool
29<6>[ 0.000000]@0 Reserved memory: allocated memory for 'secure_region' node: base 0x00000000f8800000, size 92 MiB
30<6>[ 0.000000]@0 Reserved memory: created CMA memory pool at 0x00000000f8800000, size 92 MiB
31<6>[ 0.000000]@0 Reserved memory: initialized node secure_region, compatible id shared-dma-pool
32<6>[ 0.000000]@0 Removed memory: created DMA memory pool at 0x0000000088800000, size 98 MiB
33<6>[ 0.000000]@0 Reserved memory: initialized node modem_region@88800000, compatible id removed-dma-pool
34<6>[ 0.000000]@0 cma: Reserved 32 MiB at 0x00000000f6800000
35<7>[ 0.000000]@0 On node 0 totalpages: 1514064
36<7>[ 0.000000]@0 DMA zone: 11524 pages used for memmap
37<7>[ 0.000000]@0 DMA zone: 0 pages reserved
38<7>[ 0.000000]@0 DMA zone: 737536 pages, LIFO batch:31
39<7>[ 0.000000]@0 Normal zone: 12134 pages used for memmap
40<7>[ 0.000000]@0 Normal zone: 776528 pages, LIFO batch:31
41<6>[ 0.000000]@0 psci: probing for conduit method from DT.
42<6>[ 0.000000]@0 psci: PSCIv1.0 detected in firmware.
43<6>[ 0.000000]@0 psci: Using standard PSCI v0.2 function IDs
44<6>[ 0.000000]@0 psci: Initializing psci_cpu_init
45<6>[ 0.000000]@0 psci: Initializing psci_cpu_init
46<6>[ 0.000000]@0 psci: Initializing psci_cpu_init
47<6>[ 0.000000]@0 PERCPU: Embedded 13 pages/cpu @ffffffc17d717000 s22656 r0 d30592 u53248
48<7>[ 0.000000]@0 pcpu-alloc: s22656 r0 d30592 u53248 alloc=13*4096
49<7>[ 0.000000]@0 pcpu-alloc: [0] 0 [0] 1 [0] 2 [0] 3
50<4>[ 0.000000]@0 Built 1 zonelists in Zone order, mobility grouping on. Total pages: 1490406
51<5>[ 0.000000]@0 Kernel command line: sched_enable_hmp=1 sched_enable_power_aware=1 console=ttyHSL0,115200,n8 androidboot.console=ttyHSL0 androidboot.hardware=qcom androidboot.bootdevice=624000.ufshc androidboot.selinux=permissive user_debug=31 msm_rtb.filter=0x237 ehci-hcd.park=3 lpm_levels.sleep_disabled=1 cma=32M@0-0xffffffff enforcing=0 androidboot.bootdevice=624000.ufshc androidboot.verifiedbootstate=orange androidboot.veritymode=logging androidboot.keymaster=1 androidboot.serialno=51f752ea gpt androidboot.baseband=msm mdss_mdp.panel=1:dsi:0:qcom,mdss_dsi_samsung_s6e3fa5_1080p_cmd:1:none:cfg:single_dsi fpsimd.fpsimd_settings=0 app_setting.use_app_setting=0 androidboot.mode=recovery androidboot.ftm_mode=ftm_recovery androidboot.project_name=15811 androidboot.selinux=permissive androidboot.rf_version=32 androidboot.hw_version=28 ddr_manufacture_info=Samsung ddr_row0_info=16 androidboot.pcba_number=001581306C11032000005876 androidboot.enable_dm_verity=1 androidboot.secboot=e<6>PID hash table entries: 4096 (order: 3, 32768 bytes)
52<6>[ 0.000000]@0 Dentry cache hash table entries: 1048576 (order: 11, 8388608 bytes)
53<6>[ 0.000000]@0 Inode-cache hash table entries: 524288 (order: 10, 4194304 bytes)
54<4>[ 0.000000]@0 Memory: 5687772K/6056256K available (8612K kernel code, 1114K rwdata, 2068K rodata, 396K init, 3616K bss, 368484K reserved)
55<5>[ 0.000000]@0 Virtual kernel memory layout:
56<5> vmalloc : 0xffffff8000000000 - 0xffffffbdbfff0000 ( 246 GB)
57<5> vmemmap : 0xffffffbdc0000000 - 0xffffffbfc0000000 ( 8 GB maximum)
58<5> 0xffffffbdc0000000 - 0xffffffbdc5f65400 ( 95 MB actual)
59<5> PCI I/O : 0xffffffbffa000000 - 0xffffffbffb000000 ( 16 MB)
60<5> fixed : 0xffffffbffbdfd000 - 0xffffffbffbdff000 ( 8 KB)
61<5> modules : 0xffffffbffc000000 - 0xffffffc000000000 ( 64 MB)
62<5> memory : 0xffffffc000000000 - 0xffffffc17d950000 ( 6105 MB)
63<5> .init : 0xffffffc000af1000 - 0xffffffc000b54000 ( 396 KB)
64<5> .text : 0xffffffc000080000 - 0xffffffc000af0384 ( 10689 KB)
65<5> .data : 0xffffffc000b6c000 - 0xffffffc000c82800 ( 1114 KB)
66<6>[ 0.000000]@0 SLUB: HWalign=128, Order=0-3, MinObjects=0, CPUs=4, Nodes=1
67<6>[ 0.000000]@0 HMP scheduling enabled.
68<6>[ 0.000000]@0 Preemptible hierarchical RCU implementation.
69<6>[ 0.000000]@0 RCU dyntick-idle grace-period acceleration is enabled.
70<6>[ 0.000000]@0 NR_IRQS:64 nr_irqs:64 0
71<6>[ 0.000000]@0 CPU0: found redistributor 0 region 0:0x0000000009c00000
72<4>[ 0.000000]@0 mpm_init_irq_domain(): Cannot find irq controller for qcom,gpio-parent
73<3>[ 0.000000]@0 MPM 1 irq mapping errored -517
74<6>[ 0.000000]@0 Offload RCU callbacks from all CPUs
75<6>[ 0.000000]@0 Offload RCU callbacks from CPUs: 0-3.
76<6>[ 0.000000]@0 Architected cp15 and mmio timer(s) running at 19.20MHz (virt/virt).
77<6>[ 0.000000]@0 sched_clock: 56 bits at 19MHz, resolution 52ns, wraps every 3579139424256ns
78<6>[ 0.000017]@0 Switched to clocksource arch_sys_counter
79<6>[ 0.000641]@0 Calibrating delay loop (skipped), value calculated using timer frequency.. 38.40 BogoMIPS (lpj=192000)
80<6>[ 0.000655]@0 pid_max: default: 32768 minimum: 301
81<6>[ 0.000714]@0 Security Framework initialized
82<6>[ 0.000728]@0 SELinux: Initializing.
83<7>[ 0.000751]@0 SELinux: Starting in permissive mode
84<6>[ 0.000782]@0 Mount-cache hash table entries: 16384 (order: 5, 131072 bytes)
85<6>[ 0.000790]@0 Mountpoint-cache hash table entries: 16384 (order: 5, 131072 bytes)
86<6>[ 0.001262]@0 Initializing cgroup subsys freezer
87<4>[ 0.001525]@0 /cpus/cpu@0: Unknown CPU type
88<4>[ 0.001535]@0 /cpus/cpu@1: Unknown CPU type
89<4>[ 0.001543]@0 /cpus/cpu@100: Unknown CPU type
90<4>[ 0.001553]@0 /cpus/cpu@101: Unknown CPU type
91<6>[ 0.001561]@0 hw perfevents: enabled with arm/armv8-pmuv3 PMU driver, 9 counters available
92<6>[ 0.001576]@0 EFI services will not be available.
93<4>[ 0.009270]@0 NOHZ: local_softirq_pending 02
94<4>[ 0.010869]@0
95<4>**********************************************************
96<4>[ 0.010880]@0 ** NOTICE NOTICE NOTICE NOTICE NOTICE NOTICE NOTICE **
97<4>[ 0.010884]@0 ** **
98<4>[ 0.010888]@0 ** trace_printk() being used. Allocating extra memory. **
99<4>[ 0.010892]@0 ** **
100<4>[ 0.010896]@0 ** This means that this is a DEBUG kernel and it is **
101<4>[ 0.010900]@0 ** unsafe for produciton use. **
102<4>[ 0.010904]@0 ** **
103<4>[ 0.010908]@0 ** If you see this message and you are not debugging **
104<4>[ 0.010912]@0 ** the kernel, report this immediately to your vendor! **
105<4>[ 0.010916]@0 ** **
106<4>[ 0.010920]@0 ** NOTICE NOTICE NOTICE NOTICE NOTICE NOTICE NOTICE **
107<4>[ 0.010924]@0 **********************************************************
108<6>[ 0.012585]@0 MSM Memory Dump base table set up
109<6>[ 0.012610]@0 MSM Memory Dump apps data table set up
110<3>[ 0.012620]@0 hyp_assign_table is not functional as qcom_secure_mem is not allocated.
111<6>[ 0.012833]@0 clock-cpu-8996: configuring clocks for the perf cluster
112<6>[ 0.012973]@0 cpu_clock_8996_early_init: finished CPU clock configuration
113<6>[ 0.015454]@1 CPU1: found redistributor 1 region 0:0x0000000009c40000
114<6>[ 0.017978]@2 CPU2: found redistributor 100 region 0:0x0000000009c80000
115<6>[ 0.020393]@3 CPU3: found redistributor 101 region 0:0x0000000009cc0000
116<6>[ 0.020547]@0 Brought up 4 CPUs
117<6>[ 0.020563]@0 SMP: Total of 4 processors activated.
118<6>[ 0.023688]@0 DMI not present or invalid.
119<6>[ 0.030802]@2 pinctrl core: initialized pinctrl subsystem
120<6>[ 0.031153]@2 regulator-dummy: no parameters
121<6>[ 0.084656]@2 NET: Registered protocol family 16
122<6>[ 0.100092]@2 cpuidle: using governor ladder
123<6>[ 0.120094]@2 cpuidle: using governor menu
124<6>[ 0.140091]@2 cpuidle: using governor qcom
125<6>[ 0.140796]@2 vdso: 2 pages (1 code @ ffffffc000b71000, 1 data @ ffffffc000b70000)
126<6>[ 0.141248]@2 software IO TLB [mem 0xffc00000-0x100000000] (4MB) mapped at [ffffffc0bfc00000-ffffffc0bfffffff]
127<6>[ 0.142016]@2 DMA: preallocated 256 KiB pool for atomic allocations
128<6>[ 0.144480]@2 kernel boot_mode = normal[0]
129<6>[ 0.155647]@2 sps:sps is ready.
130<6>[ 0.156183]@2 i2c-msm-v2 75ba000.i2c: could not find pctldev for node /soc/pinctrl@01010000/i2c_12/i2c_12_active, deferring probe
131<6>[ 0.156817]@2 i2c-msm-v2 757a000.i2c: could not find pctldev for node /soc/pinctrl@01010000/i2c_6/i2c_6_active, deferring probe
132<6>[ 0.157073]@2 i2c-msm-v2 75b5000.i2c: could not find pctldev for node /soc/pinctrl@01010000/i2c_7/i2c_7_active, deferring probe
133<6>[ 0.157335]@2 i2c-msm-v2 7577000.i2c: could not find pctldev for node /soc/pinctrl@01010000/i2c_3/i2c_3_active, deferring probe
134<6>[ 0.157585]@2 i2c-msm-v2 75b6000.i2c: could not find pctldev for node /soc/pinctrl@01010000/i2c_8/i2c_8_active, deferring probe
135<4>[ 0.157944]@2 irq: no irq domain found for /soc/pinctrl@01010000 !
136<3>[ 0.159436]@2 cpu-clock-8996 6400000.qcom,cpu-clock-8996: resources init failed
137<3>[ 0.182653]@2 smd_channel_probe_now: allocation table not initialized
138<3>[ 0.182918]@2 smd_channel_probe_now: allocation table not initialized
139<3>[ 0.183163]@2 smd_channel_probe_now: allocation table not initialized
140<3>[ 0.183415]@2 smd_channel_probe_now: allocation table not initialized
141<6>[ 0.183637]@2 msm_watchdog 9830000.qcom,wdt: wdog absent resource not present
142<6>[ 0.183865]@2 msm_watchdog 9830000.qcom,wdt: MSM Watchdog Initialized
143<6>[ 0.184532]@2 msm_rpm_dev_probe: APSS-RPM communication over GLINK
144<3>[ 0.191939]@3 spmi_pmic_arb 400f000.qcom,spmi: PMIC Arb Version-2 0x20010000
145<3>[ 0.193325]@3 spmi_pmic_arb 400f000.qcom,spmi: missing property: qcom,pmic-arb-max-periph-interrupts
146<6>[ 0.197612]@3 pmi8994_s2: 400 <--> 1065 mV at 1000 mV normal idle
147<6>[ 0.198205]@3 platform 9300000.qcom,lpass: assigned reserved memory node peripheral_region@8ea00000
148<6>[ 0.198463]@3 platform ce0000.qcom,venus: assigned reserved memory node peripheral_region@8ea00000
149<6>[ 0.198866]@3 platform 1c00000.qcom,ssc: assigned reserved memory node peripheral_region@8ea00000
150<6>[ 0.199187]@3 platform 2080000.qcom,mss: assigned reserved memory node modem_region@88800000
151<6>[ 0.201672]@3 msm-thermal 70000.qcom,msm-thermal: msm_thermal:Failed reading node=/soc/qcom,msm-thermal, key=qcom,rpm-phase-resource-type err=-22. KTM continues
152<6>[ 0.201696]@3 msm-thermal 70000.qcom,msm-thermal: msm_thermal:Failed reading node=/soc/qcom,msm-thermal, key=qcom,gfx-sensor-id. err=-22. KTM continues
153<6>[ 0.201713]@3 msm-thermal 70000.qcom,msm-thermal: probe_vdd_mx:Failed reading node=/soc/qcom,msm-thermal, key=qcom,mx-restriction-temp. KTM continues
154<6>[ 0.201725]@3 msm-thermal 70000.qcom,msm-thermal: probe_psm:Failed reading node=/soc/qcom,msm-thermal, key=qcom,pmic-sw-mode-temp. err=-22. KTM continues
155<6>[ 0.201782]@3 msm_thermal:vdd_restriction_reg_init Defer regulator vdd-dig probe
156<3>[ 0.201789]@3 msm_thermal:probe_vdd_rstr Err regulator init. err:-517. KTM continues.
157<6>[ 0.201797]@3 msm-thermal 70000.qcom,msm-thermal: probe_vdd_rstr:Failed reading node=/soc/qcom,msm-thermal, key=qcom,max-freq-level. err=-517. KTM continues
158<3>[ 0.201806]@3 msm_thermal:msm_thermal_dev_probe Failed reading node=/soc/qcom,msm-thermal, key=qcom,online-hotplug-core. err:-517
159<6>[ 0.206307]@3 platform soc:qcom,msm-adsprpc-mem: assigned reserved memory node adsp_region
160<3>[ 0.209469]@0 smd_channel_probe_now: allocation table not initialized
161<6>[ 0.209697]@1 msm_rpm_trans_notify_state: glink config params: transport=(null), edge=rpm, name=rpm_requests
162<6>[ 0.210374]@2 msm_cache_erp64 6500000.qcom,cache_erp64: Registering for L1 error interrupts
163<6>[ 0.210467]@2 msm_cache_erp64 6500000.qcom,cache_erp64: Registering for L2 error interrupts
164<6>[ 0.210617]@2 msm_cache_erp64 6500000.qcom,cache_erp64: Registering for L3 error interrupts
165<6>[ 0.210861]@2 msm_m4m_erp 9a40000.qcom,m4m_erp64: Registering for M4M error interrupts
166<6>[ 0.214618]@2 console [pstore-1] enabled
167<6>[ 0.214734]@2 pstore: Registered ramoops as persistent store backend
168<6>[ 0.214745]@2 ramoops: attached 0x200000@0xac000000, ecc: 0/0
169<3>[ 0.214874]@2 XCB bootloader_log_probe
170<6>[ 0.215065]@2 bootloader_log!
171<6>[ 0.216008]@2 apc0_pwrcl_mem_acc_corner: 0 <--> 0 mV
172<6>[ 0.216350]@2 apc1_perfcl_mem_acc_corner: 0 <--> 0 mV
173<6>[ 0.216680]@2 apcc_l3_mem_acc_corner: 0 <--> 0 mV
174<6>[ 0.216995]@2 gfx_mem_acc_corner: 0 <--> 0 mV
175<6>[ 0.217391]@2 kryo0-retention: 468 <--> 892 mV at 520 mV
176<6>[ 0.217581]@2 kryo0: 468 <--> 892 mV at 754 mV
177<6>[ 0.217725]@2 kryo_regulator_probe: kryo0: default LDO functional volt=754021 uV, LDO retention volt=521789 uV, Vref func=325285 + 4466*(val), cluster-num=0
178<6>[ 0.218016]@2 kryo1-retention: 468 <--> 892 mV at 520 mV
179<6>[ 0.218207]@2 kryo1: 468 <--> 892 mV at 754 mV
180<6>[ 0.218337]@2 kryo_regulator_probe: kryo1: default LDO functional volt=754021 uV, LDO retention volt=521789 uV, Vref func=325285 + 4466*(val), cluster-num=1
181<6>[ 0.222702]@2 platform soc:qcom,kgsl-hyp: assigned reserved memory node peripheral_region@8ea00000
182<3>[ 0.223969]@2 msm_mpm_dev_probe(): Cannot get clk resource for XO: -517
183<4>[ 0.241738]@2 __of_mpm_init(): MPM driver mapping exists
184<6>[ 0.243536]@3 i2c-msm-v2 75ba000.i2c: probing driver i2c-msm-v2
185<3>[ 0.243684]@3 i2c-msm-v2 75ba000.i2c: error on clk_get(core_clk):-517
186<3>[ 0.243698]@3 i2c-msm-v2 75ba000.i2c: error probe() failed with err:-517
187<6>[ 0.243992]@3 i2c-msm-v2 757a000.i2c: probing driver i2c-msm-v2
188<3>[ 0.244047]@3 i2c-msm-v2 757a000.i2c: error on clk_get(core_clk):-517
189<3>[ 0.244060]@3 i2c-msm-v2 757a000.i2c: error probe() failed with err:-517
190<6>[ 0.244343]@3 i2c-msm-v2 75b5000.i2c: probing driver i2c-msm-v2
191<3>[ 0.244396]@3 i2c-msm-v2 75b5000.i2c: error on clk_get(core_clk):-517
192<3>[ 0.244408]@3 i2c-msm-v2 75b5000.i2c: error probe() failed with err:-517
193<6>[ 0.244688]@3 i2c-msm-v2 7577000.i2c: probing driver i2c-msm-v2
194<3>[ 0.244741]@3 i2c-msm-v2 7577000.i2c: error on clk_get(core_clk):-517
195<3>[ 0.244753]@3 i2c-msm-v2 7577000.i2c: error probe() failed with err:-517
196<6>[ 0.245000]@3 i2c-msm-v2 75b6000.i2c: probing driver i2c-msm-v2
197<3>[ 0.245053]@3 i2c-msm-v2 75b6000.i2c: error on clk_get(core_clk):-517
198<3>[ 0.245064]@3 i2c-msm-v2 75b6000.i2c: error probe() failed with err:-517
199<3>[ 0.245212]@3 cpu-clock-8996 6400000.qcom,cpu-clock-8996: resources init failed
200<6>[ 0.245945]@3 pm8994_s1_corner: 0 <--> 0 mV at 0 mV normal idle
201<6>[ 0.246385]@3 pm8994_s1_floor_corner: 0 <--> 0 mV at 0 mV normal idle
202<6>[ 0.246744]@3 pm8994_s1_corner_ao: 0 <--> 0 mV at 0 mV normal idle
203<6>[ 0.247164]@3 pm8994_s2_corner: 0 <--> 0 mV at 0 mV normal idle
204<6>[ 0.247513]@3 pm8994_s2_corner_ao: 0 <--> 0 mV at 0 mV normal idle
205<6>[ 0.247927]@3 pm8994_s3: 1300 mV normal idle
206<6>[ 0.248329]@3 pm8994_s4: 1800 mV normal idle
207<6>[ 0.248733]@3 pm8994_s5: 2150 mV normal idle
208<6>[ 0.249135]@3 pm8994_s7: 800 mV normal idle
209<6>[ 0.249543]@3 pm8994_l1: 1000 mV normal idle
210<6>[ 0.249944]@3 pm8994_l2: 1250 mV normal idle
211<6>[ 0.250645]@3 pm8994_l3: 1100 mV normal idle
212<6>[ 0.251048]@3 pm8994_l4: 1225 mV normal idle
213<6>[ 0.251465]@3 pm8994_l6: 1200 mV normal idle
214<6>[ 0.251863]@3 pm8994_l8: 1800 mV normal idle
215<6>[ 0.252270]@3 pm8994_l9: 1800 mV normal idle
216<6>[ 0.252666]@3 pm8994_l10: 1800 mV normal idle
217<6>[ 0.253077]@3 pm8994_l11: 1150 mV normal idle
218<6>[ 0.253480]@3 pm8994_l12: 1800 mV normal idle
219<6>[ 0.254218]@3 pm8994_l13: 29500 <--> 2950 mV at 2950 mV normal idle
220<6>[ 0.254620]@3 pm8994_l15: 1800 mV normal idle
221<6>[ 0.255038]@3 pm8994_l16: 2700 mV normal idle
222<6>[ 0.255438]@3 pm8994_l17: 2600 mV normal idle
223<6>[ 0.255840]@3 pm8994_l18: 3300 mV normal idle
224<6>[ 0.256241]@3 pm8994_l19: 3000 mV normal idle
225<6>[ 0.256650]@3 pm8994_l20: 2950 mV normal idle
226<6>[ 0.257048]@3 pm8994_l21: 2950 mV normal idle
227<6>[ 0.257453]@3 pm8994_l22: 3000 <--> 3300 mV at 3000 mV normal idle
228<6>[ 0.257853]@3 pm8994_l23: 2800 mV normal idle
229<6>[ 0.258264]@3 pm8994_l24: 3075 mV normal idle
230<6>[ 0.258671]@3 pm8994_l25: 1200 mV normal idle
231<6>[ 0.259328]@3 pm8994_l26_corner: 0 <--> 0 mV at 0 mV normal idle
232<6>[ 0.259694]@3 pm8994_l26_floor_corner: 0 <--> 0 mV at 0 mV normal idle
233<6>[ 0.260146]@3 pm8994_l27: 1000 <--> 1200 mV at 1030 mV normal idle
234<6>[ 0.260562]@3 pm8994_l28: 925 mV normal idle
235<6>[ 0.261166]@3 pm8994_l29: 2800 mV normal idle
236<6>[ 0.261584]@3 pm8994_l30: 1800 mV normal idle
237<6>[ 0.261996]@3 pm8994_l32: 1800 mV normal idle
238<6>[ 0.262402]@3 pm8994_lvs1: no parameters
239<6>[ 0.262768]@3 pm8994_lvs2: no parameters
240<6>[ 0.263141]@3 pmi8994_s1: 1025 mV normal idle
241<6>[ 0.263545]@3 pmi8994_boost_5v: no parameters
242<3>[ 0.263635]@3 qcom,rpm-smd-regulator soc:qcom,rpm-smd:rpm-regulator-bstb:regulator-bst: Failed to find supply parent
243<3>[ 0.263734]@3 rpm_vreg_device_probe: regulator_register failed: pmi8994_boost_5v, rc=-517
244<6>[ 0.264017]@3 pmi8994_boost_pin_ctrl: no parameters
245<3>[ 0.264065]@3 qcom,rpm-smd-regulator soc:qcom,rpm-smd:rpm-regulator-bstb:regulator-bst-pin-ctrl: Failed to find supply parent
246<3>[ 0.264151]@3 rpm_vreg_device_probe: regulator_register failed: pmi8994_boost_pin_ctrl, rc=-517
247<6>[ 0.264471]@3 pmi8994_boostbypass: 3150 <--> 3600 mV at 3150 mV normal idle
248<6>[ 0.264798]@3 pm8994_s11: 470 <--> 1140 mV at 905 mV normal idle
249<6>[ 0.265020]@3 pm8994_s11_avs_limit: 470 <--> 1140 mV
250<6>[ 0.265122]@3 spm_regulator_probe: name=pm8994_s11, range=LV, voltage=905000 uV, mode=AUTO, step rate=2400 uV/us
251<6>[ 0.265911]@3 msm-thermal 70000.qcom,msm-thermal: msm_thermal:Failed reading node=/soc/qcom,msm-thermal, key=qcom,rpm-phase-resource-type err=-22. KTM continues
252<6>[ 0.265932]@3 msm-thermal 70000.qcom,msm-thermal: msm_thermal:Failed reading node=/soc/qcom,msm-thermal, key=qcom,gfx-sensor-id. err=-22. KTM continues
253<6>[ 0.265946]@3 msm_thermal:sensor_mgr_init_threshold threshold id already initialized
254<6>[ 0.265960]@3 msm-thermal 70000.qcom,msm-thermal: probe_vdd_mx:Failed reading node=/soc/qcom,msm-thermal, key=qcom,mx-restriction-temp. KTM continues
255<6>[ 0.265975]@3 msm-thermal 70000.qcom,msm-thermal: probe_psm:Failed reading node=/soc/qcom,msm-thermal, key=qcom,pmic-sw-mode-temp. err=-22. KTM continues
256<6>[ 0.266292]@3 msm_thermal:vdd_restriction_reg_init Defer regulator vdd-gfx probe
257<3>[ 0.266306]@3 msm_thermal:probe_vdd_rstr Err regulator init. err:-517. KTM continues.
258<6>[ 0.266317]@3 msm-thermal 70000.qcom,msm-thermal: probe_vdd_rstr:Failed reading node=/soc/qcom,msm-thermal, key=qcom,max-freq-level. err=-517. KTM continues
259<3>[ 0.266329]@3 msm_thermal:msm_thermal_dev_probe Failed reading node=/soc/qcom,msm-thermal, key=qcom,online-hotplug-core. err:-517
260<3>[ 0.266805]@3 msm_mpm_dev_probe(): Cannot get clk resource for XO: -517
261<6>[ 0.267217]@3 i2c-msm-v2 75ba000.i2c: probing driver i2c-msm-v2
262<3>[ 0.267282]@3 i2c-msm-v2 75ba000.i2c: error on clk_get(core_clk):-517
263<3>[ 0.267295]@3 i2c-msm-v2 75ba000.i2c: error probe() failed with err:-517
264<6>[ 0.267570]@3 i2c-msm-v2 757a000.i2c: probing driver i2c-msm-v2
265<3>[ 0.267625]@3 i2c-msm-v2 757a000.i2c: error on clk_get(core_clk):-517
266<3>[ 0.267637]@3 i2c-msm-v2 757a000.i2c: error probe() failed with err:-517
267<6>[ 0.267916]@3 i2c-msm-v2 75b5000.i2c: probing driver i2c-msm-v2
268<3>[ 0.267969]@3 i2c-msm-v2 75b5000.i2c: error on clk_get(core_clk):-517
269<3>[ 0.267981]@3 i2c-msm-v2 75b5000.i2c: error probe() failed with err:-517
270<6>[ 0.268260]@3 i2c-msm-v2 7577000.i2c: probing driver i2c-msm-v2
271<3>[ 0.268313]@3 i2c-msm-v2 7577000.i2c: error on clk_get(core_clk):-517
272<3>[ 0.268324]@3 i2c-msm-v2 7577000.i2c: error probe() failed with err:-517
273<6>[ 0.268569]@3 i2c-msm-v2 75b6000.i2c: probing driver i2c-msm-v2
274<3>[ 0.268622]@3 i2c-msm-v2 75b6000.i2c: error on clk_get(core_clk):-517
275<3>[ 0.268635]@3 i2c-msm-v2 75b6000.i2c: error probe() failed with err:-517
276<3>[ 0.268864]@3 cpu-clock-8996 6400000.qcom,cpu-clock-8996: resources init failed
277<6>[ 0.287580]@3 qcom,gcc-8996 300000.qcom,gcc: Registered GCC clocks.
278<6>[ 0.288623]@3 vfe0_clk_src: set OPP pair(75000000 Hz: 3 uV) on a10000.qcom,vfe0
279<6>[ 0.288645]@3 vfe0_clk_src: set OPP pair(320000000 Hz: 5 uV) on a10000.qcom,vfe0
280<6>[ 0.288657]@3 vfe0_clk_src: set OPP pair(600000000 Hz: 7 uV) on a10000.qcom,vfe0
281<6>[ 0.288874]@3 vfe1_clk_src: set OPP pair(75000000 Hz: 3 uV) on a14000.qcom,vfe1
282<6>[ 0.288888]@3 vfe1_clk_src: set OPP pair(320000000 Hz: 5 uV) on a14000.qcom,vfe1
283<6>[ 0.288900]@3 vfe1_clk_src: set OPP pair(600000000 Hz: 7 uV) on a14000.qcom,vfe1
284<6>[ 0.289139]@3 cpp_clk_src: set OPP pair(100000000 Hz: 3 uV) on a04000.qcom,cpp
285<6>[ 0.289153]@3 cpp_clk_src: set OPP pair(480000000 Hz: 5 uV) on a04000.qcom,cpp
286<6>[ 0.289164]@3 cpp_clk_src: set OPP pair(640000000 Hz: 7 uV) on a04000.qcom,cpp
287<6>[ 0.298273]@3 qcom,mmsscc-8996 8c0000.qcom,mmsscc: Registered MMSS clocks.
288<6>[ 0.299925]@3 pmi8994_boost_5v: no parameters
289<3>[ 0.300012]@3 qcom,rpm-smd-regulator soc:qcom,rpm-smd:rpm-regulator-bstb:regulator-bst: Failed to find supply parent
290<3>[ 0.300156]@3 rpm_vreg_device_probe: regulator_register failed: pmi8994_boost_5v, rc=-517
291<6>[ 0.300366]@3 pmi8994_boost_pin_ctrl: no parameters
292<3>[ 0.300416]@3 qcom,rpm-smd-regulator soc:qcom,rpm-smd:rpm-regulator-bstb:regulator-bst-pin-ctrl: Failed to find supply parent
293<3>[ 0.300502]@3 rpm_vreg_device_probe: regulator_register failed: pmi8994_boost_pin_ctrl, rc=-517
294<6>[ 0.301227]@3 msm-thermal 70000.qcom,msm-thermal: msm_thermal:Failed reading node=/soc/qcom,msm-thermal, key=qcom,rpm-phase-resource-type err=-22. KTM continues
295<6>[ 0.301246]@3 msm-thermal 70000.qcom,msm-thermal: msm_thermal:Failed reading node=/soc/qcom,msm-thermal, key=qcom,gfx-sensor-id. err=-22. KTM continues
296<6>[ 0.301259]@3 msm_thermal:sensor_mgr_init_threshold threshold id already initialized
297<6>[ 0.301272]@3 msm-thermal 70000.qcom,msm-thermal: probe_vdd_mx:Failed reading node=/soc/qcom,msm-thermal, key=qcom,mx-restriction-temp. KTM continues
298<6>[ 0.301287]@3 msm-thermal 70000.qcom,msm-thermal: probe_psm:Failed reading node=/soc/qcom,msm-thermal, key=qcom,pmic-sw-mode-temp. err=-22. KTM continues
299<6>[ 0.301472]@3 msm_thermal:vdd_restriction_reg_init Defer regulator vdd-gfx probe
300<3>[ 0.301483]@3 msm_thermal:probe_vdd_rstr Err regulator init. err:-517. KTM continues.
301<6>[ 0.301494]@3 msm-thermal 70000.qcom,msm-thermal: probe_vdd_rstr:Failed reading node=/soc/qcom,msm-thermal, key=qcom,max-freq-level. err=-517. KTM continues
302<3>[ 0.301506]@3 msm_thermal:msm_thermal_dev_probe Failed reading node=/soc/qcom,msm-thermal, key=qcom,online-hotplug-core. err:-517
303<6>[ 0.302079]@3 cpr3_msm8996_hmss_read_fuse_data: apc0_pwrcl_corner: speed bin = 0
304<6>[ 0.302094]@3 cpr3_msm8996_hmss_read_fuse_data: apc0_pwrcl_corner: CPR fusing revision = 2
305<6>[ 0.302105]@3 cpr3_msm8996_hmss_read_fuse_data: apc0_pwrcl_corner: using redundant fuses = N
306<6>[ 0.302115]@3 cpr3_msm8996_hmss_read_fuse_data: apc0_pwrcl_corner: CPR limitation = none
307<6>[ 0.302125]@3 cpr3_msm8996_hmss_read_fuse_data: apc0_pwrcl_corner: CPR partial binning limitation = none
308<6>[ 0.302136]@3 cpr3_msm8996_hmss_read_fuse_data: apc0_pwrcl_corner: Retention voltage fuses: VDD_MX = 4, VDD_APCC = 4
309<6>[ 0.302343]@3 cpr3_hmss_kvreg_init: apc0_pwrcl_corner: LDO min headroom=80000 uV, LDO max headroom=470000 uV, LDO adj=0 uV, LDO mode=allowed, LDO retention=490000 uV
310<6>[ 0.302529]@3 cpr3_msm8996_hmss_calculate_open_loop_voltages: apc0_pwrcl_corner: fused MinSVS: open-loop= 565000 uV
311<6>[ 0.302541]@3 cpr3_msm8996_hmss_calculate_open_loop_voltages: apc0_pwrcl_corner: fused SVS: open-loop= 645000 uV
312<6>[ 0.302551]@3 cpr3_msm8996_hmss_calculate_open_loop_voltages: apc0_pwrcl_corner: fused NOM: open-loop= 735000 uV
313<6>[ 0.302559]@3 cpr3_msm8996_hmss_calculate_open_loop_voltages: apc0_pwrcl_corner: fused TURBO: open-loop= 890000 uV
314<6>[ 0.302669]@3 cpr3_msm8996_hmss_calculate_target_quotients: apc0_pwrcl_corner: fused MinSVS: quot[ 7]= 273
315<6>[ 0.302678]@3 cpr3_msm8996_hmss_calculate_target_quotients: apc0_pwrcl_corner: fused SVS: quot[ 7]= 410, quot_offset[ 7]= 100
316<6>[ 0.302689]@3 cpr3_msm8996_hmss_calculate_target_quotients: apc0_pwrcl_corner: fused NOM: quot[ 7]= 597, quot_offset[ 7]= 185
317<6>[ 0.302699]@3 cpr3_msm8996_hmss_calculate_target_quotients: apc0_pwrcl_corner: fused TURBO: quot[ 7]= 916, quot_offset[ 7]= 315
318<6>[ 0.302829]@3 cpr3_msm8996_hmss_read_fuse_data: apc0_cbf_corner: speed bin = 0
319<6>[ 0.302840]@3 cpr3_msm8996_hmss_read_fuse_data: apc0_cbf_corner: CPR fusing revision = 2
320<6>[ 0.302849]@3 cpr3_msm8996_hmss_read_fuse_data: apc0_cbf_corner: using redundant fuses = N
321<6>[ 0.302859]@3 cpr3_msm8996_hmss_read_fuse_data: apc0_cbf_corner: CPR limitation = none
322<6>[ 0.302869]@3 cpr3_msm8996_hmss_read_fuse_data: apc0_cbf_corner: CPR partial binning limitation = none
323<6>[ 0.302880]@3 cpr3_msm8996_hmss_read_fuse_data: apc0_cbf_corner: Retention voltage fuses: VDD_MX = 4, VDD_APCC = 4
324<6>[ 0.303019]@3 cpr3_msm8996_hmss_calculate_open_loop_voltages: apc0_cbf_corner: fused MinSVS: open-loop= 565000 uV
325<6>[ 0.303028]@3 cpr3_msm8996_hmss_calculate_open_loop_voltages: apc0_cbf_corner: fused SVS: open-loop= 645000 uV
326<6>[ 0.303037]@3 cpr3_msm8996_hmss_calculate_open_loop_voltages: apc0_cbf_corner: fused NOM: open-loop= 735000 uV
327<6>[ 0.303046]@3 cpr3_msm8996_hmss_calculate_open_loop_voltages: apc0_cbf_corner: fused TURBO: open-loop= 890000 uV
328<6>[ 0.303058]@3 cpr3_msm8996_hmss_calculate_open_loop_voltages: apc0_cbf_corner: fused MinSVS: CBF offset open-loop= 535000 uV
329<6>[ 0.303067]@3 cpr3_msm8996_hmss_calculate_open_loop_voltages: apc0_cbf_corner: fused LowSVS: CBF offset open-loop= 635000 uV
330<6>[ 0.303076]@3 cpr3_msm8996_hmss_calculate_open_loop_voltages: apc0_cbf_corner: fused SVS: CBF offset open-loop= 645000 uV
331<6>[ 0.303084]@3 cpr3_msm8996_hmss_calculate_open_loop_voltages: apc0_cbf_corner: fused NOM: CBF offset open-loop= 755000 uV
332<6>[ 0.303093]@3 cpr3_msm8996_hmss_calculate_open_loop_voltages: apc0_cbf_corner: fused TURBO: CBF offset open-loop= 890000 uV
333<6>[ 0.303135]@3 cpr3_msm8996_hmss_calculate_target_quotients: apc0_cbf_corner: fused MinSVS: quot[ 7]= 273
334<6>[ 0.303144]@3 cpr3_msm8996_hmss_calculate_target_quotients: apc0_cbf_corner: fused SVS: quot[ 7]= 410, quot_offset[ 7]= 100
335<6>[ 0.303154]@3 cpr3_msm8996_hmss_calculate_target_quotients: apc0_cbf_corner: fused NOM: quot[ 7]= 597, quot_offset[ 7]= 185
336<6>[ 0.303164]@3 cpr3_msm8996_hmss_calculate_target_quotients: apc0_cbf_corner: fused TURBO: quot[ 7]= 916, quot_offset[ 7]= 315
337<6>[ 0.303268]@3 cpr3_msm8996_hmss_read_fuse_data: apc1_corner: speed bin = 0
338<6>[ 0.303278]@3 cpr3_msm8996_hmss_read_fuse_data: apc1_corner: CPR fusing revision = 2
339<6>[ 0.303288]@3 cpr3_msm8996_hmss_read_fuse_data: apc1_corner: using redundant fuses = N
340<6>[ 0.303297]@3 cpr3_msm8996_hmss_read_fuse_data: apc1_corner: CPR limitation = none
341<6>[ 0.303307]@3 cpr3_msm8996_hmss_read_fuse_data: apc1_corner: CPR partial binning limitation = none
342<6>[ 0.303317]@3 cpr3_msm8996_hmss_read_fuse_data: apc1_corner: Retention voltage fuses: VDD_MX = 4, VDD_APCC = 4
343<6>[ 0.303505]@3 cpr3_hmss_kvreg_init: apc1_corner: LDO min headroom=130000 uV, LDO max headroom=470000 uV, LDO adj=0 uV, LDO mode=allowed, LDO retention=490000 uV
344<6>[ 0.303705]@3 cpr3_msm8996_hmss_calculate_open_loop_voltages: apc1_corner: fused MinSVS: open-loop= 565000 uV
345<6>[ 0.303717]@3 cpr3_msm8996_hmss_calculate_open_loop_voltages: apc1_corner: fused SVS: open-loop= 655000 uV
346<6>[ 0.303726]@3 cpr3_msm8996_hmss_calculate_open_loop_voltages: apc1_corner: fused NOM: open-loop= 745000 uV
347<6>[ 0.303735]@3 cpr3_msm8996_hmss_calculate_open_loop_voltages: apc1_corner: fused TURBO: open-loop=1050000 uV
348<6>[ 0.303852]@3 cpr3_msm8996_hmss_calculate_target_quotients: apc1_corner: fused MinSVS: quot[ 7]= 273
349<6>[ 0.303862]@3 cpr3_msm8996_hmss_calculate_target_quotients: apc1_corner: fused SVS: quot[ 7]= 432, quot_offset[ 7]= 115
350<6>[ 0.303873]@3 cpr3_msm8996_hmss_calculate_target_quotients: apc1_corner: fused NOM: quot[ 7]= 618, quot_offset[ 7]= 185
351<6>[ 0.303883]@3 cpr3_msm8996_hmss_calculate_target_quotients: apc1_corner: fused TURBO: quot[ 7]=1190, quot_offset[ 7]= 570
352<6>[ 0.304364]@3 cpr3_regulator_init_ctrl: apcc: Default CPR mode = SW closed-loop
353<6>apc0_pwrcl_corner: 0 <--> 0 mV at 0 mV
354<6>[ 0.304721]@3 apc0_cbf_corner: 0 <--> 0 mV at 0 mV
355<6>[ 0.307578]@3 cpr3_regulator_measure_aging: apcc: average quotient delta=0 (count=10)
356<6>[ 0.307606]@3 cpr3_regulator_aging_adjust: apcc: aging measurement successful; aging reference adjustment voltage=3125 uV
357<6>[ 0.307939]@3 apc1_corner: 0 <--> 0 mV at 0 mV
358<6>[ 0.309376]@3 cpr3_msm8996_mmss_read_fuse_data: gfx_corner: speed bin = 0
359<6>[ 0.309393]@3 cpr3_msm8996_mmss_read_fuse_data: gfx_corner: CPR fusing revision = 1
360<6>[ 0.309403]@3 cpr3_msm8996_mmss_read_fuse_data: gfx_corner: CPR limitation = none
361<6>[ 0.309698]@3 cpr3_msm8996_mmss_calculate_open_loop_voltages: gfx_corner: fuse_corner[0] open-loop= 630000 uV
362<6>[ 0.309709]@3 cpr3_msm8996_mmss_calculate_open_loop_voltages: gfx_corner: fuse_corner[1] open-loop= 675000 uV
363<6>[ 0.309718]@3 cpr3_msm8996_mmss_calculate_open_loop_voltages: gfx_corner: fuse_corner[2] open-loop= 805000 uV
364<6>[ 0.309727]@3 cpr3_msm8996_mmss_calculate_open_loop_voltages: gfx_corner: fuse_corner[3] open-loop= 935000 uV
365<6>[ 0.309895]@3 cpr3_regulator_init_ctrl: gfx: Default CPR mode = closed-loop
366<6>gfx_corner: 0 <--> 0 mV at 0 mV
367<6>[ 0.311313]@3 i2c-msm-v2 75ba000.i2c: probing driver i2c-msm-v2
368<3>[ 0.311401]@3 AXI: msm_bus_scale_register_client(): msm_bus_scale_register_client: Bus driver not ready.
369<6>i2c-msm-v2 75ba000.i2c: msm_bus_scale_register_client(mstr-id:84):0 (not a problem)
370<6>i2c-msm-v2 757a000.i2c: probing driver i2c-msm-v2
371<3>[ 0.312270]@3 AXI: msm_bus_scale_register_client(): msm_bus_scale_register_client: Bus driver not ready.
372<6>i2c-msm-v2 757a000.i2c: msm_bus_scale_register_client(mstr-id:86):0 (not a problem)
373<6>i2c-msm-v2 75b5000.i2c: probing driver i2c-msm-v2
374<3>[ 0.313138]@3 AXI: msm_bus_scale_register_client(): msm_bus_scale_register_client: Bus driver not ready.
375<6>i2c-msm-v2 75b5000.i2c: msm_bus_scale_register_client(mstr-id:84):0 (not a problem)
376<6>i2c-msm-v2 7577000.i2c: probing driver i2c-msm-v2
377<3>[ 0.314037]@3 AXI: msm_bus_scale_register_client(): msm_bus_scale_register_client: Bus driver not ready.
378<6>i2c-msm-v2 7577000.i2c: msm_bus_scale_register_client(mstr-id:86):0 (not a problem)
379<6>i2c-msm-v2 75b6000.i2c: probing driver i2c-msm-v2
380<3>[ 0.314758]@3 AXI: msm_bus_scale_register_client(): msm_bus_scale_register_client: Bus driver not ready.
381<6>i2c-msm-v2 75b6000.i2c: msm_bus_scale_register_client(mstr-id:84):0 (not a problem)
382<6>cpu-clock-8996 6400000.qcom,cpu-clock-8996: using perf/pwr/cbf speed bin 0 and pvs_ver 0
383<6>[ 0.317737]@3 clock-cpu-8996: set OPP pair (307200000 Hz, 615000 uv) on cpu0
384<6>[ 0.317786]@3 clock-cpu-8996: set OPP pair (2188800000 Hz, 1075000 uv) on cpu0
385<6>[ 0.317804]@3 clock-cpu-8996: set OPP pair (307200000 Hz, 615000 uv) on cpu1
386<6>[ 0.317845]@3 clock-cpu-8996: set OPP pair (2188800000 Hz, 1075000 uv) on cpu1
387<6>[ 0.317862]@3 clock-cpu-8996: set OPP pair (307200000 Hz, 615000 uv) on cpu2
388<6>[ 0.317921]@3 clock-cpu-8996: set OPP pair (2342400000 Hz, 1085000 uv) on cpu2
389<6>[ 0.317937]@3 clock-cpu-8996: set OPP pair (307200000 Hz, 615000 uv) on cpu3
390<6>[ 0.317991]@3 clock-cpu-8996: set OPP pair (2342400000 Hz, 1085000 uv) on cpu3
391<6>[ 0.318118]@3 clock-cpu-8996: set OPP pair (192000000 Hz, 600000 uv) on soc:qcom,m4m
392<6>[ 0.318158]@3 clock-cpu-8996: set OPP pair (1593600000 Hz, 955000 uv) on soc:qcom,m4m
393<6>[ 0.318492]@3 qcom,gpucc-8996 8c0000.qcom,gpucc: using speed bin 0
394<6>[ 0.318836]@3 gfx3d_clk_src_v2: set OPP pair(133000000 Hz: 560000 uV) on b00000.qcom,kgsl-3d0
395<6>[ 0.318874]@3 gfx3d_clk_src_v2: set OPP pair(652800000 Hz: 910000 uV) on b00000.qcom,kgsl-3d0
396<6>[ 0.320331]@3 qcom,gpucc-8996 8c0000.qcom,gpucc: Registered GPU clocks.
397<6>[ 0.320555]@3 pmi8994_boost_5v: no parameters
398<3>[ 0.320631]@3 qcom,rpm-smd-regulator soc:qcom,rpm-smd:rpm-regulator-bstb:regulator-bst: Failed to find supply parent
399<3>[ 0.320729]@3 rpm_vreg_device_probe: regulator_register failed: pmi8994_boost_5v, rc=-517
400<6>[ 0.320924]@3 pmi8994_boost_pin_ctrl: no parameters
401<3>[ 0.320971]@3 qcom,rpm-smd-regulator soc:qcom,rpm-smd:rpm-regulator-bstb:regulator-bst-pin-ctrl: Failed to find supply parent
402<3>[ 0.321058]@3 rpm_vreg_device_probe: regulator_register failed: pmi8994_boost_pin_ctrl, rc=-517
403<6>[ 0.321801]@3 msm-thermal 70000.qcom,msm-thermal: msm_thermal:Failed reading node=/soc/qcom,msm-thermal, key=qcom,rpm-phase-resource-type err=-22. KTM continues
404<6>[ 0.321821]@3 msm-thermal 70000.qcom,msm-thermal: msm_thermal:Failed reading node=/soc/qcom,msm-thermal, key=qcom,gfx-sensor-id. err=-22. KTM continues
405<6>[ 0.321834]@3 msm_thermal:sensor_mgr_init_threshold threshold id already initialized
406<6>[ 0.321847]@3 msm-thermal 70000.qcom,msm-thermal: probe_vdd_mx:Failed reading node=/soc/qcom,msm-thermal, key=qcom,mx-restriction-temp. KTM continues
407<6>[ 0.321862]@3 msm-thermal 70000.qcom,msm-thermal: probe_psm:Failed reading node=/soc/qcom,msm-thermal, key=qcom,pmic-sw-mode-temp. err=-22. KTM continues
408<3>[ 0.322110]@3 msm_thermal:update_cpu_freq Unable to update policy for cpu:0. err:-19
409<3>[ 0.322125]@3 msm_thermal:update_cpu_freq Unable to update policy for cpu:2. err:-19
410<3>[ 0.322136]@3 msm_thermal:update_cpu_freq Unable to update policy for cpu:2. err:-19
411<3>[ 0.322153]@3 msm-thermal 70000.qcom,msm-thermal: probe_ocr:Failed reading node=/soc/qcom,msm-thermal, key=qcom,pmic-opt-curr-temp err:-22. KTM continues
412<3>[ 0.323114]@3 msm_thermal:update_cpu_freq Unable to update policy for cpu:0. err:-19
413<3>[ 0.323129]@3 msm_thermal:update_cpu_freq Unable to update policy for cpu:2. err:-19
414<3>[ 0.323140]@3 msm_thermal:update_cpu_freq Unable to update policy for cpu:2. err:-19
415<6>[ 0.323318]@3 pmi8994_boost_5v: no parameters
416<3>[ 0.323377]@3 qcom,rpm-smd-regulator soc:qcom,rpm-smd:rpm-regulator-bstb:regulator-bst: Failed to find supply parent
417<3>[ 0.323472]@3 rpm_vreg_device_probe: regulator_register failed: pmi8994_boost_5v, rc=-517
418<6>[ 0.323667]@3 pmi8994_boost_pin_ctrl: no parameters
419<3>[ 0.323714]@3 qcom,rpm-smd-regulator soc:qcom,rpm-smd:rpm-regulator-bstb:regulator-bst-pin-ctrl: Failed to find supply parent
420<3>[ 0.323802]@3 rpm_vreg_device_probe: regulator_register failed: pmi8994_boost_pin_ctrl, rc=-517
421<6>[ 0.363873]@2 KPI: Bootloader start count = 32659
422<6>[ 0.363892]@2 KPI: Bootloader end count = 427312
423<6>[ 0.363900]@2 KPI: Bootloader display count = 426984
424<6>[ 0.363908]@2 KPI: Bootloader load kernel count = 2170
425<6>[ 0.363918]@2 KPI: Kernel MPM timestamp = 452585
426<6>[ 0.363926]@2 KPI: Kernel MPM Clock frequency = 32768
427<6>[ 0.363940]@2 socinfo_print: v0.11, id=305, ver=1.1, raw_id=95, raw_ver=1, hw_plat=8, hw_plat_ver=65536
428<6> accessory_chip=0, hw_plat_subtype=0, pmic_model=65545, pmic_die_revision=131072 foundry_id=3 serial_number=2606472571 num_pmics=2
429<3>[ 0.363964]@2 init_project_info: project_name: 15811 hw_version: 28 rf_v1: 32 rf_v2: 1: rf_v3: 0 paltform_id:305
430<3>[ 0.363977]@2 init_project_info: aboard_version: 1
431<3>[ 0.364855]@2 op_rf_cable_probe: ftm_mode FOUND! use 1 always
432<3>[ 0.364871]@2 modify_rf_cable_smem_info: rf_cable: 1
433<3>[ 0.364879]@2 op_rf_cable_probe: probe ok!
434<6>[ 0.365242]@2 gdsc_mmagic_bimc: no parameters
435<6>[ 0.365835]@2 rome_vreg: no parameters
436<6>[ 0.366087]@2 wlan_en_vreg: no parameters
437<6>[ 0.366637]@2 vgaarb: loaded
438<5>[ 0.366857]@2 SCSI subsystem initialized
439<6>[ 0.367026]@2 usbcore: registered new interface driver usbfs
440<6>[ 0.367064]@2 usbcore: registered new interface driver hub
441<6>[ 0.367205]@2 usbcore: registered new device driver usb
442<4>[ 0.367576]@2 soc:usb_nop_phy supply vcc not found, using dummy regulator
443<6>[ 0.390375]@2 cpufreq: driver msm up and running
444<6>[ 0.390893]@2 platform soc:qcom,ion:qcom,ion-heap@22: assigned reserved memory node adsp_region
445<6>[ 0.391005]@2 platform soc:qcom,ion:qcom,ion-heap@27: assigned reserved memory node qseecom_region
446<6>[ 0.391110]@2 platform soc:qcom,ion:qcom,ion-heap@10: assigned reserved memory node secure_region
447<6>[ 0.391297]@2 ION heap system created
448<6>[ 0.391405]@1 ION heap kmalloc created
449<6>[ 0.391420]@1 ION heap adsp created at 0x00000000ff800000 with size 400000
450<6>[ 0.391429]@1 ION heap qsecom created at 0x00000000fe400000 with size 1400000
451<6>[ 0.391437]@1 ION heap secure_display created at 0x00000000f8800000 with size 5c00000
452<6>[ 0.391445]@1 ION heap secure_heap created
453<3>[ 0.392392]@1 msm_bus_fabric_init_driver
454<3>[ 0.395405]@1 msm-bus-type fab-a0noc: Error: Failed to get regulator bus-gdsc:-517
455<3>[ 0.395423]@1 msm-bus-type fab-a0noc: Error: Failed to get regulator bus-a-gdsc:-517
456<3>[ 0.398147]@1 msm-bus-type slv-vmem-cfg: Error: Failed to get regulator node-gdsc:-517
457<3>[ 0.398595]@1 msm-bus-type slv-vmem: Error: Failed to get regulator node-gdsc:-517
458<3>[ 0.403753]@2 msm-bus-type fab-a0noc: Error: Failed to get regulator aggre0-snoc-axi-no-rate:-517
459<3>[ 0.403765]@2 msm-bus-type fab-a0noc: Error: Failed to get regulator aggre0-snoc-axi-no-rate:-517
460<3>[ 0.403774]@2 msm-bus-type fab-a0noc: Error: Failed to get regulator aggre0-snoc-axi-no-rate:-517
461<3>[ 0.403871]@2 msm-bus-type fab-mnoc: Error: Failed to get regulator mmagic-mdss-axi-no-rate:-517
462<3>[ 0.403892]@2 msm-bus-type fab-mnoc: Error: Failed to get regulator mmagic-mdss-axi-no-rate:-517
463<3>[ 0.403911]@2 msm-bus-type fab-mnoc: Error: Failed to get regulator mmagic-mdss-axi-no-rate:-517
464<3>[ 0.403929]@2 msm-bus-type fab-mnoc: Error: Failed to get regulator mmagic-mdss-axi-no-rate:-517
465<3>[ 0.403947]@2 msm-bus-type fab-mnoc: Error: Failed to get regulator mmagic-mdss-axi-no-rate:-517
466<3>[ 0.403965]@2 msm-bus-type fab-mnoc: Error: Failed to get regulator mmagic-mdss-axi-no-rate:-517
467<3>[ 0.403983]@2 msm-bus-type fab-mnoc: Error: Failed to get regulator mmagic-mdss-axi-no-rate:-517
468<6>[ 0.405163]@2 qcom,qpnp-power-on qpnp-power-on-2: PMIC@SID0 Power-on reason: Triggered from Hard Reset[0x21] and 'cold' boot
469<6>[ 0.405174]@2 qcom,qpnp-power-on qpnp-power-on-2: PMIC@SID0 Power-on reason: Triggered from PON1 (secondary PMIC)[0x21] and 'cold' boot
470<6>[ 0.405189]@2 qcom,qpnp-power-on qpnp-power-on-2: PMIC@SID0: Power-off reason: Triggered from PS_HOLD (PS_HOLD/MSM controlled shutdown)[0x2]
471<6>[ 0.405294]@2 input: qpnp_pon as /devices/virtual/input/input0
472<6>[ 0.405763]@2 pon_spare_reg: no parameters
473<6>[ 0.405812]@2 qcom,qpnp-power-on qpnp-power-on-11: No PON config. specified
474<6>[ 0.405867]@2 qcom,qpnp-power-on qpnp-power-on-11: PMIC@SID2 Power-on reason: Triggered from Hard Reset[0x21] and 'cold' boot
475<6>[ 0.405873]@2 qcom,qpnp-power-on qpnp-power-on-11: PMIC@SID2 Power-on reason: Triggered from PON1 (secondary PMIC)[0x21] and 'cold' boot
476<6>[ 0.405887]@2 qcom,qpnp-power-on qpnp-power-on-11: PMIC@SID2: Power-off reason: Triggered from PS_HOLD (PS_HOLD/MSM controlled shutdown)[0x2]
477<6>[ 0.406034]@2 PMIC@SID0: PM8994 v2.0 options: 0, 0, 2, 2
478<6>[ 0.406117]@2 PMIC@SID2: PMI8996 v1.1 options: 0, 0, 0, 0
479<3>[ 0.407127]@2 ipa ipa2_uc_state_check:296 uC interface not initialized
480<3>[ 0.407141]@2 ipa ipa_sps_irq_control_all:938 EP (2) not allocated.
481<3>[ 0.407146]@2 ipa ipa_sps_irq_control_all:938 EP (5) not allocated.
482<6>[ 0.409086]@3 sps:BAM 0x0000000000684000 is registered.
483<3>ipa ipa2_uc_state_check:296 uC interface not initialized
484<6>[ 0.410069]@3 sps:BAM 0x0000000000684000 (va:0xffffff80020c0000) enabled: ver:0x27, number of pipes:20
485<3>[ 0.411389]@3 ipa ipa2_uc_state_check:296 uC interface not initialized
486<3>[ 0.416147]@3 ipa ipa2_uc_state_check:296 uC interface not initialized
487<6>[ 0.417664]@3 IPA driver initialization was successful.
488<6>[ 0.418849]@3 gdsc_mmagic_video: no parameters
489<6>[ 0.419054]@3 gdsc_mmagic_mdss: no parameters
490<6>[ 0.419203]@3 gdsc_mmagic_camss: no parameters
491<6>[ 0.419410]@3 gdsc_venus: no parameters
492<6>[ 0.419431]@3 gdsc_venus: supplied by gdsc_mmagic_video
493<6>[ 0.419577]@3 gdsc_venus_core0: fast normal
494<6>[ 0.419729]@3 gdsc_venus_core1: fast normal
495<6>[ 0.419870]@3 gdsc_camss_top: no parameters
496<6>[ 0.419888]@3 gdsc_camss_top: supplied by gdsc_mmagic_camss
497<6>[ 0.420443]@3 gdsc_vfe0: no parameters
498<6>[ 0.420463]@3 gdsc_vfe0: supplied by gdsc_camss_top
499<6>[ 0.420636]@3 gdsc_vfe1: no parameters
500<6>[ 0.420653]@3 gdsc_vfe1: supplied by gdsc_camss_top
501<6>[ 0.420804]@3 gdsc_mdss: no parameters
502<6>[ 0.420823]@3 gdsc_mdss: supplied by gdsc_mmagic_mdss
503<6>[ 0.421074]@3 gdsc_jpeg: no parameters
504<6>[ 0.421090]@3 gdsc_jpeg: supplied by gdsc_camss_top
505<6>[ 0.421246]@3 gdsc_cpp: no parameters
506<6>[ 0.421262]@3 gdsc_cpp: supplied by gdsc_camss_top
507<6>[ 0.421390]@3 gdsc_pcie_0: no parameters
508<6>[ 0.421517]@3 gdsc_pcie_1: no parameters
509<6>[ 0.421641]@3 gdsc_pcie_2: no parameters
510<6>[ 0.421768]@3 gdsc_usb30: no parameters
511<6>[ 0.421896]@3 gdsc_ufs: no parameters
512<6>[ 0.422055]@3 gdsc_fd: no parameters
513<6>[ 0.422074]@3 gdsc_fd: supplied by gdsc_camss_top
514<6>[ 0.422216]@3 gdsc_gpu: no parameters
515<6>[ 0.422384]@3 gdsc_gpu_gx: no parameters
516<6>[ 0.422739]@3 gdsc_gpu_gx: supplied by gfx_corner
517<6>[ 0.422897]@3 gdsc_hlos1_vote_aggre0_noc: no parameters
518<6>[ 0.423030]@3 gdsc_hlos1_vote_lpass_adsp: no parameters
519<6>[ 0.423158]@3 gdsc_hlos1_vote_lpass_core: no parameters
520<6>[ 0.423297]@3 gdsc_aggre0_noc: no parameters
521<6>[ 0.425415]@3 mdss_pll_probe: MDSS pll label = MDSS DSI 0 PLL
522<6>[ 0.425435]@3 mdss_pll_probe: mdss_pll_probe: label=MDSS DSI 0 PLL PLL SSC enabled
523<6>[ 0.427197]@3 dsi_pll_clock_register_8996: Registered DSI PLL ndx=0 clocks successfully
524<6>[ 0.427266]@3 mdss_pll_probe: MDSS pll label = MDSS DSI 1 PLL
525<6>[ 0.427277]@3 mdss_pll_probe: mdss_pll_probe: label=MDSS DSI 1 PLL PLL SSC enabled
526<3>[ 0.428359]@3 pll_is_pll_locked_8996: DSI PLL ndx=1 status=0 failed to Lock
527<6>[ 0.428806]@3 dsi_pll_clock_register_8996: Registered DSI PLL ndx=1 clocks successfully
528<6>[ 0.535410]@3 get_param_by_index_and_offset[75] sid_index = 12 offset = 0 buf = ffffffc000ff9300 length = 420
529<6>[ 0.535529]@3 Advanced Linux Sound Architecture Driver Initialized.
530<1>[ 0.536042]@3 pcie:pcie_init.
531<4>[ 0.539309]@3 600000.qcom,pcie supply vreg-3.3 not found, using dummy regulator
532<3>[ 0.542066]@3 msm_pcie_get_resources: PCIe: RC0 can't get tcsr resource.
533<6>[ 0.544788]@1 pmi8994_boost_5v: no parameters
534<6>[ 0.545071]@1 pmi8994_boost_5v: supplied by pon_spare_reg
535<6>[ 0.545568]@1 pmi8994_boost_pin_ctrl: no parameters
536<6>[ 0.545778]@1 pmi8994_boost_pin_ctrl: supplied by pon_spare_reg
537<6>[ 0.546351]@3 Switched to clocksource arch_sys_counter
538<6>[ 0.547231]@3 bcl_peripheral:bcl_perph_init BCL Initialized
539<6>[ 0.551316]@3 NET: Registered protocol family 2
540<6>[ 0.551832]@3 TCP established hash table entries: 65536 (order: 7, 524288 bytes)
541<6>[ 0.551971]@3 TCP bind hash table entries: 65536 (order: 8, 1048576 bytes)
542<6>[ 0.552912]@3 TCP: Hash tables configured (established 65536 bind 65536)
543<6>[ 0.553094]@3 TCP: reno registered
544<6>[ 0.553130]@3 UDP hash table entries: 4096 (order: 5, 131072 bytes)
545<6>[ 0.553217]@3 UDP-Lite hash table entries: 4096 (order: 5, 131072 bytes)
546<6>[ 0.553575]@3 NET: Registered protocol family 1
547<7>[ 0.553632]@3 PCI: CLS 0 bytes, default 128
548<6>[ 0.554141]@3 Trying to unpack rootfs image as initramfs...
549<6>[ 0.719844]@2 Freeing initrd memory: 8912K (ffffffc002200000 - ffffffc002ab4000)
550<6>[ 0.722066]@2 kryo perfevents: CPU pmu for kryo-pmuv3 detected
551<6>[ 0.726963]@3 futex hash table entries: 1024 (order: 5, 131072 bytes)
552<6>[ 0.727096]@3 audit: initializing netlink subsys (disabled)
553<5>[ 0.727201]@3 audit: type=2000 audit(0.719:1): initialized
554<4>[ 0.727692]@3 vmscan: error setting kswapd cpu affinity mask
555<5>[ 0.730153]@3 VFS: Disk quotas dquot_6.5.2
556<4>[ 0.730247]@3 Dquot-cache hash table entries: 512 (order 0, 4096 bytes)
557<6>[ 0.730786]@3 exfat: init_exfat_fs: exFAT Filesystem version 1.2.24
558<6>[ 0.730837]@3 fuse init (API version 7.23)
559<6>[ 0.732900]@3 Block layer SCSI generic (bsg) driver version 0.4 loaded (major 247)
560<6>[ 0.732927]@3 io scheduler noop registered (default)
561<3>[ 0.743234]@3 mdss_mdp_irq_clk_register: unable to get clk: lut_clk
562<3>[ 0.744460]@3 No change in context(0==0), skip
563<6>[ 0.745498]@3 mdss_mdp_pipe_addr_setup: type:0 ftchid:-1 xinid:0 num:0 rect:0 ndx:0x1 prio:0
564<6>[ 0.745507]@3 mdss_mdp_pipe_addr_setup: type:0 ftchid:-1 xinid:4 num:1 rect:0 ndx:0x2 prio:1
565<6>[ 0.745513]@3 mdss_mdp_pipe_addr_setup: type:0 ftchid:-1 xinid:8 num:2 rect:0 ndx:0x4 prio:2
566<6>[ 0.745519]@3 mdss_mdp_pipe_addr_setup: type:0 ftchid:-1 xinid:12 num:8 rect:0 ndx:0x100 prio:3
567<6>[ 0.745534]@3 mdss_mdp_pipe_addr_setup: type:1 ftchid:-1 xinid:1 num:3 rect:0 ndx:0x8 prio:4
568<6>[ 0.745540]@3 mdss_mdp_pipe_addr_setup: type:1 ftchid:-1 xinid:5 num:4 rect:0 ndx:0x10 prio:5
569<6>[ 0.745545]@3 mdss_mdp_pipe_addr_setup: type:1 ftchid:-1 xinid:9 num:5 rect:0 ndx:0x20 prio:6
570<6>[ 0.745551]@3 mdss_mdp_pipe_addr_setup: type:1 ftchid:-1 xinid:13 num:9 rect:0 ndx:0x200 prio:7
571<6>[ 0.745563]@3 mdss_mdp_pipe_addr_setup: type:2 ftchid:-1 xinid:2 num:6 rect:0 ndx:0x40 prio:8
572<6>[ 0.745569]@3 mdss_mdp_pipe_addr_setup: type:2 ftchid:-1 xinid:10 num:7 rect:0 ndx:0x80 prio:9
573<6>[ 0.745581]@3 mdss_mdp_pipe_addr_setup: type:3 ftchid:-1 xinid:7 num:10 rect:0 ndx:0x400 prio:0
574<6>[ 0.745587]@3 mdss_mdp_pipe_addr_setup: type:3 ftchid:-1 xinid:7 num:11 rect:0 ndx:0x800 prio:1
575<3>[ 0.745596]@3 mdss_mdp_parse_dt_handler: Error from prop qcom,mdss-pipe-sw-reset-off : u32 array read
576<3>[ 0.745661]@3 mdss_mdp_parse_dt_handler: Error from prop qcom,mdss-ib-factor-overlap : u32 array read
577<6>[ 0.745980]@3 xlog_status: enable:0, panic:0, dump:1
578<6>[ 0.747110]@3 mdss_mdp_probe: mdss version = 0x10070002, bootloader display is on, num 1, intf_sel=0x00000100
579<6>[ 0.751697]@3 mdss_smmu_probe: iommu v2 domain[0] mapping and clk register successful!
580<6>[ 0.751865]@3 mdss_smmu_probe: iommu v2 domain[1] mapping and clk register successful!
581<6>[ 0.751968]@3 mdss_smmu_probe: iommu v2 domain[2] mapping and clk register successful!
582<6>[ 0.752077]@3 mdss_smmu_probe: iommu v2 domain[3] mapping and clk register successful!
583<6>[ 0.754987]@3 mdss_dsi_ctrl_probe: DSI Ctrl name = MDSS DSI CTRL->0
584<6>[ 0.755319]@3 mdss_dsi_find_panel_of_node: cmdline:0:qcom,mdss_dsi_samsung_s6e3fa5_1080p_cmd:1:none:cfg:single_dsi panel_name:qcom,mdss_dsi_samsung_s6e3fa5_1080p_cmd
585<6>[ 0.755336]@3 mdss_dsi_panel_init: Panel Name = samsung s6e3fa5 1080p cmd mode dsi panel
586<6>[ 0.755430]@3 mdss_dsi_panel_timing_from_dt: found new timing "qcom,mdss_dsi_samsung_s6e3fa5_1080p_cmd" (ffffffc1764bb380)
587<3>[ 0.755447]@3 mdss_dsi_parse_dcs_cmds: failed, key=qcom,mdss-dsi-timing-switch-command
588<4>[ 0.755453]@3 mdss_dsi_panel_get_dsc_cfg_np: cannot find dsc config node:
589<6>[ 0.755566]@3 mdss_dsi_parse_panel_features: partial_update_enabled=0
590<6>[ 0.755576]@3 mdss_dsi_parse_panel_features: ulps feature disabled
591<6>[ 0.755583]@3 mdss_dsi_parse_panel_features: ulps during suspend feature disabled
592<6>mdss_dsi_parse_dms_config: dynamic switch feature enabled: 0
593<6>[ 0.755617]@3 mdss_dsi_panel_init: Panel Manufacture = SAMSUNG
594<6>[ 0.755623]@3 mdss_dsi_panel_init: Panel Version = S6E3FA5
595<3>[ 0.755631]@3 high brightness panel: 1
596<3>[ 0.756027]@3 mdss_dsi_parse_ctrl_params:4006 Unable to read qcom,display-id, data=0000000000000000,len=20
597<6>[ 0.756071]@3 mdss_dsi_parse_gpio_params: bklt_en gpio not specified
598<3>[ 0.756301]@3 msm_dss_get_res_byname: 'dsi_phy_regulator' resource not found
599<3>[ 0.756308]@3 0xffffffc000390de8->msm_dss_ioremap_byname: 'dsi_phy_regulator' msm_dss_get_res_byname failed
600<6>[ 0.756315]@3 mdss_dsi_retrieve_ctrl_resources: ctrl_base=ffffff80021dc000 ctrl_size=400 phy_base=ffffff80021de400 phy_size=588
601<6>[ 0.756488]@3 dsi_panel_device_register: Continuous splash enabled
602<6>[ 0.757072]@3 mdss_register_panel: adding framebuffer device 994000.qcom,mdss_dsi_ctrl0
603<6>[ 0.760456]@3 mdss_dsi_ctrl_probe: Dsi Ctrl->0 initialized, DSI rev:0x10040001, PHY rev:0x2
604<6>[ 0.761795]@3 mdss_dsi_status_init: DSI status check interval:5000
605<6>[ 0.762208]@3 mdss_register_panel: adding framebuffer device soc:qcom,mdss_wb_panel
606<6>[ 0.763739]@3 mdss_fb_probe: fb0: split_mode:0 left:0 right:0
607<6>[ 0.764259]@3 mdss_fb_register: FrameBuffer[0] 1080x1920 registered successfully!
608<6>[ 0.765081]@3 mdss_fb_probe: fb1: split_mode:0 left:0 right:0
609<6>[ 0.765152]@3 mdss_fb_register: FrameBuffer[1] 640x480 registered successfully!
610<3>[ 0.765205]@3 mdss_mdp_splash_parse_dt: splash mem child node is not present
611<6>[ 0.775658]@3 In memshare_probe, Memshare probe success
612<6>[ 0.780288]@3 l2cache-pmu soc:l2-pmu: Registered L2 cache PMU using 2 HW PMUs
613<5>[ 0.781298]@3 msm_rpm_log_probe: OK
614<6>[ 0.785055]@0 subsys-pil-tz ce0000.qcom,venus: for venus segments only will be dumped.
615<6>subsys-pil-tz soc:qcom,kgsl-hyp: for a530_zap segments only will be dumped.
616<3>uart_tx_gpio is not available
617<3>[ 0.790921]@2 uart_rx_gpio is not available
618<3>[ 0.790929]@2 uart_cts_gpio is not available
619<3>[ 0.790935]@2 uart_rfr_gpio is not available
620<3>[ 0.791742]@3 sps: BAM device 0x0000000007544000 is not registered yet.
621<6>[ 0.791904]@3 sps:BAM 0x0000000007544000 is registered.
622<3>smd_channel_probe_now: allocation table not initialized
623<6>[ 0.793466]@3 7570000.uart: ttyHS0 at MMIO 0x7570000 (irq = 20, base_baud = 460800) is a MSM HS UART
624<6>[ 0.795487]@3 msm_serial_hs module loaded
625<6>[ 0.796255]@3 msm_serial_hsl_probe: detected port #0 (ttyHSL0)
626<3>[ 0.796380]@3 AXI: get_pdata(): Error: Client name not found
627<3>[ 0.796388]@3 AXI: msm_bus_cl_get_pdata(): client has to provide missing entry for successful registration
628<3>[ 0.796394]@3 msm_serial_hsl_probe: Bus scaling is disabled
629<6>[ 0.796503]@3 75b0000.serial: ttyHSL0 at MMIO 0x75b0000 (irq = 12, base_baud = 460800) is a MSM
630<6>[ 0.796581]@3 msm_hsl_console_setup: console setup on port #0
631<6>[ 5.315717]@3 console [ttyHSL0] enabled
632<6>[ 5.320655]@3 msm_serial_hsl_init: driver initialized
633<6>[ 5.344196]@3 brd: module loaded
634<6>[ 5.347305]@3 loop: module loaded
635<6>[ 5.349773]@3 at24 6-0051: 4096 byte 24c32 EEPROM, writable, 1 bytes/write
636<6>[ 5.357594]@3 QSEECOM: qseecom_probe: qseecom.qsee_version = 0x1000000
637<4>[ 5.363143]@3 QSEECOM: qseecom_retrieve_ce_data: Device does not support PFE
638<6>QSEECOM: qseecom_probe: no-clock-support=0x1<4>QSEECOM: qseecom_probe: qseecom.qsee_reentrancy_support = 2
639<3>[ 5.379861]@3 scm_call failed: func id 0x70000006, arginfo: 0x8887, args: 0x0, 0xf5de0f00, 0x80, 0xf63db000, ret: -2, syscall returns: 0xffffffffffffffed, 0x0, 0x0
640<4>[ 5.394110]@3 QSEECOM: qseecom_probe: qseecom.whitelist_support = 1
641<4>[ 5.401104]@3 i2c-core: driver [tusb320] using legacy suspend method
642<4>[ 5.406417]@3 i2c-core: driver [tusb320] using legacy resume method
643<4>[ 5.412728]@3 i2c-core: driver [fusb301] using legacy suspend method
644<4>[ 5.419005]@3 i2c-core: driver [fusb301] using legacy resume method
645<4>[ 5.425315]@3 i2c-core: driver [ptn5150] using legacy suspend method
646<4>[ 5.431599]@3 i2c-core: driver [ptn5150] using legacy resume method
647<3>[ 5.439466]@3 gpio_dev_probe
648<3>[ 5.441692]@3 i= 1 gpio=: 97
649<3>[ 5.444209]@3 i= 2 gpio=: 98
650<3>[ 5.447085]@3 i= 3 gpio=: 100
651<3>[ 5.450063]@3 i= 4 gpio=: 115
652<3>[ 5.453011]@3 i= 5 gpio=: 127
653<3>[ 5.455974]@3 i= 6 gpio=: 133
654<3>[ 5.458939]@3 i= 7 gpio=: 136
655<4>[ 5.461838]@3 gpio_pinctrl_init
656<4>[ 5.465406]@3 gpio_dev_probe ok!
657<6>[ 5.468531]@3 Loading pn544 driver
658<6>[ 5.471806]@3 Enter pn544_probe !!!
659<6>[ 5.475288]@3 pn544_parse_dt: 9, 94, 12, 1015 ,1018, 0
660<6>[ 5.480413]@3 successfully got regulator_s4
661<6>[ 5.484659]@3 successfully set regulator voltage_s4
662<6>[ 5.489320]@3 get BBCLK2!!!
663<6>[ 5.492356]@3 clk_prepare_enable. ret = 0
664<6>[ 5.496233]@3 pn544_probe : requesting IRQ 273
665<6>[ 5.500641]@3 pn544_probe pn544_dev->clk_gpio = 0
666<6>[ 5.505252]@3 pn544_probe : requesting IRQ 542
667<4>[ 5.509694]@3 ###clkreq_disable_irq###
668<4>i2c-core: driver [pn544] using legacy suspend method
669<4>[ 5.518051]@3 i2c-core: driver [pn544] using legacy resume method
670<6>[ 5.524152]@3 [NXP-P61] : Entry : p61_dev_init
671<6>[ 5.529887]@3 qce 660000.qcedev: Qualcomm Crypto 5.3.1 device found @0x660000
672<6>[ 5.536069]@3 qce 660000.qcedev: CE device = 0x0
673<6>, IO base, CE = 0xffffff8003780000
674<6>, Consumer (IN) PIPE 2, Producer (OUT) PIPE 3
675<6>IO base BAM = 0x (null)
676<6>BAM IRQ 156
677<6>Engines Availability = 0x2011053
678<6>[ 5.555588]@3 sps:BAM 0x0000000000644000 is registered.
679<6>sps:BAM 0x0000000000644000 (va:0xffffff8003800000) enabled: ver:0x27, number of pipes:16
680<6>[ 5.568365]@3 QCE50: qce_sps_init: Qualcomm MSM CE-BAM at 0x0000000000644000 irq 156
681<6>[ 5.583987]@3 qcrypto 660000.qcrypto: Qualcomm Crypto 5.3.1 device found @0x660000
682<6>[ 5.590619]@3 qcrypto 660000.qcrypto: CE device = 0x0
683<6>, IO base, CE = 0xffffff8003840000
684<6>, Consumer (IN) PIPE 4, Producer (OUT) PIPE 5
685<6>IO base BAM = 0x (null)
686<6>BAM IRQ 156
687<6>Engines Availability = 0x2011053
688<6>[ 5.610750]@3 QCE50: qce_sps_init: Qualcomm MSM CE-BAM at 0x0000000000644000 irq 156
689<6>[ 5.623216]@3 qcrypto 660000.qcrypto: qcrypto-ecb-aes
690<6>[ 5.627297]@3 qcrypto 660000.qcrypto: qcrypto-cbc-aes
691<6>[ 5.632359]@3 qcrypto 660000.qcrypto: qcrypto-ctr-aes
692<6>[ 5.637363]@3 qcrypto 660000.qcrypto: qcrypto-ecb-des
693<6>[ 5.642413]@3 qcrypto 660000.qcrypto: qcrypto-cbc-des
694<6>[ 5.647431]@3 qcrypto 660000.qcrypto: qcrypto-ecb-3des
695<6>[ 5.652568]@3 qcrypto 660000.qcrypto: qcrypto-cbc-3des
696<6>[ 5.657678]@3 qcrypto 660000.qcrypto: qcrypto-xts-aes
697<6>[ 5.662940]@3 qcrypto 660000.qcrypto: qcrypto-sha1
698<6>[ 5.667480]@3 qcrypto 660000.qcrypto: qcrypto-sha256
699<6>[ 5.672444]@3 qcrypto 660000.qcrypto: qcrypto-aead-hmac-sha1-cbc-aes
700<6>[ 5.678769]@3 qcrypto 660000.qcrypto: qcrypto-aead-hmac-sha1-cbc-des
701<6>[ 5.685124]@3 qcrypto 660000.qcrypto: qcrypto-aead-hmac-sha1-cbc-3des
702<6>[ 5.691538]@3 qcrypto 660000.qcrypto: qcrypto-aead-hmac-sha256-cbc-aes
703<6>[ 5.698039]@3 qcrypto 660000.qcrypto: qcrypto-aead-hmac-sha256-cbc-des
704<6>[ 5.704560]@3 qcrypto 660000.qcrypto: qcrypto-aead-hmac-sha256-cbc-3des
705<6>[ 5.711341]@3 qcrypto 660000.qcrypto: qcrypto-hmac-sha1
706<6>[ 5.716351]@3 qcrypto 660000.qcrypto: qcrypto-hmac-sha256
707<6>[ 5.721751]@3 qcrypto 660000.qcrypto: qcrypto-aes-ccm
708<6>[ 5.726770]@3 qcrypto 660000.qcrypto: qcrypto-rfc4309-aes-ccm
709<6>[ 5.735046]@3 ICE IRQ = 28
710<6>[ 5.740868]@3 qcom_ice_get_pdevice: found ice device ffffffc1732dc200
711<6>[ 5.746287]@3 qcom_ice_get_pdevice: matching platform device ffffffc175bce800
712<3>[ 5.753906]@3 scm_call failed: func id 0x42000c02, arginfo: 0x2, args: 0x13, 0x0, 0x0, 0x0, ret: -2, syscall returns: 0xfffffffffffffffc, 0x0, 0x0
713<3>[ 5.767300]@3 ufs_qcom_phy_qmp_14nm 627000.ufsphy: failed to get tx_iface_clk err -2
714<3>ufs_qcom_phy_qmp_14nm 627000.ufsphy: failed to get rx_iface_clk err -2
715<6>scsi host0: ufshcd
716<6>[ 5.785947]@3 qcom_ice 630000.ufsice: QC ICE 2.1.44 device found @0xffffff8002890000
717<6>[ 5.811792]@3 SCSI Media Changer driver v0.25
718<6>[ 5.818909]@3 sps:BAM 0x0000000007544000 (va:0xffffff80025c0000) enabled: ver:0x19, number of pipes:24
719<6>[ 5.827477]@3 [NXP-P61] : p61_probe chip select : 1 , bus number = 0
720<3>[ 5.829465]@1 ufshcd 624000.ufshc: ufshcd_print_pwr_info:[RX, TX]: gear=[1, 1], lane[1, 1], pwr[SLOWAUTO_MODE, SLOWAUTO_MODE], rate = 0
721<6>[ 5.846064]@3 p61_parse_dt: 34, 21 0
722<6>[ 5.849409]@3 [NXP-P61] : Entry : p61_hw_setup
723<6>[ 5.853963]@3 [NXP-P61] : Exit : p61_hw_setup
724<6>[ 5.858449]@3 [NXP-P61] : Entry : p61_disable_irq
725<6>[ 5.863396]@3 [NXP-P61] : Exit : p61_disable_irq
726<6>[ 5.867812]@3 [NXP-P61] : Exit : p61_probe
727<6>[ 5.873496]@3 msm_sharedmem: sharedmem_register_qmi: qmi init successful
728<6>[ 5.881881]@2 msm_sharedmem: msm_sharedmem_probe: Device created for client 'rmtfs'
729<4>[ 5.892131]@2 7411000.qusb supply USB3_GDSC not found, using dummy regulator
730<3>[ 5.901177]@3 msm-dwc3 6a00000.ssusb: unable to get dbm device
731<6>[ 5.909010]@3 ehci_hcd: USB 2.0 'Enhanced' Host Controller (EHCI) Driver
732<6>[ 5.915017]@3 ehci-pci: EHCI PCI platform driver
733<6>[ 5.919347]@3 usbcore: registered new interface driver uas
734<6>[ 5.924777]@3 usbcore: registered new interface driver usb-storage
735<6>[ 5.930936]@3 usbcore: registered new interface driver ums-alauda
736<6>[ 5.937002]@3 usbcore: registered new interface driver ums-cypress
737<6>[ 5.943186]@3 usbcore: registered new interface driver ums-datafab
738<6>[ 5.949327]@3 usbcore: registered new interface driver ums_eneub6250
739<6>[ 5.955674]@3 usbcore: registered new interface driver ums-freecom
740<6>[ 5.962021]@3 usbcore: registered new interface driver ums-isd200
741<6>[ 5.967903]@3 usbcore: registered new interface driver ums-jumpshot
742<6>[ 5.974166]@3 usbcore: registered new interface driver ums-karma
743<6>[ 5.980158]@3 usbcore: registered new interface driver ums-onetouch
744<6>[ 5.986392]@3 usbcore: registered new interface driver ums-realtek
745<6>[ 5.992564]@3 usbcore: registered new interface driver ums-sddr09
746<6>[ 5.998633]@3 usbcore: registered new interface driver ums-sddr55
747<6>[ 6.004722]@3 usbcore: registered new interface driver ums-usbat
748<3>[ 6.007426]@1 ufshcd 624000.ufshc: ufshcd_print_pwr_info:[RX, TX]: gear=[3, 3], lane[1, 1], pwr[FAST MODE, FAST MODE], rate = 2
749<5>[ 6.008204]@1 scsi 0:0:0:49488: Well-known LUN SAMSUNG KLUCG4J1CB-B0B1 0800 PQ: 0 ANSI: 6
750<5>[ 6.009016]@1 scsi 0:0:0:49456: Well-known LUN SAMSUNG KLUCG4J1CB-B0B1 0800 PQ: 0 ANSI: 6
751<5>[ 6.009712]@1 scsi 0:0:0:49476: Well-known LUN SAMSUNG KLUCG4J1CB-B0B1 0800 PQ: 0 ANSI: 6
752<4>[ 6.010366]@1 ufs_get_capacity_info size = 0x7734000
753<5>scsi 0:0:0:0: Direct-Access SAMSUNG KLUCG4J1CB-B0B1 0800 PQ: 0 ANSI: 6
754<5>[ 6.011451]@0 scsi 0:0:0:1: Direct-Access SAMSUNG KLUCG4J1CB-B0B1 0800 PQ: 0 ANSI: 6
755<5>[ 6.011897]@0 scsi 0:0:0:2: Direct-Access SAMSUNG KLUCG4J1CB-B0B1 0800 PQ: 0 ANSI: 6
756<5>[ 6.012322]@0 scsi 0:0:0:3: Direct-Access SAMSUNG KLUCG4J1CB-B0B1 0800 PQ: 0 ANSI: 6
757<5>[ 6.012740]@0 scsi 0:0:0:4: Direct-Access SAMSUNG KLUCG4J1CB-B0B1 0800 PQ: 0 ANSI: 6
758<5>[ 6.013138]@0 scsi 0:0:0:5: Direct-Access SAMSUNG KLUCG4J1CB-B0B1 0800 PQ: 0 ANSI: 6
759<5>[ 6.014001]@1 sd 0:0:0:0: [sda] 16384-byte physical blocks
760<5>[ 6.014431]@1 sd 0:0:0:1: [sdb] 16384-byte physical blocks
761<5>[ 6.015877]@1 sd 0:0:0:1: [sdb] 16384-byte physical blocks
762<5>[ 6.016082]@0 sd 0:0:0:0: [sda] 16384-byte physical blocks
763<5>[ 6.016416]@1 sd 0:0:0:2: [sdc] 16384-byte physical blocks
764<5>[ 6.016667]@0 sd 0:0:0:3: [sdd] 16384-byte physical blocks
765<5>[ 6.016923]@0 sd 0:0:0:4: [sde] 16384-byte physical blocks
766<5>[ 6.017147]@2 sd 0:0:0:5: [sdf] 16384-byte physical blocks
767<6>[ 6.020117]@2 sda: sda1 sda2 sda3 sda4 sda5 sda6 sda7 sda8 sda9 sda10 sda11 sda12 sda13 sda14 sda15
768<6>[ 6.020894]@1 sdb: sdb1
769<5>[ 6.020921]@2 sd 0:0:0:4: [sde] 16384-byte physical blocks
770<5>[ 6.020963]@2 sd 0:0:0:5: [sdf] 16384-byte physical blocks
771<5>[ 6.021156]@2 sd 0:0:0:0: [sda] 16384-byte physical blocks
772<5>[ 6.021513]@2 sd 0:0:0:3: [sdd] 16384-byte physical blocks
773<5>[ 6.021523]@1 sd 0:0:0:1: [sdb] 16384-byte physical blocks
774<5>[ 6.021551]@2 sd 0:0:0:2: [sdc] 16384-byte physical blocks
775<6>[ 6.024446]@0 sdf: sdf1 sdf2 sdf3 sdf4
776<6>[ 6.024767]@2 sde: sde1 sde2 sde3 sde4 sde5 sde6 sde7 sde8 sde9 sde10 sde11 sde12 sde13 sde14 sde15 sde16 sde17 sde18 sde19 sde20 sde21 sde22 sde23 sde24 sde25 sde26 sde27 sde28 sde29 sde30 sde31 sde32 sde33 sde34
777<6>[ 6.024820]@1 sdd: sdd1 sdd2 sdd3
778<5>[ 6.025587]@0 sd 0:0:0:5: [sdf] 16384-byte physical blocks
779<5>[ 6.025587]@1 sd 0:0:0:3: [sdd] 16384-byte physical blocks
780<6>[ 6.026311]@2 sdc: sdc1
781<5>[ 6.026678]@0 sd 0:0:0:4: [sde] 16384-byte physical blocks
782<5>[ 6.027161]@2 sd 0:0:0:2: [sdc] 16384-byte physical blocks
783<6>[ 6.239793]@2 usbcore: registered new interface driver usbserial
784<6>[ 6.246203]@3 gbridge_init: gbridge_init successs.
785<6>[ 6.250554]@3 mousedev: PS/2 mouse device common for all mice
786<6>[ 6.256264]@3 usbcore: registered new interface driver xpad
787<3>[ 6.261742]@3 synaptics,s3320: tpd_driver_init enter
788<3>[ 6.267483]@3 synaptics,s3320: before on cpu [3]
789<3>[ 6.271299]@3 synaptics,s3320: check CPU[0] is [online]
790<3>[ 6.276830]@3 touchkey,s1302: boot_time: before optimize [synaptics_ts_probe] on cpu 3
791<3>[ 6.284692]@3 touchkey,s1302: boot_time: [synaptics_ts_probe] CPU0 is online
792<3>[ 6.293382]@3 switch_data->key3_gpio=1013
793<3>[ 6.296456]@3 switch_data->key2_gpio=1012
794<3>[ 6.300581]@3 switch_data->key1_gpio=1014
795<6>[ 6.305942]@3 fpc1020_probe
796<6>[ 6.307901]@3 fpc1020 soc:fpc_fpc1020: fpc,irq-gpio - gpio: 95
797<6>[ 6.313620]@3 fpc1020 soc:fpc_fpc1020: fpc,reset-gpio - gpio: 86
798<6>[ 6.319524]@3 fpc1020 soc:fpc_fpc1020: fpc,gpio_id0 - gpio: 25
799<3>[ 6.325335]@3 fpc1020 soc:fpc_fpc1020: fpc1020_probe: gpio_is_valid(fpc1020->id0_gpio=25)
800<6>[ 6.333761]@3 fpc1020 soc:fpc_fpc1020: fpc,gpio_id1 - gpio: 143
801<3>[ 6.339387]@3 fpc1020 soc:fpc_fpc1020: fpc1020_probe: gpio_is_valid(fpc1020->id1_gpio=143)
802<6>[ 6.347691]@3 fpc1020 soc:fpc_fpc1020: fpc,gpio_1V8_EN - gpio: 14
803<6>[ 6.353852]@3 input: fpc1020 as /devices/virtual/input/input1
804<6>[ 6.359670]@3 fpc1020 soc:fpc_fpc1020: requested irq 359
805<6>[ 6.364793]@3 fpc1020 soc:fpc_fpc1020: fpc1020_probe: ok
806<6>[ 6.371353]@3 qcom,qpnp-rtc qpnp-rtc-8: rtc core: registered qpnp_rtc as rtc0
807<6>[ 6.377620]@3 i2c /dev entries driver
808<3>[ 6.382786]@3 SMBCHG: load_data: chip is NULL !
809<3>[ 6.386591]@3 SMBCHG: load_data: chip is NULL !
810<6>[ 6.390922]@2 FG: fg_probe: FG Probe success - FG Revision DIG:3.1 ANA:1.2 PMIC subtype=19
811<6>[ 6.399400]@3 BQ: bq27541_battery_probe: probe sucdess
812<3>[ 6.404614]@3 i2c-msm-v2 757a000.i2c: msm_bus_scale_register_client(mstr-id:86):0x11 (ok)
813<6>BQ: check_bat_type: is_4p4v_bat=1,support_4p4v_bat=1
814<4>[ 6.417824]@3 i2c-core: driver [bq27541-battery] using legacy suspend method
815<4>[ 6.424839]@3 i2c-core: driver [bq27541-battery] using legacy resume method
816<6>[ 6.432689]@3 FASTCHG: dash_probe: dash_probe
817<6>[ 6.470043]@3 FASTCHG: dash_probe: dash_probe success
818<3>[ 6.476033]@3 unable to find DT imem DLOAD mode node
819<3>[ 6.481636]@3 unable to find DT imem EDLOAD mode node
820<4>[ 6.486652]@3 set_dload_mode ON
821<6>[ 6.519289]@3 device-mapper: uevent: version 1.0.3
822<6>[ 6.523223]@3 device-mapper: ioctl: 4.28.0-ioctl (2014-09-17) initialised: dm-devel@redhat.com
823<6>[ 6.531879]@3 device-mapper: req-crypt: dm-req-crypt successfully initalized.
824<6>
825<6>[ 6.539099]@3 sdhci: Secure Digital Host Controller Interface driver
826<6>[ 6.545288]@3 sdhci: Copyright(c) Pierre Ossman
827<6>[ 6.549787]@3 sdhci-pltfm: SDHCI platform and OF driver helper
828<6>[ 6.560379]@3 hidraw: raw HID events driver (C) Jiri Kosina
829<6>[ 6.565112]@3 usbcore: registered new interface driver usbhid
830<3>[ 6.570068]@0 synaptics,s3320: after on cpu [0]
831<3>[ 6.570075]@0 synaptics,s3320: synaptics_ts_probe is called
832<3>[ 6.570453]@0 synaptics,s3320: synaptics_parse_dts ts->support_hw_poweroff =1
833<3>[ 6.570457]@0 synaptics,s3320: ts->enable2v8_gpio not specified
834<3>[ 6.570460]@0 synaptics,s3320: ts->max_num not specified
835<3>[ 6.570462]@0 synaptics,s3320: button-map not specified
836<3>[ 6.570465]@0 synaptics,s3320: synaptics:button map readed is 0 0 0
837<3>[ 6.570468]@0 synaptics,s3320: synaptics,tx-rx-num is 16 28
838<4>[ 6.570472]@0 synaptics,s3320: synaptic:ts->irq_gpio:125 irq_flags:8200 max_num 10
839<3>[ 6.571055]@0 synaptics,s3320: synaptics:enable the v1p8_gpio
840<3>[ 6.590220]@0 touchkey,s1302: boot_time: after optimize call [synaptics_ts_probe] on cpu 0
841<3>[ 6.590224]@0 touchkey,s1302: synaptics_ts_probe is called
842<6>[ 6.643541]@3 usbhid: USB HID core driver
843<6>[ 6.647666]@3 ashmem: initialized
844<3>[ 6.650043]@0 synaptics,s3320: synaptics:enable the reset_gpio
845<6>[ 6.656504]@3 logger: created 256K log 'log_main'
846<6>[ 6.661187]@3 logger: created 256K log 'log_events'
847<6>[ 6.666015]@3 logger: created 256K log 'log_radio'
848<6>[ 6.670808]@3 logger: created 256K log 'log_system'
849<6>[ 6.677871]@3 qpnp_coincell_charger_show_state: enabled=Y, voltage=3200 mV, resistance=2100 ohm
850<6>[ 6.691884]@3 bimc-bwmon 408000.qcom,cpu-bwmon: BW HWmon governor registered.
851<6>[ 6.698960]@3 arm-memlat-mon soc:qcom,arm-memlat-mon-0: Memory Latency governor registered.
852<6>[ 6.706492]@2 arm-memlat-mon soc:qcom,arm-memlat-mon-2: Memory Latency governor registered.
853<6>[ 6.716687]@2 m4m-hwmon 6530000.qcom,m4m-hwmon: Cache HWmon governor registered.
854<3>[ 6.726516]@3 devfreq soc:qcom,cpubw: Couldn't update frequency transition information.
855<3>[ 6.733607]@3 devfreq soc:qcom,mincpubw: Couldn't update frequency transition information.
856<3>[ 6.741829]@3 devfreq soc:qcom,memlat-cpu0: Couldn't update frequency transition information.
857<3>[ 6.750526]@3 devfreq soc:qcom,memlat-cpu2: Couldn't update frequency transition information.
858<3>[ 6.760326]@0 i2c-msm-v2 75ba000.i2c: msm_bus_scale_register_client(mstr-id:84):0x17 (ok)
859<6>otracer: initialized
860<6>[ 6.762390]@3 op_netlink_init
861<3>[ 6.763047]@3 tfa98xx_i2c_probe
862<6>[ 6.763465]@3 TCP: cubic registered
863<6>[ 6.763618]@3 NET: Registered protocol family 10
864<6>[ 6.763957]@3 NET: Registered protocol family 17
865<6>[ 6.764547]@3 NET: Registered protocol family 27
866<6>[ 6.766726]@3 subsys-pil-tz 9300000.qcom,lpass: for adsp segments only will be dumped.
867<6>subsys-pil-tz 1c00000.qcom,ssc: for slpi segments only will be dumped.
868<6>sps:BAM 0x0000000006b04000 is registered.
869<3>qpnp-smbcharger qpnp-smbcharger-17: node /soc/qcom,spmi@400f000/qcom,pmi8994@2/qcom,qpnp-smbcharger IO resource absent!
870<3>[ 6.807446]@0 synaptics,s3320: F12_2D_QUERY_BASE = 47
871<3> F12_2D_CMD_BASE = 0
872<3> F12_2D_CTRL_BASE = 15
873<3> F12_2D_DATA_BASE = 6
874<3>
875<3>synaptics,s3320: F01_RMI_QUERY_BASE = 2a
876<3> F01_RMI_CMD_BASE = 25
877<3> F01_RMI_CTRL_BASE = e
878<3> F01_RMI_DATA_BASE = 4
879<3>
880<3>synaptics,s3320: F34_FLASH_QUERY_BASE = 26
881<3> F34_FLASH_CMD_BASE = 0
882<3> F34_FLASH_CTRL_BASE = a
883<3> F34_FLASH_DATA_BASE = 0
884<3>
885<3>synaptics,s3320: F51_CUSTOM_QUERY_BASE = 3a
886<3> F51_CUSTOM_CMD_BASE = 0
887<3> F51_CUSTOM_CTRL_BASE = 1a
888<3> F51_CUSTOM_DATA_BASE = 0
889<3>
890<3>synaptics,s3320: F54_QUERY_BASE = 47
891<3> F54_CMD_BASE = 46
892<3> F54_CTRL_BASE = e
893<3> F54_DATA_BASE = 0
894<3>
895<3>synaptics,s3320: before fw update bootloader_mode[0x0]
896<3>[ 6.808935]@0 synaptics,s3320: CURRENT_FIRMWARE_ID = 0x15811001
897<3>[ 6.809340]@0 synaptics,s3320: 0synatpitcs_fw: fw_name = tp/fw_synaptics_15811.img,ts->manu_name:S350815811
898<3>[ 6.821223]@0 synaptics,s3320: synaptics_init_panel is called!
899<3>[ 6.821475]@0 synaptics,s3320: synaptics_mode_change: set TP to mode[0x80]
900<3>[ 6.823063]@0 synaptics,s3320: max_x = 1080,max_y = 1920; max_x_ic = 1079,max_y_ic = 1919
901<3>[ 6.823203]@0 synaptics,s3320: afte fw update,program memory self-check bootloader_mode = 0x0
902<3>[ 6.823639]@0 synaptics,s3320: synaptics_soft_reset !!!
903<6>[ 6.934683]@2 SMBCHG: qpnp_battery_temp_region_set: set temp_region = 5
904<6>[ 6.941252]@2 smbcharger_charger_otg: no parameters
905<6>[ 6.946105]@2 smbcharger_external_otg: no parameters
906<6>[ 6.950999]@2 smbcharger_external_otg: supplied by pmi8994_boost_5v
907<6>[ 6.957283]@2 SMBCHG: smbchg_hw_init: enable APSD
908<6>[ 6.961975]@2 SMBCHG: smbchg_hw_init: disabe HVDCP
909<6>[ 6.966928]@2 SMBCHG: smbchg_charging_en: enable=1
910<6>[ 6.971585]@2 SMBCHG: smbchg_charging_en: enable=0
911<6>[ 6.976256]@2 SMBCHG: smbchg_usb_suspend: suspend=0
912<6>[ 6.981565]@2 SMBCHG: smbchg_set_fastchg_current_raw: fastcharge current requested 500, set to 500
913<3>[ 7.000277]@0 synaptics,s3320: synaptics_tpedge_limitfunc limit_enable =1,mode:0x4b !
914<3>[ 7.007266]@0 synaptics,s3320: synaptics_input_init is called
915<6>[ 7.012895]@0 input: synaptics,s3320 as /devices/soc/75ba000.i2c/i2c-12/12-0020/input/input2
916<6>[ 7.020156]@2 SMBCHG: handle_usb_removal: triggered
917<6>[ 7.020160]@2 SMBCHG: handle_usb_removal: switch off fastchg
918<6>[ 7.020162]@2 FASTCHG: usb_sw_gpio_set: set usb_sw_gpio = 0
919<6>[ 7.020173]@2 SMBCHG: qpnp_battery_temp_region_set: set temp_region = 8
920<6>[ 7.020178]@2 SMBCHG: smbchg_set_usb_current_max: USB current_ma = 1800, typeC_support_current_ma = 4000
921<6>[ 7.020258]@2 SMBCHG: smbchg_rerun_aicl: Rerunning AICL...
922<3>[ 7.080283]@2 SMBCHG: set_dash_charger_present: set_dash_charger_present error
923<6>[ 7.086572]@2 SMBCHG: load_data: stored_soc[0xc3], shutdown_soc[97]
924<6>[ 7.092802]@3 SMBCHG: load_data: stored_soc[0xc3], shutdown_soc[97]
925<6>[ 7.092832]@2 SMBCHG: smbchg_usb_update_online_work: chip->usb_online = -22, online = 0
926<3>[ 7.110040]@0 synaptics,s3320: synaptic:ts->irq is 389
927<3>[ 7.114551]@1 synaptics,s3320: enter reset tp status,and ts->in_gesture_mode is:0
928<3>[ 7.121621]@1 synaptics,s3320: synaptics_init_panel is called!
929<6>[ 7.122532]@3 SMBCHG: load_data: stored_soc[0xc3], shutdown_soc[97]
930<6>[ 7.122788]@3 SMBCHG: load_data: stored_soc[0xc3], shutdown_soc[97]
931<6>[ 7.122832]@3 SMBCHG: load_data: stored_soc[0xc3], shutdown_soc[97]
932<6>[ 7.122895]@3 SMBCHG: load_data: stored_soc[0xc3], shutdown_soc[97]
933<6>[ 7.124259]@3 SMBCHG: load_data: stored_soc[0xc3], shutdown_soc[97]
934<3>[ 7.125584]@2 qpnp-smbcharger qpnp-smbcharger-17: node /soc/qcom,spmi@400f000/qcom,pmi8994@2/qcom,qpnp-smbcharger IO resource absent!
935<3>[ 7.130556]@0 synaptics,s3320: synaptics_ts_probe: going to create files--tp_fw_update
936<4>[ 7.130658]@0 synaptics,s3320: synaptics_ts_probe 3203: normal end
937<3>[ 7.136658]@2 msm-usb-ssphy-qmp 7410000.ssphy: QMP PHY initialization timeout
938<3>[ 7.136661]@2 msm-usb-ssphy-qmp 7410000.ssphy: USB3_PHY_PCS_STATUS:69696969
939<6>[ 7.136891]@2 msm-dwc3 6a00000.ssusb: DWC3 in low power mode
940<6>[ 7.137583]@3 qpnp-smbcharger qpnp-smbcharger-17: SMBCHG successfully probe Charger version=SCHG Revision DIG:2.0 ANA:2.1 batt=1 dc=0 usb=0
941<3>[ 7.137621]@3 tusb320 7-0060: tusb320_probe
942<3>[ 7.137885]@3 i2c-msm-v2 75b5000.i2c: msm_bus_scale_register_client(mstr-id:84):0x1a (ok)
943<3>i2c-msm-v2 75b5000.i2c: NACK: slave not responding, ensure its powered: msgs(n:2 cur:0 tx) bc(rx:1 tx:1) mode:FIFO slv_addr:0x60 MSTR_STS:0x091343c8 OPER:0x00000010
944<6>[ 7.138006]@3 SMBCHG: load_data: stored_soc[0xc3], shutdown_soc[97]
945<6>[ 7.138052]@3 SMBCHG: load_data: stored_soc[0xc3], shutdown_soc[97]
946<6>[ 7.138092]@3 SMBCHG: load_data: stored_soc[0xc3], shutdown_soc[97]
947<6>[ 7.138155]@3 SMBCHG: load_data: stored_soc[0xc3], shutdown_soc[97]
948<4>[ 7.138302]@3 tusb320_read_reg:reg(0x0), ret(-107)
949<3>[ 7.138306]@3 tusb320 7-0060: DEV_ID(0x0)!= 0x30
950<4>[ 7.138312]@3 tusb320: probe of 7-0060 failed with error -22
951<3>[ 7.138340]@3 fusb301 7-0021: fusb301_probe
952<3>[ 7.138590]@3 fusb301 7-0021: fusb301_gpio_configure OK!
953<3>[ 7.139141]@3 fusb301 7-0021: fusb301_probe OK!
954<3>[ 7.139184]@3 ptn5150 7-001d: ptn5150_probe
955<3>[ 7.139230]@0 i2c-msm-v2 75b5000.i2c: NACK: slave not responding, ensure its powered: msgs(n:2 cur:0 tx) bc(rx:1 tx:1) mode:FIFO slv_addr:0x1d MSTR_STS:0x0113e3c8 OPER:0x00000010
956<3>[ 7.139256]@3 ptn5150_read_reg: i2c read error: -5
957<3>[ 7.139259]@3 ptn5150 7-001d: DEV_ID(0x00)!= 0x0b || 0x09
958<4>[ 7.139263]@3 ptn5150: probe of 7-001d failed with error -22
959<6>[ 7.139516]@3 SMBCHG: load_data: stored_soc[0xc3], shutdown_soc[97]
960<3>[ 7.140319]@0 i2c-msm-v2 75b6000.i2c: msm_bus_scale_register_client(mstr-id:84):0x1b (ok)
961<3>touchkey,s1302: product id is s1302
962<3>[ 7.141150]@0 touchkey,s1302: F11_2D_QUERY_BASE = 95
963<3> F11_2D_CMD_BASE = 6e
964<3> F11_2D_CTRL_BASE = 3d
965<3> F11_2D_DATA_BASE = 15
966<3>
967<3>touchkey,s1302: CURRENT_FIRMWARE_ID = 0x4
968<3>[ 7.142536]@0 touchkey,s1302: before fw update,bootloader_mode = 0x0
969<6>[ 7.142629]@0 input: HWK,synaptics,s1302 as /devices/soc/75b6000.i2c/i2c-8/8-0020/input/input3
970<6>[ 7.153514]@3 project_info_init_sysfs success
971<6>[ 7.153903]@3 fastrpc soc:qcom,msm-adsprpc-mem: for adsp_rh segments only will be dumped.
972<6>adsprpc: channel link type: 0
973<6>[ 7.161716]@3 file system registered
974<6>[ 7.161747]@3 mbim_init: initialize 1 instances
975<6>[ 7.161777]@3 mbim_init: Initialized 1 ports
976<6>[ 7.162394]@3 rndis_qc_init: initialize rndis QC instance
977<6>[ 7.162487]@3 Number of LUNs=8
978<6>[ 7.162493]@3 Mass Storage Function, version: 2009/09/11
979<6>[ 7.162495]@3 LUN: removable file: (no medium)
980<6>[ 7.162505]@3 Number of LUNs=1
981<6>[ 7.162526]@3 LUN: removable read only CD-ROM file: (no medium)
982<6>[ 7.162529]@3 Number of LUNs=1
983<6>[ 7.162620]@3 android_usb gadget: android_usb ready
984<6>[ 7.163814]@3 input: gpio-keys as /devices/soc/soc:gpio_keys/input/input4
985<6>[ 7.170667]@3 qcom,qpnp-rtc qpnp-rtc-8: setting system clock to 1970-01-31 17:49:47 UTC (2656187)
986<6>[ 7.171039]@3 SMBCHG: load_data: stored_soc[0xc3], shutdown_soc[97]
987<6>[ 7.174517]@3 lmh_lite:lmh_parse_sensor Registering sensor:[DLMt_APC1]
988<6>[ 7.174709]@3 lmh_lite:lmh_parse_sensor Registering sensor:[LLM_cp00]
989<6>[ 7.174820]@3 lmh_lite:lmh_parse_sensor Registering sensor:[LLM_cp01]
990<6>[ 7.174927]@3 lmh_lite:lmh_parse_sensor Registering sensor:[LLM_cp10]
991<6>[ 7.175034]@3 lmh_lite:lmh_parse_sensor Registering sensor:[LLM_cp11]
992<6>[ 7.175142]@3 lmh_lite:lmh_parse_sensor Registering sensor:[LLM_m4m0]
993<6>[ 7.175251]@3 lmh_lite:lmh_parse_sensor Registering sensor:[LLM_l21-]
994<6>[ 7.175357]@3 lmh_lite:lmh_parse_sensor Registering sensor:[LLM_l20-]
995<3>[ 7.176976]@3 parse_cpu_levels: idx 1 545
996<3>[ 7.176982]@3 parse_cpu_levels: idx 2 6022
997<3>[ 7.176983]@3 parse_cpu_levels: idx 2 11499
998<3>[ 7.177019]@3 parse_cpu_levels: idx 1 545
999<3>[ 7.177020]@3 parse_cpu_levels: idx 2 6022
1000<3>[ 7.177022]@3 parse_cpu_levels: idx 2 11499
1001<3>[ 7.180008]@3 qcom,qpnp-flash-led qpnp-flash-led-25: Unable to acquire pinctrl
1002<6>[ 7.181306]@3 rmnet_ipa started initialization
1003<6>[ 7.181311]@3 IPA SSR support = True
1004<6>[ 7.181313]@3 IPA ipa-loaduC = True
1005<6>[ 7.181314]@3 IPA SG support = True
1006<3>[ 7.182652]@3 ipa ipa_sps_irq_control_all:938 EP (5) not allocated.
1007<3>[ 7.182658]@3 ipa ipa2_uc_state_check:301 uC is not loaded
1008<6>[ 7.183349]@3 rmnet_ipa completed initialization
1009<6>[ 7.186722]@3 qcom,cc-debug-8996 362000.qcom,cc-debug: Registered debug mux.
1010<6>[ 7.187371]@3 wlan_en_vreg: disabling
1011<6>[ 7.187375]@3 rome_vreg: disabling
1012<6>[ 7.187377]@3 gdsc_mmagic_bimc: disabling
1013<6>[ 7.187412]@3 kryo1-retention: disabling
1014<6>[ 7.187415]@3 kryo0-retention: disabling
1015<6>[ 7.187417]@3 gfx_mem_acc_corner: disabling
1016<6>[ 7.187419]@3 apcc_l3_mem_acc_corner: disabling
1017<6>[ 7.187421]@3 apc1_perfcl_mem_acc_corner: disabling
1018<6>[ 7.187423]@3 apc0_pwrcl_mem_acc_corner: disabling
1019<6>[ 7.187425]@3 regulator_proxy_consumer_remove_all: removing regulator proxy consumer requests
1020<6>[ 7.187674]@3 clock_late_init: Removing enables held for handed-off clocks
1021<6>[ 7.191086]@3 ALSA device list:
1022<6>[ 7.191088]@3 No soundcards found.
1023<3>[ 7.270027]@0 touchkey,s1302: synaptic:ts->irq is 396
1024<3>[ 7.270154]@0 touchkey,s1302: touchkey using poll status:0
1025<3>[ 7.270392]@0 touchkey,s1302: synaptics_soft_reset !!!
1026<3>[ 7.270416]@0 touchkey,s1302: create nodes is successe!
1027<4>[ 7.270476]@0 touchkey,s1302: synaptics_ts_probe s1302: normal end
1028<3>[ 7.270479]@0 touchkey,s1302: boot_time: synaptics_ts_probe return 0
1029<6>[ 7.408004]@3 BQ: bq27541_hw_config: DEVICE_TYPE is 0x541, FIRMWARE_VERSION is 0x200
1030<6>[ 7.408008]@3 BQ: bq27541_hw_config: Complete bq27541 configuration 0x600B
1031<6>[ 7.695912]@3 Freeing unused kernel memory: 396K (ffffffc000af1000 - ffffffc000b54000)
1032<3>[ 7.695934]@2 synaptics,s3320: synaptics_mode_change: set TP to mode[0x80]
1033<6>[ 7.709822]@3 Freeing alternatives memory: 68K (ffffffc000b54000 - ffffffc000b65000)
1034<13>[ 7.730136]@3 init: init started!
1035<7>[ 7.733776]@3 SELinux: 2048 avtab hash slots, 4859 rules.
1036<6>[ 7.733802]@3 SELinux: Android master kernel running Android M policy in compatibility mode.
1037<7>[ 7.741942]@3 SELinux: 2048 avtab hash slots, 4859 rules.
1038<7>[ 7.741950]@3 SELinux: 1 users, 2 roles, 530 types, 0 bools, 1 sens, 1024 cats
1039<7>[ 7.741956]@3 SELinux: 87 classes, 4859 rules
1040<6>[ 7.742207]@3 SELinux: Permission module_load in class system not defined in policy.
1041<6>[ 7.749255]@3 SELinux: Permission audit_read in class capability2 not defined in policy.
1042<6>[ 7.757634]@3 SELinux: Class can_socket not defined in policy.
1043<6>[ 7.763169]@3 SELinux: the above unknown classes and permissions will be denied
1044<7>[ 7.770480]@3 SELinux: Completing initialization.
1045<7>[ 7.770482]@3 SELinux: Setting up existing superblocks.
1046<7>[ 7.770491]@3 SELinux: initialized (dev tmpfs, type tmpfs), uses transition SIDs
1047<7>[ 7.770506]@3 SELinux: initialized (dev rootfs, type rootfs), uses genfs_contexts
1048<7>[ 7.770915]@3 SELinux: initialized (dev bdev, type bdev), not configured for labeling
1049<7>[ 7.770925]@3 SELinux: initialized (dev proc, type proc), uses genfs_contexts
1050<7>[ 7.770939]@3 SELinux: initialized (dev debugfs, type debugfs), uses genfs_contexts
1051<7>[ 7.793247]@3 SELinux: initialized (dev sockfs, type sockfs), uses task SIDs
1052<7>[ 7.793262]@3 SELinux: initialized (dev pipefs, type pipefs), uses task SIDs
1053<7>[ 7.793268]@3 SELinux: initialized (dev anon_inodefs, type anon_inodefs), not configured for labeling
1054<7>[ 7.793273]@3 SELinux: initialized (dev aio, type aio), not configured for labeling
1055<7>[ 7.793279]@3 SELinux: initialized (dev devpts, type devpts), uses transition SIDs
1056<7>[ 7.793298]@3 SELinux: initialized (dev selinuxfs, type selinuxfs), uses genfs_contexts
1057<7>[ 7.793350]@3 SELinux: initialized (dev tmpfs, type tmpfs), uses transition SIDs
1058<7>[ 7.793364]@3 SELinux: initialized (dev sysfs, type sysfs), uses genfs_contexts
1059<5>[ 7.812585]@3 audit: type=1403 audit(2656188.139:2): policy loaded auid=4294967295 ses=4294967295
1060<13>[ 7.820783]@3 init: (Initializing SELinux non-enforcing took 0.09s.)
1061<13>[ 7.829395]@3 init: init second stage started!
1062<11>[ 7.833019]@3 init: property_set("ro.boot.bootdevice", "624000.ufshc") failed
1063<11>[ 7.839942]@3 init: property_set("ro.boot.selinux", "permissive") failed
1064<11>[ 8.158119]@2 init: waitpid failed: No child processes
1065<13>[ 8.162478]@2 init: (Loading properties from /default.prop took 0.00s.)
1066<11>[ 8.169090]@2 init: /init.rc: 62: invalid command 'load_all_props'
1067<11>[ 8.175049]@2 init: could not import file '/init.recovery.logd.rc' from '/init.rc'
1068<13>[ 8.182611]@2 init: (Parsing /init.recovery.usb.rc took 0.00s.)
1069<13>[ 8.188475]@2 init: (Parsing /init.recovery.service.rc took 0.00s.)
1070<13>[ 8.194746]@2 init: (Parsing /init.recovery.qcom.rc took 0.00s.)
1071<13>[ 8.200698]@2 init: (Parsing /init.rc took 0.03s.)
1072<5>[ 8.205521]@2 audit: type=1400 audit(2656188.529:3): avc: denied { setcheckreqprot } for pid=1 comm="init" scontext=u:r:init:s0 tcontext=u:object_r:kernel:s0 tclass=security permissive=1
1073<5>[ 8.222351]@2 audit: type=1400 audit(2656188.549:4): avc: denied { setcurrent } for pid=1 comm="init" scontext=u:r:init:s0 tcontext=u:r:init:s0 tclass=process permissive=1
1074<5>[ 8.237859]@2 audit: type=1400 audit(2656188.559:5): avc: denied { dyntransition } for pid=1 comm="init" scontext=u:r:init:s0 tcontext=u:r:init:s0 tclass=process permissive=1
1075<11>[ 8.253668]@2 init: SELinux: Could not get canonical path /postinstall restorecon: No such file or directory.
1076<13>[ 8.263566]@2 init: Starting service 'ueventd'...
1077<13>[ 8.268368]@2 init: Starting service 'healthd'...
1078<13>[ 8.269376]@3 ueventd: ueventd started!
1079<13>[ 8.276908]@2 init: Waiting for /dev/.coldboot_done...
1080<3>[ 8.466249]@2 BQ: bq27541_battery_soc: bq27541_battery_soc = 97
1081<3>[ 8.467130]@3 BQ: bq27541_battery_soc: bq27541_battery_soc = 97
1082<6>[ 8.467149]@3 SMBCHG: load_data: stored_soc[0xc3], shutdown_soc[97]
1083<6>[ 8.467151]@3 BQ: fg_soc_calibrate: soc=97, soc_load=97
1084<13>[ 9.053879]@3 ueventd: Coldboot took 0.78s.
1085<13>[ 9.057977]@0 init: Waiting for /dev/.coldboot_done took 0.78s.
1086<7>[ 9.064245]@0 SELinux: initialized (dev tmpfs, type tmpfs), uses transition SIDs
1087<13>[ 9.064872]@0 init: Starting service 'setup-decrypt'...
1088<7>[ 9.069383]@0 SELinux: initialized (dev pstore, type pstore), uses genfs_contexts
1089<7>[ 9.069851]@0 SELinux: initialized (dev functionfs, type functionfs), uses genfs_contexts
1090<3>[ 9.069977]@0 enable_store: android_usb: already disabled
1091<11>[ 9.074803]@2 init: property 'ro.product.model' doesn't exist while expanding '${ro.product.model}'
1092<5>[ 9.080753]@3 audit: type=1400 audit(2656189.409:6): avc: denied { write } for pid=404 comm="setup_decrypt" name="kmsg" dev="tmpfs" ino=10077 scontext=u:r:recovery:s0 tcontext=u:object_r:kmsg_device:s0 tclass=chr_file permissive=1
1093<5>[ 9.080771]@3 audit: type=1400 audit(2656189.409:7): avc: denied { open } for pid=404 comm="setup_decrypt" path="/dev/kmsg" dev="tmpfs" ino=10077 scontext=u:r:recovery:s0 tcontext=u:object_r:kmsg_device:s0 tclass=chr_file permissive=1
1094<12>[ 9.080800]@3 setup_decrypt: Mounting /system read-only
1095<6>[ 9.091708]@0 EXT4-fs (sde20): mounted filesystem with ordered data mode. Opts: (null)
1096<7>[ 9.091725]@0 SELinux: initialized (dev sde20, type ext4), uses xattr
1097<12>[ 9.104726]@3 setup_decrypt: Copying decryption libraries from /system
1098<5>[ 9.108259]@3 audit: type=1400 audit(2656189.429:8): avc: denied { write } for pid=411 comm="cp" name="sbin" dev="rootfs" ino=8593 scontext=u:r:recovery:s0 tcontext=u:object_r:rootfs:s0 tclass=dir permissive=1
1099<5>[ 9.108275]@3 audit: type=1400 audit(2656189.429:9): avc: denied { remove_name } for pid=411 comm="cp" name="qseecomd" dev="rootfs" ino=1415 scontext=u:r:recovery:s0 tcontext=u:object_r:rootfs:s0 tclass=dir permissive=1
1100<5>[ 9.108285]@3 audit: type=1400 audit(2656189.429:10): avc: denied { unlink } for pid=411 comm="cp" name="qseecomd" dev="rootfs" ino=1415 scontext=u:r:recovery:s0 tcontext=u:object_r:rootfs:s0 tclass=file permissive=1
1101<5>[ 9.108319]@3 audit: type=1400 audit(2656189.429:11): avc: denied { add_name } for pid=411 comm="cp" name="qseecomd" scontext=u:r:recovery:s0 tcontext=u:object_r:rootfs:s0 tclass=dir permissive=1
1102<5>[ 9.135217]@3 random: sed urandom read with 90 bits of entropy available
1103<11>[ 9.227066]@2 init: cannot expand '${ro.product.model}' while writing to '/sys/class/android_usb/android0/iProduct'
1104<11>[ 9.237801]@2 init: avc: denied { set } for property=crypto.using_system_libs scontext=u:r:recovery:s0 tcontext=u:object_r:vold_prop:s0 tclass=property_service
1105<3>[ 9.251988]@2 functions_store: android_usb: functions_store'adb'
1106<12>[ 9.252758]@3 setup_decrypt: Using system decryption libraries!
1107<13>[ 9.263916]@2 init: Service 'setup-decrypt' (pid 401) exited with status 0
1108<11>[ 9.272616]@2 init: property_set("ro.build.product", "OnePlus3") failed
1109<11>[ 9.278203]@2 init: property_set("ro.build.user", "OnePlus") failed
1110<11>[ 9.284478]@2 init: property_set("ro.build.flavor", "OnePlus3-user") failed
1111<11>[ 9.291408]@2 init: property_set("ro.build.description", "OnePlus3-user 7.0 NRD90M 138 dev-keys") failed
1112<11>[ 9.300955]@2 init: property_set("ro.product.brand", "OnePlus") failed
1113<11>[ 9.307368]@2 init: property_set("ro.product.manufacturer", "OnePlus") failed
1114<11>[ 9.314601]@2 init: property_set("ro.build.id", "NRD90M") failed
1115<11>[ 9.320487]@2 init: property_set("ro.build.version.incremental", "138") failed
1116<11>[ 9.327681]@2 init: property_set("ro.build.version.sdk", "24") failed
1117<11>[ 9.334114]@2 init: property_set("ro.build.version.preview_sdk", "0") failed
1118<11>[ 9.341144]@2 init: property_set("ro.build.version.codename", "REL") failed
1119<11>[ 9.348078]@2 init: property_set("ro.build.version.all_codenames", "REL") failed
1120<11>[ 9.355469]@2 init: property_set("ro.build.version.release", "7.0") failed
1121<11>[ 9.362328]@2 init: property_set("ro.build.version.security_patch", "2016-12-01") failed
1122<11>[ 9.370407]@2 init: property_set("ro.build.version.base_os", "") failed
1123<11>[ 9.376984]@2 init: property_set("ro.build.date", "Sat Jan 14 01:21:58 CST 2017") failed
1124<11>[ 9.385092]@2 init: property_set("ro.build.date.utc", "1484328118") failed
1125<11>[ 9.391926]@2 init: property_set("ro.build.type", "user") failed
1126<11>[ 9.397906]@2 init: property_set("ro.build.host", "ubuntu-23") failed
1127<11>[ 9.404339]@2 init: property_set("ro.build.tags", "release-keys") failed
1128<11>[ 9.411023]@2 init: property_set("ro.product.board", "QC_Reference_Phone") failed
1129<11>[ 9.418479]@2 init: property_set("ro.product.cpu.abi", "arm64-v8a") failed
1130<11>[ 9.425352]@2 init: property_set("ro.product.cpu.abilist", "arm64-v8a,armeabi-v7a,armeabi") failed
1131<11>[ 9.434302]@2 init: property_set("ro.product.cpu.abilist32", "armeabi-v7a,armeabi") failed
1132<11>[ 9.442533]@2 init: property_set("ro.product.cpu.abilist64", "arm64-v8a") failed
1133<11>[ 9.449902]@2 init: property_set("ro.product.locale", "en-US") failed
1134<11>[ 9.456337]@2 init: property_set("ro.wifi.channels", "") failed
1135<11>[ 9.462240]@2 init: property_set("ro.board.platform", "msm8996") failed
1136<11>[ 9.468827]@2 init: property_set("ro.build.characteristics", "nosdcard") failed
1137<11>[ 9.476651]@2 init: property_set("ro.com.android.dataroaming", "false") failed
1138<11>[ 9.483351]@2 init: property_set("ro.config.ringtone", "oneplus_tune.ogg") failed
1139<11>[ 9.490808]@2 init: property_set("ro.config.notification_sound", "meet.ogg") failed
1140<11>[ 9.498427]@2 init: property_set("ro.config.alarm_alert", "spring.ogg") failed
1141<11>[ 9.505642]@2 init: property_set("ro.carrier", "unknown") failed
1142<11>[ 9.511650]@2 init: property_set("ro.frp.pst", "/dev/block/bootdevice/by-name/frp") failed
1143<11>[ 9.519884]@2 init: property_set("ro.qc.sdk.audio.fluencetype", "none") failed
1144<13>[ 9.527275]@2 init: (Loading properties from /system/build.prop took 0.26s.)
1145<13>[ 9.534152]@2 init: (Loading properties from /vendor/build.prop took 0.00s.)
1146<13>[ 9.541154]@2 init: (Loading properties from /factory/factory.prop took 0.00s.)
1147<13>[ 9.550384]@2 init: (Loading properties from /data/local.prop took 0.00s.)
1148<11>[ 9.556237]@2 init: Unable to open persistent property directory "/data/property": No such file or directory
1149<11>[ 9.566072]@2 init: property_set("ro.display.series", "OnePlus 3T") failed
1150<13>[ 9.573159]@2 init: Starting service 'set_permissive'...
1151<13>[ 9.578331]@2 init: Starting service 'recovery'...
1152<3>[ 9.583726]@2 functions_store: android_usb: functions_store'mtp,adb'
1153<13>[ 9.589429]@2 init: Service 'set_permissive' (pid 420) exited with status 0
1154<13>[ 9.596407]@2 init: Starting service 'adbd'...
1155<11>[ 9.601005]@2 init: avc: denied { set } for property=twrp.crash_counter scontext=u:r:recovery:s0 tcontext=u:object_r:default_prop:s0 tclass=property_service
1156<6>[ 9.602501]@0 ep0_open success!
1157<6>[ 9.602513]@0 read descriptors
1158<6>[ 9.602523]@0 read strings
1159<6>[ 9.602538]@0 mtp_bind_config
1160<6>[ 9.602547]@0 mtp_create_bulk_endpoints: useFixAddr:false
1161<3>[ 9.649912]@2 msm-usb-ssphy-qmp 7410000.ssphy: QMP PHY initialization timeout
1162<3>[ 9.656028]@2 msm-usb-ssphy-qmp 7410000.ssphy: USB3_PHY_PCS_STATUS:69696969
1163<6>[ 9.663231]@2 msm-dwc3 6a00000.ssusb: DWC3 exited from low power mode
1164<3>[ 9.669390]@2 dwc3 6a00000.dwc3: request ffffffc172924700 was not queued to ep0out
1165<6>[ 9.677281]@2 msm-dwc3 6a00000.ssusb: DWC3 in low power mode
1166<13>[ 9.680449]@3 init: Service 'adbd' is being killed...
1167<6>[ 9.680630]@3 mtp_bind_config
1168<6>[ 9.680638]@3 mtp_create_bulk_endpoints: useFixAddr:false
1169<3>[ 9.782185]@3 msm-usb-ssphy-qmp 7410000.ssphy: QMP PHY initialization timeout
1170<4>[ 9.785712]@0 mdss_dsi_on start
1171<6>[ 9.785717]@0 get_param_by_index_and_offset[75] sid_index = 2 offset = 32 buf = ffffffc0b6318f40 length = 4
1172<3>[ 9.785720]@0 mdss_dsi_on:srgb mode 0
1173<6>[ 9.785722]@0 get_param_by_index_and_offset[75] sid_index = 2 offset = 36 buf = ffffffc0b6318f88 length = 4
1174<3>[ 9.785725]@0 mdss_dsi_on:srgb mode 0
1175<6>[ 9.785726]@0 get_param_by_index_and_offset[75] sid_index = 2 offset = 40 buf = ffffffc0b6318fd0 length = 4
1176<3>[ 9.785729]@0 mdss_dsi_on:srgb mode 0
1177<4>[ 9.785732]@0 mdss_dsi_on end
1178<3>[ 9.834916]@3 msm-usb-ssphy-qmp 7410000.ssphy: USB3_PHY_PCS_STATUS:69696969
1179<6>[ 9.842029]@0 msm-dwc3 6a00000.ssusb: DWC3 exited from low power mode
1180<3>[ 9.848149]@0 dwc3 6a00000.dwc3: request ffffffc172924700 was not queued to ep0out
1181<13>[ 9.856687]@3 init: Service 'adbd' (pid 423) killed by signal 9
1182<6>[ 9.857095]@0 msm-dwc3 6a00000.ssusb: DWC3 in low power mode
1183<13>[ 9.867220]@3 init: Service 'adbd' (pid 423) killing any children in process group
1184<6>[ 9.930224]@2 of_batterydata_get_best_profile: OP_3400mAH found
1185<6>[ 9.945185]@2 FG: fg_batt_profile_init: Battery SOC: 99, V: 4239477uV
1186<4>[ 10.016490]@1 mdss_dsi_off start
1187<4>[ 10.045534]@1 mdss_dsi_off end
1188<4>[ 10.055271]@1 mdss_dsi_on start
1189<4>[ 10.091651]@1 mdss_dsi_on end
1190<4>[ 10.118907]@1 --------backlight level = 127---------
1191<4>[ 10.164761]@1 blank off start
1192<3>[ 10.164774]@1 fpc1020 soc:fpc_fpc1020: fb_notifier_callback screen off
1193<3>[ 10.164804]@1 synaptics,s3320: fb_notifier_callback blank[4],event[0x10]
1194<3>[ 10.164808]@1 synaptics,s3320: fb_notifier_callback : going TP suspend start
1195<3>[ 10.164812]@1 synaptics,s3320: synaptics_ts_suspend enter
1196<3>[ 10.164818]@1 synaptics,s3320: synaptics_ts_suspend normal end
1197<3>[ 10.164820]@1 synaptics,s3320: fb_notifier_callback : going TP suspend end
1198<4>[ 10.164932]@1 --------backlight level = 0---------
1199<4>[ 10.368378]@1 mdss_dsi_off start
1200<4>[ 10.396002]@1 mdss_dsi_off end
1201<3>[ 10.398277]@1 synaptics,s3320: fb_notifier_callback blank[4],event[0x9]
1202<4>[ 10.399403]@1 blank off end
1203<4>[ 10.460200]@2 blank on start
1204<3>[ 10.461625]@2 fpc1020 soc:fpc_fpc1020: fb_notifier_callback screen on
1205<3>[ 10.461644]@2 synaptics,s3320: fb_notifier_callback blank[0],event[0x10]
1206<3>[ 10.461647]@2 synaptics,s3320: fb_notifier_callback going TP resume start
1207<3>[ 10.461650]@2 synaptics,s3320: synaptics_ts_resume enter!
1208<3>[ 10.461664]@2 synaptics,s3320: synaptics_ts_resume:normal end!
1209<3>[ 10.461666]@2 synaptics,s3320: fb_notifier_callback going TP resume end
1210<4>[ 10.463303]@0 mdss_dsi_on start
1211<3>[ 10.470045]@1 synaptics,s3320: tp_baseline_get start!
1212<4>[ 10.495980]@0 mdss_dsi_on end
1213<3>[ 10.502813]@1 sps: BAM device 0x0000000007584000 is not registered yet.
1214<6>[ 10.502978]@1 sps:BAM 0x0000000007584000 is registered.
1215<6>sps:BAM 0x0000000007584000 (va:0xffffff8006300000) enabled: ver:0x19, number of pipes:24
1216<4>[ 10.517756]@0 --------backlight level = 127---------
1217<3>[ 10.518885]@0 synaptics,s3320: fb_notifier_callback blank[0],event[0x9]
1218<6>[ 10.518891]@0 BQ: bq27541_set_lcd_off_status: off=0
1219<4>[ 10.519126]@0 blank on end
1220<3>[ 10.560402]@0 synaptics,s3320: enter reset tp status,and ts->in_gesture_mode is:0
1221<3>[ 10.560407]@0 synaptics,s3320: synaptics_init_panel is called!
1222<3>[ 10.560657]@0 synaptics,s3320: synaptics_mode_change: set TP to mode[0x80]
1223<3>[ 10.620301]@1 synaptics,s3320: synaptics_tpedge_limitfunc limit_enable =1,mode:0x4b !
1224<3>[ 10.620510]@1 synaptics,s3320: tp_baseline_get end!
1225<3>[ 10.644364]@3 mdss_dsi_post_panel_on:+
1226<3>[ 10.660447]@3 mdss_dsi_post_panel_on:-
1227<6>[ 10.709279]@3 F2FS-fs (sda15): Magic Mismatch, valid(0xf2f52010) - read(0xb9c06593)
1228<3>[ 10.715944]@3 F2FS-fs (sda15): Can't find valid F2FS filesystem in 1th superblock
1229<6>[ 10.725039]@3 F2FS-fs (sda15): Magic Mismatch, valid(0xf2f52010) - read(0xf8adf4c2)
1230<3>[ 10.731671]@3 F2FS-fs (sda15): Can't find valid F2FS filesystem in 2th superblock
1231<6>[ 10.739122]@3 F2FS-fs (sda15): Magic Mismatch, valid(0xf2f52010) - read(0xb9c06593)
1232<3>[ 10.746967]@3 F2FS-fs (sda15): Can't find valid F2FS filesystem in 1th superblock
1233<6>[ 10.754230]@3 F2FS-fs (sda15): Magic Mismatch, valid(0xf2f52010) - read(0xf8adf4c2)
1234<3>[ 10.761875]@3 F2FS-fs (sda15): Can't find valid F2FS filesystem in 2th superblock
1235<6>[ 10.771127]@3 F2FS-fs (sda15): Magic Mismatch, valid(0xf2f52010) - read(0xb9c06593)
1236<3>[ 10.777740]@3 F2FS-fs (sda15): Can't find valid F2FS filesystem in 1th superblock
1237<6>[ 10.785372]@2 F2FS-fs (sda15): Magic Mismatch, valid(0xf2f52010) - read(0xf8adf4c2)
1238<3>[ 10.792859]@2 F2FS-fs (sda15): Can't find valid F2FS filesystem in 2th superblock
1239<6>[ 10.800326]@2 F2FS-fs (sda15): Magic Mismatch, valid(0xf2f52010) - read(0xb9c06593)
1240<3>[ 10.807947]@2 F2FS-fs (sda15): Can't find valid F2FS filesystem in 1th superblock
1241<6>[ 10.815432]@2 F2FS-fs (sda15): Magic Mismatch, valid(0xf2f52010) - read(0xf8adf4c2)
1242<3>[ 10.823225]@2 F2FS-fs (sda15): Can't find valid F2FS filesystem in 2th superblock
1243<6>[ 10.839865]@3 F2FS-fs (sda15): Magic Mismatch, valid(0xf2f52010) - read(0xb9c06593)
1244<3>[ 10.846679]@3 F2FS-fs (sda15): Can't find valid F2FS filesystem in 1th superblock
1245<6>[ 10.854104]@3 F2FS-fs (sda15): Magic Mismatch, valid(0xf2f52010) - read(0xf8adf4c2)
1246<3>[ 10.861599]@3 F2FS-fs (sda15): Can't find valid F2FS filesystem in 2th superblock
1247<6>[ 10.869057]@3 F2FS-fs (sda15): Magic Mismatch, valid(0xf2f52010) - read(0xb9c06593)
1248<3>[ 10.876705]@3 F2FS-fs (sda15): Can't find valid F2FS filesystem in 1th superblock
1249<6>[ 10.884167]@3 F2FS-fs (sda15): Magic Mismatch, valid(0xf2f52010) - read(0xf8adf4c2)
1250<3>[ 10.891985]@3 F2FS-fs (sda15): Can't find valid F2FS filesystem in 2th superblock
1251<6>[ 10.901195]@3 F2FS-fs (sda15): Magic Mismatch, valid(0xf2f52010) - read(0xb9c06593)
1252<3>[ 10.907816]@3 F2FS-fs (sda15): Can't find valid F2FS filesystem in 1th superblock
1253<6>[ 10.915453]@3 F2FS-fs (sda15): Magic Mismatch, valid(0xf2f52010) - read(0xf8adf4c2)
1254<3>[ 10.922944]@3 F2FS-fs (sda15): Can't find valid F2FS filesystem in 2th superblock
1255<6>[ 10.930398]@3 F2FS-fs (sda15): Magic Mismatch, valid(0xf2f52010) - read(0xb9c06593)
1256<3>[ 10.938023]@3 F2FS-fs (sda15): Can't find valid F2FS filesystem in 1th superblock
1257<6>[ 10.945695]@3 F2FS-fs (sda15): Magic Mismatch, valid(0xf2f52010) - read(0xf8adf4c2)
1258<3>[ 10.953139]@3 F2FS-fs (sda15): Can't find valid F2FS filesystem in 2th superblock
1259<6>[ 10.968921]@3 EXT4-fs (sda3): mounted filesystem with ordered data mode. Opts:
1260<7>[ 10.975250]@3 SELinux: initialized (dev sda3, type ext4), uses xattr
1261<6>[ 10.975688]@3 SELinux: Context u:object_r:cache_recovery_file:s0 is not valid (left unmapped).
1262<13>[ 10.984452]@0 init: Starting service 'qseecomd'...
1263<6>[ 10.996037]@2 capability: warning: `qseecomd' uses 32-bit capabilities (legacy support in use)
1264<11>[ 11.007736]@0 init: avc: denied { set } for property=sys.listeners.registered scontext=u:r:recovery:s0 tcontext=u:object_r:system_prop:s0 tclass=property_service
1265<3>[ 11.310413]@3 switch_dev_work ,tristatekey set to state(3)
1266<13>[ 14.025336]@0 init: Starting service 'adbd'...
1267<6>[ 14.037516]@3 ep0_open success!
1268<6>[ 14.039701]@3 read descriptors
1269<6>[ 14.042849]@3 read strings
1270<6>[ 14.045466]@3 mtp_bind_config
1271<6>[ 14.048378]@3 mtp_create_bulk_endpoints: useFixAddr:false
1272<3>[ 14.621388]@2 QSEECOM: __qseecom_process_incomplete_cmd: fail:resp res= -65,app_id = 0,lstr = 12288
1273<6>[ 14.629479]@2 get_ice_device_from_storage_type: found ice device ffffffc1732dc200
1274<5>[ 14.728277]@0 random: nonblocking pool is initialized
1275<3>[ 14.763015]@2 QSEECOM: __qseecom_process_incomplete_cmd: fail:resp res= -71,app_id = 0,lstr = 12288
1276<3>[ 14.771045]@2 QSEECOM: __qseecom_set_clear_ce_key: process_incomplete_cmd FAILED, resp.result -71
1277<6>[ 14.779884]@2 get_ice_device_from_storage_type: found ice device ffffffc1732dc200
1278<3>[ 14.787897]@2 QSEECOM: qseecom_create_key: Failed to create key: pipe 2, ce 0: -22
1279<3>[ 14.794914]@2 QSEECOM: qseecom_ioctl: failed to create encryption key: -22
1280<4>[ 15.160140]@0 synap rmidev_create_attr
1281<4>[ 15.280227]@0 synap rmidev_create_attr
1282<3>[ 18.340054]@3 scm_call failed: func id 0x72000501, arginfo: 0x22, args: 0x1b4bab000, 0x1000, 0x0, 0x0, ret: -2, syscall returns: 0xffffffffffffffbf, 0x0, 0x0
1283<6>[ 18.353312]@3 get_ice_device_from_storage_type: found ice device ffffffc1732dc200
1284<6>[ 18.484093]@3 get_ice_device_from_storage_type: found ice device ffffffc1732dc200
1285<3>[ 18.491080]@3 QSEECOM: qseecom_create_key: Set the key successfully
1286<4>[ 18.496967]@3 audit_printk_skb: 42 callbacks suppressed
1287<5>[ 18.502188]@3 audit: type=1400 audit(2656198.819:26): avc: denied { read write } for pid=422 comm="recovery" name="device-mapper" dev="tmpfs" ino=10143 scontext=u:r:recovery:s0 tcontext=u:object_r:dm_device:s0 tclass=chr_file permissive=1
1288<5>[ 18.523413]@3 audit: type=1400 audit(2656198.849:27): avc: denied { open } for pid=422 comm="recovery" path="/dev/device-mapper" dev="tmpfs" ino=10143 scontext=u:r:recovery:s0 tcontext=u:object_r:dm_device:s0 tclass=chr_file permissive=1
1289<5>[ 18.544682]@3 audit: type=1400 audit(2656198.879:28): avc: denied { ioctl } for pid=422 comm="recovery" path="/dev/device-mapper" dev="tmpfs" ino=10143 ioctlcmd=fd03 scontext=u:r:recovery:s0 tcontext=u:object_r:dm_device:s0 tclass=chr_file permissive=1
1290<6>[ 18.567982]@3 device-mapper: req-crypt: req_crypt_ctr: Mapping block_device /dev/block/sda15 to dm-req-crypt ok!
1291<6>
1292<4>[ 18.577812]@3 device-mapper: table: 254:0: adding target device sda15 caused an alignment inconsistency: physical_block_size=16384, logical_block_size=4096, alignment_offset=0, start=0
1293<4>[ 18.593945]@3 device-mapper: table: 254:0: adding target device sda15 caused an alignment inconsistency: physical_block_size=16384, logical_block_size=4096, alignment_offset=0, start=0
1294<6>[ 18.810269]@3 msm_thermal:do_cluster_freq_ctrl Limiting CPU0 max frequency to 1363200. Temp:82
1295<6>[ 18.817858]@3 msm_thermal:do_cluster_freq_ctrl Limiting CPU1 max frequency to 1363200. Temp:82
1296<6>[ 18.826492]@3 msm_thermal:do_cluster_freq_ctrl Limiting CPU2 max frequency to 1977600. Temp:82
1297<6>[ 18.835261]@3 msm_thermal:do_cluster_freq_ctrl Limiting CPU3 max frequency to 1977600. Temp:82
1298<6>[ 18.890272]@3 msm_thermal:do_cluster_freq_ctrl Limiting CPU0 max frequency to 2188800. Temp:50
1299<6>[ 18.897861]@3 msm_thermal:do_cluster_freq_ctrl Limiting CPU1 max frequency to 2188800. Temp:50
1300<6>[ 18.906496]@3 msm_thermal:do_cluster_freq_ctrl Limiting CPU2 max frequency to 2342400. Temp:50
1301<6>[ 18.915083]@3 msm_thermal:do_cluster_freq_ctrl Limiting CPU3 max frequency to 2342400. Temp:50
1302<3>[ 19.962189]@3 F2FS-fs (dm-0): Unrecognized mount option "noatime" or missing value
1303<3>[ 19.968835]@3 F2FS-fs (dm-0): Unrecognized mount option "noatime" or missing value
1304<7>[19700131_17:50:00.422233]@3 SELinux: initialized (dev dm-0, type f2fs), uses xattr
1305<5>[19700131_17:50:00.422943]@3 audit: type=1400 audit(2656200.409:29): avc: denied { getattr } for pid=422 comm="recovery" path="/data/media" dev="dm-0" ino=303 scontext=u:r:recovery:s0 tcontext=u:object_r:media_rw_data_file:s0 tclass=dir permissive=1
1306<3>[19700131_17:50:00.481605]@3 F2FS-fs (dm-0): Unrecognized mount option "noatime" or missing value
1307<3>[19700131_17:50:00.489247]@3 F2FS-fs (dm-0): Unrecognized mount option "noatime" or missing value
1308<7>[19700131_17:50:00.541586]@3 SELinux: initialized (dev dm-0, type f2fs), uses xattr
1309<5>[19700131_17:50:00.552555]@3 audit: type=1400 audit(2656200.539:30): avc: denied { read } for pid=422 comm="recovery" name="/" dev="dm-0" ino=3 scontext=u:r:recovery:s0 tcontext=u:object_r:system_data_file:s0 tclass=dir permissive=1
1310<5>[19700131_17:50:00.572361]@3 audit: type=1400 audit(2656200.559:31): avc: denied { open } for pid=422 comm="recovery" path="/data" dev="dm-0" ino=3 scontext=u:r:recovery:s0 tcontext=u:object_r:system_data_file:s0 tclass=dir permissive=1
1311<5>[19700131_17:50:00.597115]@3 audit: type=1400 audit(2656200.589:32): avc: denied { getattr } for pid=422 comm="recovery" path="/data/bootchart" dev="dm-0" ino=5 scontext=u:r:recovery:s0 tcontext=u:object_r:bootchart_data_file:s0 tclass=dir permissive=1
1312<5>[19700131_17:50:00.618618]@3 audit: type=1400 audit(2656200.609:33): avc: denied { read } for pid=422 comm="recovery" name="bootchart" dev="dm-0" ino=5 scontext=u:r:recovery:s0 tcontext=u:object_r:bootchart_data_file:s0 tclass=dir permissive=1
1313<5>[19700131_17:50:00.639955]@3 audit: type=1400 audit(2656200.629:34): avc: denied { open } for pid=422 comm="recovery" path="/data/bootchart" dev="dm-0" ino=5 scontext=u:r:recovery:s0 tcontext=u:object_r:bootchart_data_file:s0 tclass=dir permissive=1
1314<5>[19700131_17:50:00.666673]@3 audit: type=1400 audit(2656200.659:35): avc: denied { getattr } for pid=422 comm="recovery" path="/data/misc/bluedroid" dev="dm-0" ino=9 scontext=u:r:recovery:s0 tcontext=u:object_r:bluetooth_data_file:s0 tclass=dir permissive=1
1315<6>[19700131_17:50:00.728329]@2 SELinux: Context u:object_r:audioserver_data_file:s0 is not valid (left unmapped).
1316<6>[19700131_17:50:00.739757]@2 SELinux: Context u:object_r:boottrace_data_file:s0 is not valid (left unmapped).
1317<6>[19700131_17:50:00.749034]@2 SELinux: Context u:object_r:update_engine_data_file:s0 is not valid (left unmapped).
1318<6>[19700131_17:50:00.759172]@2 SELinux: Context u:object_r:method_trace_data_file:s0 is not valid (left unmapped).
1319<6>[19700131_17:50:00.769584]@2 SELinux: Context u:object_r:user_profile_data_file:s0 is not valid (left unmapped).
1320<6>[19700131_17:50:00.779774]@2 SELinux: Context u:object_r:user_profile_foreign_dex_data_file:s0 is not valid (left unmapped).
1321<6>[19700131_17:50:00.790793]@2 SELinux: Context u:object_r:user_profile_foreign_dex_data_file:s0:c512,c768 is not valid (left unmapped).
1322<6>[19700131_17:50:01.275473]@1 SELinux: Context u:object_r:profman_dump_data_file:s0 is not valid (left unmapped).
1323<6>[19700131_17:50:01.287989]@1 SELinux: Context u:object_r:qfp-daemon_data_file:s0 is not valid (left unmapped).
1324<6>[19700131_17:50:01.302174]@0 SELinux: Context u:object_r:data_qsee_file:s0 is not valid (left unmapped).
1325<6>[19700131_17:50:01.317895]@1 SELinux: Context u:object_r:ipacm_data_file:s0 is not valid (left unmapped).
1326<6>[19700131_17:50:01.328319]@1 SELinux: Context u:object_r:port_bridge_data_file:s0 is not valid (left unmapped).
1327<6>[19700131_17:50:01.340065]@0 SELinux: Context u:object_r:data_test_data_file:s0 is not valid (left unmapped).
1328<6>[19700131_17:50:01.357648]@1 SELinux: Context u:object_r:display_misc_file:s0 is not valid (left unmapped).
1329<6>[19700131_17:50:01.367936]@1 SELinux: Context u:object_r:location_data_file:s0 is not valid (left unmapped).
1330<6>[19700131_17:50:01.379290]@0 SELinux: Context u:object_r:location_socket:s0 is not valid (left unmapped).
1331<6>[19700131_17:50:01.394545]@1 SELinux: Context u:object_r:fm_data_file:s0 is not valid (left unmapped).
1332<6>[19700131_17:50:01.404043]@1 SELinux: Context u:object_r:RIDL_data_file:s0 is not valid (left unmapped).
1333<6>[19700131_17:50:01.416507]@1 SELinux: Context u:object_r:RIDL_socket:s0 is not valid (left unmapped).
1334<6>[19700131_17:50:01.428420]@1 SELinux: Context u:object_r:iop_data_file:s0 is not valid (left unmapped).
1335<6>[19700131_17:50:01.438040]@1 SELinux: Context u:object_r:qti_logkit_priv_data_file:s0 is not valid (left unmapped).
1336<6>[19700131_17:50:01.448902]@1 SELinux: Context u:object_r:qti_logkit_pub_data_file:s0 is not valid (left unmapped).
1337<6>[19700131_17:50:01.459058]@1 SELinux: Context u:object_r:qti_logkit_priv_socket:s0 is not valid (left unmapped).
1338<6>[19700131_17:50:01.468876]@1 SELinux: Context u:object_r:qti_logkit_pub_socket:s0 is not valid (left unmapped).
1339<6>[19700131_17:50:01.479806]@0 SELinux: Context u:object_r:wapi_data_file:s0 is not valid (left unmapped).
1340<6>[19700131_17:50:01.489132]@0 SELinux: Context u:object_r:dts_data_file:s0 is not valid (left unmapped).
1341<6>[19700131_17:50:01.500327]@0 SELinux: Context u:object_r:seemp_file:s0 is not valid (left unmapped).
1342<6>[19700131_17:50:01.509796]@0 SELinux: Context u:object_r:tlocd_data_file:s0 is not valid (left unmapped).
1343<6>[19700131_17:50:01.519215]@0 SELinux: Context u:object_r:qvop_data_file:s0 is not valid (left unmapped).
1344<6>[19700131_17:50:01.528382]@1 SELinux: Context u:object_r:qvrd_data_file:s0 is not valid (left unmapped).
1345<6>[19700131_17:50:01.537641]@1 SELinux: Context u:object_r:audio_pp_data_file:s0 is not valid (left unmapped).
1346<6>[19700131_17:50:01.547187]@1 SELinux: Context u:object_r:bootstat_data_file:s0 is not valid (left unmapped).
1347<6>[19700131_17:50:01.839811]@1 SELinux: Context u:object_r:qsee_svc_app_data_file:s0 is not valid (left unmapped).
1348<6>[19700131_17:50:03.107931]@1 SELinux: Context u:object_r:ota_data_file:s0 is not valid (left unmapped).
1349<6>[19700131_17:50:03.155350]@1 SELinux: Context u:object_r:mpctl_data_file:s0 is not valid (left unmapped).
1350<6>[19700131_17:50:03.165875]@1 SELinux: Context u:object_r:swap_data_file:s0 is not valid (left unmapped).
1351<6>[19700131_17:50:03.226299]@1 SELinux: Context u:object_r:ringtone_file:s0 is not valid (left unmapped).
1352<6>[19700131_17:50:03.564499]@1 SELinux: Context u:object_r:cnd_data_file:s0 is not valid (left unmapped).
1353<6>[19700131_17:50:03.575543]@1 SELinux: Context u:object_r:dpmd_data_file:s0 is not valid (left unmapped).
1354<6>[19700131_17:50:03.588695]@1 SELinux: Context u:object_r:time_data_file:s0 is not valid (left unmapped).
1355<6>[19700131_17:50:03.611576]@2 SELinux: Context u:object_r:oem_data_file:s0 is not valid (left unmapped).
1356<6>[19700131_17:50:03.624326]@2 SELinux: Context u:object_r:fpc_images_file:s0 is not valid (left unmapped).
1357<6>[19700131_17:50:03.637261]@2 SELinux: Context u:object_r:fpc_data_file:s0 is not valid (left unmapped).
1358<6>[19700131_17:50:03.647854]@0 SELinux: Context u:object_r:coredump_data_file:s0 is not valid (left unmapped).
1359<6>[19700131_17:50:03.658723]@0 SELinux: Context u:object_r:theme_data_file:s0 is not valid (left unmapped).
1360<6>[19700131_17:50:03.671192]@0 SELinux: Context u:object_r:usf_data_file:s0 is not valid (left unmapped).
1361<3>[19700131_17:50:03.855604]@2 F2FS-fs (dm-0): Unrecognized mount option "noatime" or missing value
1362<3>[19700131_17:50:03.863231]@2 F2FS-fs (dm-0): Unrecognized mount option "noatime" or missing value
1363<7>[19700131_17:50:03.911192]@3 SELinux: initialized (dev dm-0, type f2fs), uses xattr
1364<6>[19700131_17:50:03.932656]@3 EXT4-fs (sde20): mounted filesystem with ordered data mode. Opts:
1365<7>[19700131_17:50:03.940308]@3 SELinux: initialized (dev sde20, type ext4), uses xattr
1366<4>[19700131_17:50:06.986923]@2 audit_printk_skb: 411 callbacks suppressed
1367<5>[19700131_17:50:06.992242]@2 audit: type=1400 audit(2656206.979:173): avc: denied { read } for pid=422 comm="recovery" name="0" dev="dm-0" ino=131 scontext=u:r:recovery:s0 tcontext=u:object_r:media_rw_data_file:s0 tclass=dir permissive=1
1368<5>[19700131_17:50:07.013317]@2 audit: type=1400 audit(2656207.009:174): avc: denied { open } for pid=422 comm="recovery" path="/sdcard" dev="dm-0" ino=131 scontext=u:r:recovery:s0 tcontext=u:object_r:media_rw_data_file:s0 tclass=dir permissive=1
1369<5>[19700131_17:50:07.038909]@2 audit: type=1400 audit(2656207.029:175): avc: denied { getattr } for pid=422 comm="recovery" path="/sdcard/Music" dev="dm-0" ino=3481 scontext=u:r:recovery:s0 tcontext=u:object_r:media_rw_data_file:s0:c512,c768 tclass=dir permissive=1
1370<5>[19700131_17:50:07.069114]@2 audit: type=1400 audit(2656207.059:176): avc: denied { getattr } for pid=422 comm="recovery" path="/sdcard/twrp-3.0.3-1-unified-test1-oneplus3.img" dev="dm-0" ino=3482 scontext=u:r:recovery:s0 tcontext=u:object_r:media_rw_data_file:s0 tclass=file permissive=1
1371<5>[19700131_17:50:07.478727]@2 audit: type=1400 audit(2656207.469:177): avc: denied { read } for pid=422 comm="recovery" name=".twrps" dev="dm-0" ino=3496 scontext=u:r:recovery:s0 tcontext=u:object_r:media_rw_data_file:s0 tclass=file permissive=1
1372<5>[19700131_17:50:07.499365]@2 audit: type=1400 audit(2656207.489:178): avc: denied { open } for pid=422 comm="recovery" path="/data/media/0/TWRP/.twrps" dev="dm-0" ino=3496 scontext=u:r:recovery:s0 tcontext=u:object_r:media_rw_data_file:s0 tclass=file permissive=1
1373<5>[19700131_17:50:07.532476]@2 audit: type=1400 audit(2656207.519:179): avc: denied { sys_time } for pid=422 comm="recovery" capability=25 scontext=u:r:recovery:s0 tcontext=u:r:recovery:s0 tclass=capability permissive=1
1374<6>[20170121_02:11:44.539654]@3 EXT4-fs (sde20): mounted filesystem with ordered data mode. Opts:
1375<7>[20170121_02:11:44.547092]@3 SELinux: initialized (dev sde20, type ext4), uses xattr
1376<5>[20170121_02:11:44.552089]@2 audit: type=1400 audit(1484964704.546:180): avc: denied { create } for pid=422 comm="recovery" name="orsin" scontext=u:r:recovery:s0 tcontext=u:object_r:rootfs:s0 tclass=fifo_file permissive=1
1377<5>[20170121_02:11:44.570741]@2 audit: type=1400 audit(1484964704.556:181): avc: denied { read } for pid=422 comm="recovery" name="orsin" dev="rootfs" ino=15058 scontext=u:r:recovery:s0 tcontext=u:object_r:rootfs:s0 tclass=fifo_file permissive=1
1378<5>[20170121_02:11:44.592149]@2 audit: type=1400 audit(1484964704.586:182): avc: denied { open } for pid=422 comm="recovery" path="/sbin/orsin" dev="rootfs" ino=15058 scontext=u:r:recovery:s0 tcontext=u:object_r:rootfs:s0 tclass=fifo_file permissive=1
1379<6>[20170121_02:11:45.328600]@3 mtp_open
1380<3>[20170121_02:11:49.721702]@0 synaptics,s3320: start get base data:1
1381<3>[20170121_02:11:49.726732]@0 synaptics,s3320: tp_baseline_get start!
1382<3>[20170121_02:11:49.862137]@0 synaptics,s3320: synaptics_tpedge_limitfunc limit_enable =1,mode:0x4b !
1383<3>[20170121_02:11:49.870370]@0 synaptics,s3320: tp_baseline_get end!
1384<3>[20170121_02:11:49.876655]@0 synaptics,s3320: enter reset tp status,and ts->in_gesture_mode is:0
1385<3>[20170121_02:11:49.884552]@0 synaptics,s3320: synaptics_init_panel is called!
1386<3>[20170121_02:11:49.892176]@0 synaptics,s3320: synaptics_mode_change: set TP to mode[0x80]
1387<3>[20170121_02:11:53.154088]@0 synaptics,s3320: all finger up
1388<4>[20170121_02:11:57.601968]@2 audit_printk_skb: 6 callbacks suppressed
1389<5>[20170121_02:11:57.607114]@2 audit: type=1400 audit(1484964717.596:185): avc: denied { write } for pid=422 comm="recovery" name="0" dev="dm-0" ino=131 scontext=u:r:recovery:s0 tcontext=u:object_r:media_rw_data_file:s0 tclass=dir permissive=1
1390<5>[20170121_02:11:57.628493]@2 audit: type=1400 audit(1484964717.616:186): avc: denied { add_name } for pid=422 comm="recovery" name="recovery.log" scontext=u:r:recovery:s0 tcontext=u:object_r:media_rw_data_file:s0 tclass=dir permissive=1
1391<5>[20170121_02:11:57.649428]@2 audit: type=1400 audit(1484964717.646:187): avc: denied { create } for pid=422 comm="recovery" name="recovery.log" scontext=u:r:recovery:s0 tcontext=u:object_r:media_rw_data_file:s0 tclass=file permissive=1
1392<5>[20170121_02:11:57.670386]@2 audit: type=1400 audit(1484964717.656:188): avc: denied { write } for pid=422 comm="recovery" path="/data/media/0/recovery.log" dev="dm-0" ino=8219 scontext=u:r:recovery:s0 tcontext=u:object_r:media_rw_data_file:s0 tclass=file permissive=1
1393<5>[20170121_02:11:57.694422]@2 audit: type=1400 audit(1484964717.686:189): avc: denied { setattr } for pid=422 comm="recovery" name="recovery.log" dev="dm-0" ino=8219 scontext=u:r:recovery:s0 tcontext=u:object_r:media_rw_data_file:s0 tclass=file permissive=1
1394<5>[20170121_02:11:57.716671]@2 audit: type=1400 audit(1484964717.706:190): avc: denied { relabelfrom } for pid=422 comm="recovery" name="recovery.log" dev="dm-0" ino=8219 scontext=u:r:recovery:s0 tcontext=u:object_r:media_rw_data_file:s0 tclass=file permissive=1
1395<5>[20170121_02:11:57.739640]@2 audit: type=1400 audit(1484964717.736:191): avc: denied { relabelto } for pid=422 comm="recovery" name="recovery.log" dev="dm-0" ino=8219 scontext=u:r:recovery:s0 tcontext=u:object_r:media_rw_data_file:s0 tclass=file permissive=1