· 9 years ago · Oct 26, 2016, 08:40 PM
1Toben.Archer@NI6307 MINGW64 /c/development/source/myu (myu)
2$ ant initdb
3Buildfile: C:\development\source\myu\build.xml
4
5prodPrompt:
6
7initdb:
8 [echo] Initializing database
9
10prodPrompt:
11
12db:
13 [echo] Creating DBLoader Script
14
15up-shell:
16
17prodPrompt:
18
19db-hibernate:
20
21prodPrompt:
22
23db-hibernate-portal:
24 [echo] Creating HBM2DDL Script
25
26up-shell:
27
28prodPrompt:
29
30db-hibernate-raw-events:
31
32prodPrompt:
33
34db-hibernate-portal:
35 [echo] Creating HBM2DDL Script
36
37up-shell:
38
39prodPrompt:
40
41db-hibernate-aggr-events:
42
43prodPrompt:
44
45db-hibernate-portal:
46 [echo] Creating HBM2DDL Script
47
48up-shell:
49
50prodPrompt:
51
52db-hibernate-portlets:
53 [echo] Creating tables for bundled portlets [skipPackage=${skipPackage}]
54
55mvn:
56 [echo] Running mvn in C:\development\source\myu/uportal-portlets-overlay for goals: package db-init -Djasig.ignore
57 [exec] [INFO] Scanning for projects...
58 [exec] [INFO] ------------------------------------------------------------------------
59 [exec] [INFO] Reactor Build Order:
60 [exec] [INFO]
61 [exec] [INFO] uPortal Portlets
62 [exec] [INFO] Announcements Portlet
63 [exec] [INFO] Basic LTI Portlet
64 [exec] [INFO] Bookmarks Portlet
65 [exec] [INFO] Calendar Portlet
66 [exec] [INFO] CAS Proxy Test Portlet
67 [exec] [INFO] Email Preview Portlet
68 [exec] [INFO] Functional Tests Portlet
69 [exec] [INFO] Jasig Widget Portlets
70 [exec] [INFO] Pluto Test Suite Portlet
71 [exec] [INFO] News Reader Portlet
72 [exec] [INFO] Jasig Notification Portlet
73 [exec] [INFO] Sakai Connector Portlet
74 [exec] [INFO] Simple Content Portlet
75 [exec] [INFO] Weather Portlet
76 [exec] [INFO] Web Proxy Portlet
77 [exec] [INFO]
78 [exec] [INFO] ------------------------------------------------------------------------
79 [exec] [INFO] Building uPortal Portlets 4.3.1-SNAPSHOT
80 [exec] [INFO] ------------------------------------------------------------------------
81 [exec] [INFO]
82 [exec] [INFO] --- maven-enforcer-plugin:1.2:enforce (enforce-maven) @ uportal-portlets-overlay ---
83 [exec] [INFO]
84 [exec] [INFO] --- maven-enforcer-plugin:1.2:enforce (enforce-versions) @ uportal-portlets-overlay ---
85 [exec] [INFO]
86 [exec] [INFO] --- maven-site-plugin:3.4:attach-descriptor (attach-descriptor) @ uportal-portlets-overlay ---
87 [exec] [INFO]
88 [exec] [INFO] ------------------------------------------------------------------------
89 [exec] [INFO] Building Announcements Portlet 4.3.1-SNAPSHOT
90 [exec] [INFO] ------------------------------------------------------------------------
91 [exec] [INFO]
92 [exec] [INFO] --- maven-enforcer-plugin:1.2:enforce (enforce-maven) @ Announcements ---
93 [exec] [INFO]
94 [exec] [INFO] --- maven-enforcer-plugin:1.2:enforce (enforce-versions) @ Announcements ---
95 [exec] [INFO]
96 [exec] [INFO] --- maven-resources-plugin:2.6:resources (default-resources) @ Announcements ---
97 [exec] [INFO] Using 'UTF-8' encoding to copy filtered resources.
98 [exec] [INFO] Copying 0 resource
99 [exec] [INFO] Copying 2 resources
100 [exec] [INFO]
101 [exec] [INFO] --- maven-compiler-plugin:3.0:compile (default-compile) @ Announcements ---
102 [exec] [INFO] No sources to compile
103 [exec] [INFO]
104 [exec] [INFO] --- maven-resources-plugin:2.6:testResources (default-testResources) @ Announcements ---
105 [exec] [INFO] Using 'UTF-8' encoding to copy filtered resources.
106 [exec] [INFO] skip non existing resourceDirectory C:\development\source\myu\uportal-portlets-overlay\AnnouncementsPortlet\src\test\resources
107 [exec] [INFO]
108 [exec] [INFO] --- maven-compiler-plugin:3.0:testCompile (default-testCompile) @ Announcements ---
109 [exec] [INFO] No sources to compile
110 [exec] [INFO]
111 [exec] [INFO] --- maven-surefire-plugin:2.13:test (default-test) @ Announcements ---
112 [exec] [INFO] No tests to run.
113 [exec] [INFO]
114 [exec] [INFO] --- maven-war-plugin:2.3:war (default-war) @ Announcements ---
115 [exec] [INFO] Packaging webapp
116 [exec] [INFO] Assembling webapp [Announcements] in [C:\development\source\myu\uportal-portlets-overlay\AnnouncementsPortlet\target\Announcements]
117 [exec] [INFO] Processing war project
118 [exec] [INFO] Copying webapp resources [C:\development\source\myu\uportal-portlets-overlay\AnnouncementsPortlet\src\main\webapp]
119 [exec] [INFO] Processing overlay [ id org.jasig.portlet:Announcements]
120 [exec] [INFO] Webapp assembled in [14909 msecs]
121 [exec] [INFO] Building war: C:\development\source\myu\uportal-portlets-overlay\AnnouncementsPortlet\target\Announcements.war
122 [exec] [WARNING] Warning: selected war files include a META-INF/INDEX.LIST which will be replaced by a newly generated one.
123 [exec] [INFO] Packaging classes
124 [exec] [INFO] Building jar: C:\development\source\myu\uportal-portlets-overlay\AnnouncementsPortlet\target\Announcements-classes.jar
125 [exec] [INFO]
126 [exec] [INFO] --- maven-site-plugin:3.4:attach-descriptor (attach-descriptor) @ Announcements ---
127 [exec] [INFO]
128 [exec] [INFO] --- maven-pluto-plugin:2.1.0-M3:assemble (default) @ Announcements ---
129 [exec] [INFO] Assembling archive file C:\development\source\myu\uportal-portlets-overlay\AnnouncementsPortlet\target\Announcements.war to directory C:\development\source\myu\uportal-portlets-overlay\AnnouncementsPortlet\target
130 [exec] [INFO]
131 [exec] [INFO] >>> hibernate3-maven-plugin:2.2:hbm2ddl (default) > process-resources @ Announcements >>>
132 [exec] [INFO]
133 [exec] [INFO] --- maven-enforcer-plugin:1.2:enforce (enforce-maven) @ Announcements ---
134 [exec] [INFO]
135 [exec] [INFO] --- maven-enforcer-plugin:1.2:enforce (enforce-versions) @ Announcements ---
136 [exec] [INFO]
137 [exec] [INFO] --- maven-resources-plugin:2.6:resources (default-resources) @ Announcements ---
138 [exec] [INFO] Using 'UTF-8' encoding to copy filtered resources.
139 [exec] [INFO] Copying 0 resource
140 [exec] [INFO] Copying 2 resources
141 [exec] [INFO]
142 [exec] [INFO] <<< hibernate3-maven-plugin:2.2:hbm2ddl (default) < process-resources @ Announcements <<<
143 [exec] [INFO]
144 [exec] [INFO] --- hibernate3-maven-plugin:2.2:hbm2ddl (default) @ Announcements ---
145 [exec] [INFO] Downloading: http://snapshots.repository.codehaus.org/org/jasig/portal/uportal-db/4.3.1-SNAPSHOT/maven-metadata.xml
146 [exec] [WARNING] Could not transfer metadata org.jasig.portal:uportal-db:4.3.1-SNAPSHOT/maven-metadata.xml from/to codehaus.org (http://snapshots.repository.codehaus.org): snapshots.repository.codehaus.org
147 [exec] [INFO] Hibernate 3.3.1.GA
148 [exec] [INFO] hibernate.properties not found
149 [exec] [INFO] Bytecode provider name : javassist
150 [exec] [INFO] using JDK 1.4 java.sql.Timestamp handling
151 [exec] [INFO] Configuration XML file loaded: jar:file:/C:/Users/toben.archer/.m2/repository/org/jasig/portlet/Announcements/2.2.0-M2/Announcements-2.2.0-M2-classes.jar!/hibernate.cfg.xml
152 [exec] [INFO] configuring from url: jar:file:/C:/Users/toben.archer/.m2/repository/org/jasig/portlet/Announcements/2.2.0-M2/Announcements-2.2.0-M2-classes.jar!/hibernate.cfg.xml
153 [exec] [INFO] Reading mappings from resource : hibernate-mappings/Announcement.hbm.xml
154 [exec] [INFO] Mapping class: org.jasig.portlet.announcements.model.Announcement -> ANNOUNCEMENT
155 [exec] [INFO] Mapping collection: org.jasig.portlet.announcements.model.Announcement.attachments -> ANNOUNCEMENT_ATTACHMENT
156 [exec] [INFO] Reading mappings from resource : hibernate-mappings/Topic.hbm.xml
157 [exec] [INFO] Mapping class: org.jasig.portlet.announcements.model.Topic -> TOPIC
158 [exec] [INFO] Mapping collection: org.jasig.portlet.announcements.model.Topic.audience -> AUDIENCE
159 [exec] [INFO] Mapping collection: org.jasig.portlet.announcements.model.Topic.admins -> ADMINS
160 [exec] [INFO] Mapping collection: org.jasig.portlet.announcements.model.Topic.authors -> AUTHORS
161 [exec] [INFO] Mapping collection: org.jasig.portlet.announcements.model.Topic.moderators -> MODERATORS
162 [exec] [INFO] Reading mappings from resource : hibernate-mappings/TopicSubscription.hbm.xml
163 [exec] [INFO] Mapping class: org.jasig.portlet.announcements.model.TopicSubscription -> SUBSCRIPTION
164 [exec] [INFO] Configured SessionFactory: null
165 [exec] [INFO] Configuration Properties file loaded: C:\development\source\myu\uportal-portlets-overlay\AnnouncementsPortlet\target\Announcements\WEB-INF\classes\datasource.properties
166 [exec] [INFO] Mapping collection: org.jasig.portlet.announcements.model.Topic.announcements -> ANNOUNCEMENT
167 [exec] [INFO] Mapping collection: org.jasig.portlet.announcements.model.Topic.subscriptions -> SUBSCRIPTION
168 [exec] [INFO] Using dialect: org.hibernate.dialect.HSQLDialect
169 [exec] [INFO] Running hbm2ddl schema export
170 [exec] [INFO] exporting generated schema to database
171 [exec] [INFO] Using Hibernate built-in connection pool (not for production use!)
172 [exec] [INFO] Hibernate connection pool size: 20
173 [exec] [INFO] autocommit mode: false
174 [exec] [INFO] using driver: org.hsqldb.jdbc.JDBCDriver at URL: jdbc:hsqldb:hsql://localhost:8887/uPortal
175 [exec] [INFO] connection properties: {validationQuery=select 1 from INFORMATION_SCHEMA.SYSTEM_USERS, user=sa, password=****}
176 [exec] alter table ADMINS drop constraint FK72CD5B047D994F46;
177 [exec] alter table ANNOUNCEMENT drop constraint FK937735477D994F46;
178 [exec] alter table ANNOUNCEMENT_ATTACHMENT drop constraint FK3E6A231BF93D1933;
179 [exec] alter table AUDIENCE drop constraint FK68CCDA047D994F46;
180 [exec] alter table AUTHORS drop constraint FK4429C287D994F46;
181 [exec] alter table MODERATORS drop constraint FKA4BBE80E7D994F46;
182 [exec] alter table SUBSCRIPTION drop constraint FK9E75411DC92380A1;
183 [exec] drop table ADMINS if exists;
184 [exec] drop table ANNOUNCEMENT if exists;
185 [exec] drop table ANNOUNCEMENT_ATTACHMENT if exists;
186 [exec] drop table AUDIENCE if exists;
187 [exec] drop table AUTHORS if exists;
188 [exec] drop table MODERATORS if exists;
189 [exec] drop table SUBSCRIPTION if exists;
190 [exec] drop table TOPIC if exists;
191 [exec] create table ADMINS (PARENT_ID bigint not null, ADMIN varchar(255));
192 [exec] create table ANNOUNCEMENT (ANN_ID bigint generated by default as identity (start with 1), TITLE longvarchar, ABSTRACT longvarchar, CREATED timestamp, START_DISPLAY timestamp, END_DISPLAY timestamp, MESSAGE longvarchar, AUTHOR varchar(255), LINK varchar(255), PUBLISHED bit not null, PARENT_ID bigint, primary key (ANN_ID));
193 [exec] create table ANNOUNCEMENT_ATTACHMENT (ANNOUNCEMENT_ID bigint not null, ATTACHMENT_INFO varchar(255));
194 [exec] create table AUDIENCE (PARENT_ID bigint not null, AUDIENCE_MEMBER varchar(255));
195 [exec] create table AUTHORS (PARENT_ID bigint not null, AUTHOR varchar(255));
196 [exec] create table MODERATORS (PARENT_ID bigint not null, MODERATOR varchar(255));
197 [exec] create table SUBSCRIPTION (SUB_ID bigint generated by default as identity (start with 1), TOPIC_ID bigint, OWNER_ID varchar(255), SUBSCRIBED bit, primary key (SUB_ID));
198 [exec] create table TOPIC (TOPIC_ID bigint generated by default as identity (start with 1), TITLE longvarchar, DESCRP longvarchar, CREATED_BY varchar(255), ALLOW_RSS bit, SUB_METHOD integer, primary key (TOPIC_ID));
199 [exec] alter table ADMINS add constraint FK72CD5B047D994F46 foreign key (PARENT_ID) references TOPIC;
200 [exec] alter table ANNOUNCEMENT add constraint FK937735477D994F46 foreign key (PARENT_ID) references TOPIC;
201 [exec] alter table ANNOUNCEMENT_ATTACHMENT add constraint FK3E6A231BF93D1933 foreign key (ANNOUNCEMENT_ID) references ANNOUNCEMENT;
202 [exec] alter table AUDIENCE add constraint FK68CCDA047D994F46 foreign key (PARENT_ID) references TOPIC;
203 [exec] alter table AUTHORS add constraint FK4429C287D994F46 foreign key (PARENT_ID) references TOPIC;
204 [exec] alter table MODERATORS add constraint FKA4BBE80E7D994F46 foreign key (PARENT_ID) references TOPIC;
205 [exec] alter table SUBSCRIPTION add constraint FK9E75411DC92380A1 foreign key (TOPIC_ID) references TOPIC;
206 [exec] [INFO] schema export complete
207 [exec] [INFO] cleaning up connection pool: jdbc:hsqldb:hsql://localhost:8887/uPortal
208 [exec] [INFO]
209 [exec] [INFO] ------------------------------------------------------------------------
210 [exec] [INFO] Building Basic LTI Portlet 4.3.1-SNAPSHOT
211 [exec] [INFO] ------------------------------------------------------------------------
212 [exec] [INFO]
213 [exec] [INFO] --- maven-enforcer-plugin:1.2:enforce (enforce-maven) @ basiclti-portlet ---
214 [exec] [INFO]
215 [exec] [INFO] --- maven-enforcer-plugin:1.2:enforce (enforce-versions) @ basiclti-portlet ---
216 [exec] [INFO]
217 [exec] [INFO] --- maven-resources-plugin:2.6:resources (default-resources) @ basiclti-portlet ---
218 [exec] [INFO] Using 'UTF-8' encoding to copy filtered resources.
219 [exec] [INFO] skip non existing resourceDirectory C:\development\source\myu\uportal-portlets-overlay\basiclti-portlet\src\main\resources
220 [exec] [INFO]
221 [exec] [INFO] --- maven-compiler-plugin:3.0:compile (default-compile) @ basiclti-portlet ---
222 [exec] [INFO] No sources to compile
223 [exec] [INFO]
224 [exec] [INFO] --- maven-resources-plugin:2.6:testResources (default-testResources) @ basiclti-portlet ---
225 [exec] [INFO] Using 'UTF-8' encoding to copy filtered resources.
226 [exec] [INFO] skip non existing resourceDirectory C:\development\source\myu\uportal-portlets-overlay\basiclti-portlet\src\test\resources
227 [exec] [INFO]
228 [exec] [INFO] --- maven-compiler-plugin:3.0:testCompile (default-testCompile) @ basiclti-portlet ---
229 [exec] [INFO] No sources to compile
230 [exec] [INFO]
231 [exec] [INFO] --- maven-surefire-plugin:2.13:test (default-test) @ basiclti-portlet ---
232 [exec] [INFO] No tests to run.
233 [exec] [INFO]
234 [exec] [INFO] --- maven-war-plugin:2.3:war (default-war) @ basiclti-portlet ---
235 [exec] [INFO] Packaging webapp
236 [exec] [INFO] Assembling webapp [basiclti-portlet] in [C:\development\source\myu\uportal-portlets-overlay\basiclti-portlet\target\basiclti-portlet]
237 [exec] [INFO] Processing war project
238 [exec] [INFO] Copying webapp webResources [C:\development\source\myu\uportal-portlets-overlay\basiclti-portlet/src/main/webapp/WEB-INF] to [C:\development\source\myu\uportal-portlets-overlay\basiclti-portlet\target\basiclti-portlet]
239 [exec] [INFO] Copying webapp resources [C:\development\source\myu\uportal-portlets-overlay\basiclti-portlet\src\main\webapp]
240 [exec] [INFO] Processing overlay [ id org.jasig.portlet:basiclti-portlet]
241 [exec] [INFO] Webapp assembled in [1615 msecs]
242 [exec] [INFO] Building war: C:\development\source\myu\uportal-portlets-overlay\basiclti-portlet\target\basiclti-portlet.war
243 [exec] [WARNING] Warning: selected war files include a META-INF/INDEX.LIST which will be replaced by a newly generated one.
244 [exec] [INFO] Packaging classes
245 [exec] [INFO] Building jar: C:\development\source\myu\uportal-portlets-overlay\basiclti-portlet\target\basiclti-portlet-classes.jar
246 [exec] [INFO]
247 [exec] [INFO] --- maven-site-plugin:3.4:attach-descriptor (attach-descriptor) @ basiclti-portlet ---
248 [exec] [INFO]
249 [exec] [INFO] --- maven-pluto-plugin:2.1.0-M3:assemble (default) @ basiclti-portlet ---
250 [exec] [INFO] Assembling archive file C:\development\source\myu\uportal-portlets-overlay\basiclti-portlet\target\basiclti-portlet.war to directory C:\development\source\myu\uportal-portlets-overlay\basiclti-portlet\target
251 [exec] [INFO]
252 [exec] [INFO] ------------------------------------------------------------------------
253 [exec] [INFO] Building Bookmarks Portlet 4.3.1-SNAPSHOT
254 [exec] [INFO] ------------------------------------------------------------------------
255 [exec] [INFO]
256 [exec] [INFO] --- maven-enforcer-plugin:1.2:enforce (enforce-maven) @ BookmarksPortlet ---
257 [exec] [INFO]
258 [exec] [INFO] --- maven-enforcer-plugin:1.2:enforce (enforce-versions) @ BookmarksPortlet ---
259 [exec] [INFO]
260 [exec] [INFO] --- maven-resources-plugin:2.6:resources (default-resources) @ BookmarksPortlet ---
261 [exec] [INFO] Using 'UTF-8' encoding to copy filtered resources.
262 [exec] [INFO] Copying 0 resource
263 [exec] [INFO] Copying 1 resource
264 [exec] [INFO]
265 [exec] [INFO] --- maven-compiler-plugin:3.0:compile (default-compile) @ BookmarksPortlet ---
266 [exec] [INFO] No sources to compile
267 [exec] [INFO]
268 [exec] [INFO] --- maven-resources-plugin:2.6:testResources (default-testResources) @ BookmarksPortlet ---
269 [exec] [INFO] Using 'UTF-8' encoding to copy filtered resources.
270 [exec] [INFO] skip non existing resourceDirectory C:\development\source\myu\uportal-portlets-overlay\BookmarksPortlet\src\test\resources
271 [exec] [INFO]
272 [exec] [INFO] --- maven-compiler-plugin:3.0:testCompile (default-testCompile) @ BookmarksPortlet ---
273 [exec] [INFO] No sources to compile
274 [exec] [INFO]
275 [exec] [INFO] --- maven-surefire-plugin:2.13:test (default-test) @ BookmarksPortlet ---
276 [exec] [INFO] No tests to run.
277 [exec] [INFO]
278 [exec] [INFO] --- maven-war-plugin:2.3:war (default-war) @ BookmarksPortlet ---
279 [exec] [INFO] Packaging webapp
280 [exec] [INFO] Assembling webapp [BookmarksPortlet] in [C:\development\source\myu\uportal-portlets-overlay\BookmarksPortlet\target\BookmarksPortlet]
281 [exec] [INFO] Processing war project
282 [exec] [INFO] Copying webapp webResources [C:\development\source\myu\uportal-portlets-overlay\BookmarksPortlet/src/main/webapp/WEB-INF] to [C:\development\source\myu\uportal-portlets-overlay\BookmarksPortlet\target\BookmarksPortlet]
283 [exec] [INFO] Copying webapp resources [C:\development\source\myu\uportal-portlets-overlay\BookmarksPortlet\src\main\webapp]
284 [exec] [INFO] Processing overlay [ id org.jasig.portlet:BookmarksPortlet]
285 [exec] [INFO] Webapp assembled in [6085 msecs]
286 [exec] [INFO] Building war: C:\development\source\myu\uportal-portlets-overlay\BookmarksPortlet\target\BookmarksPortlet.war
287 [exec] [WARNING] Warning: selected war files include a META-INF/INDEX.LIST which will be replaced by a newly generated one.
288 [exec] [INFO] Packaging classes
289 [exec] [INFO] Building jar: C:\development\source\myu\uportal-portlets-overlay\BookmarksPortlet\target\BookmarksPortlet-classes.jar
290 [exec] [INFO]
291 [exec] [INFO] --- maven-site-plugin:3.4:attach-descriptor (attach-descriptor) @ BookmarksPortlet ---
292 [exec] [INFO]
293 [exec] [INFO] --- maven-pluto-plugin:2.1.0-M3:assemble (default) @ BookmarksPortlet ---
294 [exec] [INFO] Assembling archive file C:\development\source\myu\uportal-portlets-overlay\BookmarksPortlet\target\BookmarksPortlet.war to directory C:\development\source\myu\uportal-portlets-overlay\BookmarksPortlet\target
295 [exec] [INFO]
296 [exec] [INFO] ------------------------------------------------------------------------
297 [exec] [INFO] Building Calendar Portlet 4.3.1-SNAPSHOT
298 [exec] [INFO] ------------------------------------------------------------------------
299 [exec] [INFO] Downloading: file://C:\development\source\myu\uportal-portlets-overlay\CalendarPortlet/3rd-party/repository/org/jasig/portal/uportal-db/4.3.1-SNAPSHOT/maven-metadata.xml
300 [exec] [INFO]
301 [exec] [INFO] --- maven-enforcer-plugin:1.2:enforce (enforce-maven) @ CalendarPortlet ---
302 [exec] [INFO]
303 [exec] [INFO] --- maven-enforcer-plugin:1.2:enforce (enforce-versions) @ CalendarPortlet ---
304 [exec] [INFO]
305 [exec] [INFO] --- maven-resources-plugin:2.6:resources (default-resources) @ CalendarPortlet ---
306 [exec] [INFO] Using 'UTF-8' encoding to copy filtered resources.
307 [exec] [INFO] Copying 3 resources
308 [exec] [INFO] Copying 3 resources
309 [exec] [INFO]
310 [exec] [INFO] --- maven-compiler-plugin:3.0:compile (default-compile) @ CalendarPortlet ---
311 [exec] [INFO] No sources to compile
312 [exec] [INFO]
313 [exec] [INFO] --- maven-resources-plugin:2.6:testResources (default-testResources) @ CalendarPortlet ---
314 [exec] [INFO] Using 'UTF-8' encoding to copy filtered resources.
315 [exec] [INFO] skip non existing resourceDirectory C:\development\source\myu\uportal-portlets-overlay\CalendarPortlet\src\test\resources
316 [exec] [INFO]
317 [exec] [INFO] --- maven-compiler-plugin:3.0:testCompile (default-testCompile) @ CalendarPortlet ---
318 [exec] [INFO] No sources to compile
319 [exec] [INFO]
320 [exec] [INFO] --- maven-surefire-plugin:2.13:test (default-test) @ CalendarPortlet ---
321 [exec] [INFO] No tests to run.
322 [exec] [INFO]
323 [exec] [INFO] --- maven-war-plugin:2.3:war (default-war) @ CalendarPortlet ---
324 [exec] [INFO] Packaging webapp
325 [exec] [INFO] Assembling webapp [CalendarPortlet] in [C:\development\source\myu\uportal-portlets-overlay\CalendarPortlet\target\CalendarPortlet]
326 [exec] [INFO] Processing war project
327 [exec] [INFO] Copying webapp resources [C:\development\source\myu\uportal-portlets-overlay\CalendarPortlet\src\main\webapp]
328 [exec] [INFO] Processing overlay [ id org.jasig.portlet:CalendarPortlet]
329 [exec] [INFO] Webapp assembled in [57512 msecs]
330 [exec] [INFO] Building war: C:\development\source\myu\uportal-portlets-overlay\CalendarPortlet\target\CalendarPortlet.war
331 [exec] [WARNING] Warning: selected war files include a META-INF/INDEX.LIST which will be replaced by a newly generated one.
332 [exec] [INFO] Packaging classes
333 [exec] [INFO] Building jar: C:\development\source\myu\uportal-portlets-overlay\CalendarPortlet\target\CalendarPortlet-classes.jar
334 [exec] [INFO]
335 [exec] [INFO] --- maven-site-plugin:3.4:attach-descriptor (attach-descriptor) @ CalendarPortlet ---
336 [exec] [INFO]
337 [exec] [INFO] --- maven-pluto-plugin:2.1.0-M3:assemble (default) @ CalendarPortlet ---
338 [exec] [INFO] Assembling archive file C:\development\source\myu\uportal-portlets-overlay\CalendarPortlet\target\CalendarPortlet.war to directory C:\development\source\myu\uportal-portlets-overlay\CalendarPortlet\target
339 [exec] [INFO]
340 [exec] [INFO] >>> hibernate3-maven-plugin:2.2:hbm2ddl (default) > process-resources @ CalendarPortlet >>>
341 [exec] [INFO]
342 [exec] [INFO] --- maven-enforcer-plugin:1.2:enforce (enforce-maven) @ CalendarPortlet ---
343 [exec] [INFO]
344 [exec] [INFO] --- maven-enforcer-plugin:1.2:enforce (enforce-versions) @ CalendarPortlet ---
345 [exec] [INFO]
346 [exec] [INFO] --- maven-resources-plugin:2.6:resources (default-resources) @ CalendarPortlet ---
347 [exec] [INFO] Using 'UTF-8' encoding to copy filtered resources.
348 [exec] [INFO] Copying 3 resources
349 [exec] [INFO] Copying 3 resources
350 [exec] [INFO]
351 [exec] [INFO] <<< hibernate3-maven-plugin:2.2:hbm2ddl (default) < process-resources @ CalendarPortlet <<<
352 [exec] [INFO]
353 [exec] [INFO] --- hibernate3-maven-plugin:2.2:hbm2ddl (default) @ CalendarPortlet ---
354 [exec] [INFO] Hibernate 3.2.3
355 [exec] [INFO] hibernate.properties not found
356 [exec] [INFO] Bytecode provider name : cglib
357 [exec] [INFO] using JDK 1.4 java.sql.Timestamp handling
358 [exec] [INFO] Configuration XML file loaded: jar:file:/C:/Users/toben.archer/.m2/repository/org/jasig/portlet/CalendarPortlet/2.3.3/CalendarPortlet-2.3.3-classes.jar!/hibernate.cfg.xml
359 [exec] [INFO] configuring from url: jar:file:/C:/Users/toben.archer/.m2/repository/org/jasig/portlet/CalendarPortlet/2.3.3/CalendarPortlet-2.3.3-classes.jar!/hibernate.cfg.xml
360 [exec] [INFO] Reading mappings from resource : hibernate-mappings/CalendarDefinition.hbm.xml
361 [exec] [INFO] Mapping class: org.jasig.portlet.calendar.CalendarDefinition -> CALENDAR_STORE
362 [exec] [INFO] Mapping collection: org.jasig.portlet.calendar.CalendarDefinition.parameters -> CALENDAR_PARAMETER
363 [exec] [INFO] Mapping subclass: org.jasig.portlet.calendar.UserDefinedCalendarDefinition -> CALENDAR_STORE
364 [exec] [INFO] Mapping subclass: org.jasig.portlet.calendar.PredefinedCalendarDefinition -> CALENDAR_STORE
365 [exec] [INFO] Mapping collection: org.jasig.portlet.calendar.PredefinedCalendarDefinition.defaultRoles -> CALENDAR_ROLE
366 [exec] [INFO] Reading mappings from resource : hibernate-mappings/CalendarConfiguration.hbm.xml
367 [exec] [INFO] Mapping class: org.jasig.portlet.calendar.CalendarConfiguration -> CALENDAR_CONFIGURATION
368 [exec] [INFO] Mapping subclass: org.jasig.portlet.calendar.PredefinedCalendarConfiguration -> CALENDAR_CONFIGURATION
369 [exec] [INFO] Mapping collection: org.jasig.portlet.calendar.PredefinedCalendarConfiguration.preferences -> CALENDAR_PREFERENCE
370 [exec] [INFO] Mapping subclass: org.jasig.portlet.calendar.UserDefinedCalendarConfiguration -> CALENDAR_CONFIGURATION
371 [exec] [INFO] Configured SessionFactory: null
372 [exec] [INFO] Configuration Properties file loaded: C:\development\source\myu\uportal-portlets-overlay\CalendarPortlet\target\classes\datasource.properties
373 [exec] [INFO] Mapping collection: org.jasig.portlet.calendar.PredefinedCalendarDefinition.userConfigurations -> CALENDAR_CONFIGURATION
374 [exec] [INFO] Using dialect: org.hibernate.dialect.HSQLDialect
375 [exec] [INFO] Running hbm2ddl schema export
376 [exec] [INFO] exporting generated schema to database
377 [exec] [INFO] Using Hibernate built-in connection pool (not for production use!)
378 [exec] [INFO] Hibernate connection pool size: 20
379 [exec] [INFO] autocommit mode: false
380 [exec] [INFO] using driver: org.hsqldb.jdbc.JDBCDriver at URL: jdbc:hsqldb:hsql://localhost:8887/uPortal
381 [exec] [INFO] connection properties: {user=sa, password=****}
382 [exec] alter table CALENDAR_CONFIGURATION drop constraint FKF8F0C5953B30B1;
383 [exec] alter table CALENDAR_CONFIGURATION drop constraint FKF8F0C5957886B9ED;
384 [exec] alter table CALENDAR_PARAMETER drop constraint FKB05633C8BC98598B;
385 [exec] alter table CALENDAR_PREFERENCE drop constraint FKE815407CCAE99FF9;
386 [exec] alter table CALENDAR_ROLE drop constraint FK30839CD73B30B1;
387 [exec] drop table CALENDAR_CONFIGURATION if exists;
388 [exec] drop table CALENDAR_PARAMETER if exists;
389 [exec] drop table CALENDAR_PREFERENCE if exists;
390 [exec] drop table CALENDAR_ROLE if exists;
391 [exec] drop table CALENDAR_STORE if exists;
392 [exec] create table CALENDAR_CONFIGURATION (CALENDAR_CONFIGURATION_ID bigint generated by default as identity (start with 1), CALENDAR_CONFIGURATION_TYPE varchar(255) not null, SUBSCRIBE_ID varchar(50), DISPLAYED bit, CALENDAR_ID bigint, primary key (CALENDAR_CONFIGURATION_ID));
393 [exec] create table CALENDAR_PARAMETER (CALENDAR_ID bigint not null, CALENDAR_PARAMETER_VALUE longvarchar not null, CALENDAR_PARAMETER_NAME varchar(255) not null, primary key (CALENDAR_ID, CALENDAR_PARAMETER_NAME));
394 [exec] create table CALENDAR_PREFERENCE (CALENDAR_CONFIGURATION_ID bigint not null, CALENDAR_PREFERENCE_VALUE longvarchar not null, CALENDAR_PREFERENCE_NAME varchar(255) not null, primary key (CALENDAR_CONFIGURATION_ID, CALENDAR_PREFERENCE_NAME));
395 [exec] create table CALENDAR_ROLE (CALENDAR_ID bigint not null, ROLE_NAME varchar(255) not null, primary key (CALENDAR_ID, ROLE_NAME));
396 [exec] create table CALENDAR_STORE (CALENDAR_ID bigint generated by default as identity (start with 1), CALENDAR_LISTING_TYPE varchar(255) not null, CALENDAR_NAME varchar(100), CALENDAR_CLASS varchar(100), CALENDAR_FNAME varchar(100), primary key (CALENDAR_ID));
397 [exec] create index SUBSCRIPTION_IDX on CALENDAR_CONFIGURATION (SUBSCRIBE_ID);
398 [exec] alter table CALENDAR_CONFIGURATION add constraint FKF8F0C5953B30B1 foreign key (CALENDAR_ID) references CALENDAR_STORE;
399 [exec] alter table CALENDAR_CONFIGURATION add constraint FKF8F0C5957886B9ED foreign key (CALENDAR_ID) references CALENDAR_STORE;
400 [exec] [ERROR] Unsuccessful: alter table CALENDAR_CONFIGURATION add constraint FKF8F0C5957886B9ED foreign key (CALENDAR_ID) references CALENDAR_STORE
401 [exec] [ERROR] a FOREIGN KEY constraint already exists on the set of columns: FKF8F0C5957886B9ED in statement [alter table CALENDAR_CONFIGURATION add constraint FKF8F0C5957886B9ED foreign key (CALENDAR_ID) references CALENDAR_STORE]
402 [exec] alter table CALENDAR_PARAMETER add constraint FKB05633C8BC98598B foreign key (CALENDAR_ID) references CALENDAR_STORE;
403 [exec] alter table CALENDAR_PREFERENCE add constraint FKE815407CCAE99FF9 foreign key (CALENDAR_CONFIGURATION_ID) references CALENDAR_CONFIGURATION;
404 [exec] alter table CALENDAR_ROLE add constraint FK30839CD73B30B1 foreign key (CALENDAR_ID) references CALENDAR_STORE;
405 [exec] [INFO] schema export complete
406 [exec] [INFO] cleaning up connection pool: jdbc:hsqldb:hsql://localhost:8887/uPortal
407 [exec] [WARNING] 2 errors occurred while performing <hbm2ddl>.
408 [exec] [ERROR] Error #1: java.sql.SQLSyntaxErrorException: user lacks privilege or object not found: FKF8F0C5957886B9ED
409 [exec] [ERROR] Error #1: java.sql.SQLSyntaxErrorException: a FOREIGN KEY constraint already exists on the set of columns: FKF8F0C5957886B9ED in statement [alter table CALENDAR_CONFIGURATION add constraint FKF8F0C5957886B9ED foreign key (CALENDAR_ID) references CALENDAR_STORE]
410 [exec] [INFO]
411 [exec] [INFO] ------------------------------------------------------------------------
412 [exec] [INFO] Building CAS Proxy Test Portlet 4.3.1-SNAPSHOT
413 [exec] [INFO] ------------------------------------------------------------------------
414 [exec] [INFO]
415 [exec] [INFO] --- maven-enforcer-plugin:1.2:enforce (enforce-maven) @ cas-proxy-test-portlet ---
416 [exec] [INFO]
417 [exec] [INFO] --- maven-enforcer-plugin:1.2:enforce (enforce-versions) @ cas-proxy-test-portlet ---
418 [exec] [INFO]
419 [exec] [INFO] --- maven-resources-plugin:2.6:resources (default-resources) @ cas-proxy-test-portlet ---
420 [exec] [INFO] Using 'UTF-8' encoding to copy filtered resources.
421 [exec] [INFO] Copying 1 resource
422 [exec] [INFO]
423 [exec] [INFO] --- maven-compiler-plugin:3.0:compile (default-compile) @ cas-proxy-test-portlet ---
424 [exec] [INFO] No sources to compile
425 [exec] [INFO]
426 [exec] [INFO] --- maven-resources-plugin:2.6:testResources (default-testResources) @ cas-proxy-test-portlet ---
427 [exec] [INFO] Using 'UTF-8' encoding to copy filtered resources.
428 [exec] [INFO] skip non existing resourceDirectory C:\development\source\myu\uportal-portlets-overlay\cas-proxy-test-portlet\src\test\resources
429 [exec] [INFO]
430 [exec] [INFO] --- maven-compiler-plugin:3.0:testCompile (default-testCompile) @ cas-proxy-test-portlet ---
431 [exec] [INFO] No sources to compile
432 [exec] [INFO]
433 [exec] [INFO] --- maven-surefire-plugin:2.13:test (default-test) @ cas-proxy-test-portlet ---
434 [exec] [INFO] cleaning up connection pool: jdbc:hsqldb:hsql://localhost:8887/uPortal
435 [exec] [INFO] No tests to run.
436 [exec] [INFO]
437 [exec] [INFO] --- maven-war-plugin:2.3:war (default-war) @ cas-proxy-test-portlet ---
438 [exec] [INFO] Packaging webapp
439 [exec] [INFO] Assembling webapp [cas-proxy-test-portlet] in [C:\development\source\myu\uportal-portlets-overlay\cas-proxy-test-portlet\target\cas-proxy-test-portlet]
440 [exec] [INFO] Processing war project
441 [exec] [INFO] Copying webapp resources [C:\development\source\myu\uportal-portlets-overlay\cas-proxy-test-portlet\src\main\webapp]
442 [exec] [INFO] Processing overlay [ id org.jasig.portlet:cas-proxy-test-portlet]
443 [exec] [INFO] Webapp assembled in [2465 msecs]
444 [exec] [INFO] Building war: C:\development\source\myu\uportal-portlets-overlay\cas-proxy-test-portlet\target\cas-proxy-test-portlet.war
445 [exec] [INFO] Packaging classes
446 [exec] [INFO] Building jar: C:\development\source\myu\uportal-portlets-overlay\cas-proxy-test-portlet\target\cas-proxy-test-portlet-classes.jar
447 [exec] [INFO]
448 [exec] [INFO] --- maven-site-plugin:3.4:attach-descriptor (attach-descriptor) @ cas-proxy-test-portlet ---
449 [exec] [INFO]
450 [exec] [INFO] --- maven-pluto-plugin:2.1.0-M3:assemble (default) @ cas-proxy-test-portlet ---
451 [exec] [INFO] Assembling archive file C:\development\source\myu\uportal-portlets-overlay\cas-proxy-test-portlet\target\cas-proxy-test-portlet.war to directory C:\development\source\myu\uportal-portlets-overlay\cas-proxy-test-portlet\target
452 [exec] [INFO]
453 [exec] [INFO] ------------------------------------------------------------------------
454 [exec] [INFO] Building Email Preview Portlet 4.3.1-SNAPSHOT
455 [exec] [INFO] ------------------------------------------------------------------------
456 [exec] [INFO]
457 [exec] [INFO] --- maven-enforcer-plugin:1.2:enforce (enforce-maven) @ email-preview ---
458 [exec] [INFO]
459 [exec] [INFO] --- maven-enforcer-plugin:1.2:enforce (enforce-versions) @ email-preview ---
460 [exec] [INFO]
461 [exec] [INFO] --- maven-resources-plugin:2.6:resources (default-resources) @ email-preview ---
462 [exec] [INFO] Using 'UTF-8' encoding to copy filtered resources.
463 [exec] [INFO] Copying 1 resource
464 [exec] [INFO] Copying 1 resource
465 [exec] [INFO]
466 [exec] [INFO] --- maven-compiler-plugin:3.0:compile (default-compile) @ email-preview ---
467 [exec] [INFO] No sources to compile
468 [exec] [INFO]
469 [exec] [INFO] --- maven-resources-plugin:2.6:testResources (default-testResources) @ email-preview ---
470 [exec] [INFO] Using 'UTF-8' encoding to copy filtered resources.
471 [exec] [INFO] skip non existing resourceDirectory C:\development\source\myu\uportal-portlets-overlay\email-preview\src\test\resources
472 [exec] [INFO]
473 [exec] [INFO] --- maven-compiler-plugin:3.0:testCompile (default-testCompile) @ email-preview ---
474 [exec] [INFO] No sources to compile
475 [exec] [INFO]
476 [exec] [INFO] --- maven-surefire-plugin:2.13:test (default-test) @ email-preview ---
477 [exec] [INFO] No tests to run.
478 [exec] [INFO]
479 [exec] [INFO] --- maven-war-plugin:2.3:war (default-war) @ email-preview ---
480 [exec] [INFO] Packaging webapp
481 [exec] [INFO] Assembling webapp [email-preview] in [C:\development\source\myu\uportal-portlets-overlay\email-preview\target\email-preview]
482 [exec] [INFO] Processing war project
483 [exec] [INFO] Copying webapp resources [C:\development\source\myu\uportal-portlets-overlay\email-preview\src\main\webapp]
484 [exec] [INFO] Processing overlay [ id org.jasig.portlet:email-preview]
485 [exec] [INFO] Webapp assembled in [40608 msecs]
486 [exec] [INFO] Building war: C:\development\source\myu\uportal-portlets-overlay\email-preview\target\email-preview.war
487 [exec] [WARNING] Warning: selected war files include a META-INF/INDEX.LIST which will be replaced by a newly generated one.
488 [exec] [INFO] Packaging classes
489 [exec] [INFO] Building jar: C:\development\source\myu\uportal-portlets-overlay\email-preview\target\email-preview-classes.jar
490 [exec] [INFO]
491 [exec] [INFO] --- maven-site-plugin:3.4:attach-descriptor (attach-descriptor) @ email-preview ---
492 [exec] [INFO]
493 [exec] [INFO] --- maven-pluto-plugin:2.1.0-M3:assemble (default) @ email-preview ---
494 [exec] [INFO] Assembling archive file C:\development\source\myu\uportal-portlets-overlay\email-preview\target\email-preview.war to directory C:\development\source\myu\uportal-portlets-overlay\email-preview\target
495 [exec] [INFO]
496 [exec] [INFO] ------------------------------------------------------------------------
497 [exec] [INFO] Building Functional Tests Portlet 4.3.1-SNAPSHOT
498 [exec] [INFO] ------------------------------------------------------------------------
499 [exec] [INFO]
500 [exec] [INFO] --- maven-enforcer-plugin:1.2:enforce (enforce-maven) @ FunctionalTestsPortlet ---
501 [exec] [INFO]
502 [exec] [INFO] --- maven-enforcer-plugin:1.2:enforce (enforce-versions) @ FunctionalTestsPortlet ---
503 [exec] [INFO]
504 [exec] [INFO] --- maven-resources-plugin:2.6:resources (default-resources) @ FunctionalTestsPortlet ---
505 [exec] [INFO] Using 'UTF-8' encoding to copy filtered resources.
506 [exec] [INFO] skip non existing resourceDirectory C:\development\source\myu\uportal-portlets-overlay\FunctionalTestsPortlet\src\main\resources
507 [exec] [INFO]
508 [exec] [INFO] --- maven-compiler-plugin:3.0:compile (default-compile) @ FunctionalTestsPortlet ---
509 [exec] [INFO] No sources to compile
510 [exec] [INFO]
511 [exec] [INFO] --- maven-resources-plugin:2.6:testResources (default-testResources) @ FunctionalTestsPortlet ---
512 [exec] [INFO] Using 'UTF-8' encoding to copy filtered resources.
513 [exec] [INFO] skip non existing resourceDirectory C:\development\source\myu\uportal-portlets-overlay\FunctionalTestsPortlet\src\test\resources
514 [exec] [INFO]
515 [exec] [INFO] --- maven-compiler-plugin:3.0:testCompile (default-testCompile) @ FunctionalTestsPortlet ---
516 [exec] [INFO] No sources to compile
517 [exec] [INFO]
518 [exec] [INFO] --- maven-surefire-plugin:2.13:test (default-test) @ FunctionalTestsPortlet ---
519 [exec] [INFO] No tests to run.
520 [exec] [INFO]
521 [exec] [INFO] --- maven-war-plugin:2.3:war (default-war) @ FunctionalTestsPortlet ---
522 [exec] [INFO] Packaging webapp
523 [exec] [INFO] Assembling webapp [FunctionalTestsPortlet] in [C:\development\source\myu\uportal-portlets-overlay\FunctionalTestsPortlet\target\FunctionalTestsPortlet]
524 [exec] [INFO] Processing war project
525 [exec] [INFO] Copying webapp webResources [C:\development\source\myu\uportal-portlets-overlay\FunctionalTestsPortlet/src/main/webapp/WEB-INF] to [C:\development\source\myu\uportal-portlets-overlay\FunctionalTestsPortlet\target\FunctionalTestsPortlet]
526 [exec] [INFO] Copying webapp resources [C:\development\source\myu\uportal-portlets-overlay\FunctionalTestsPortlet\src\main\webapp]
527 [exec] [INFO] Processing overlay [ id org.jasig.portlet:FunctionalTestsPortlet]
528 [exec] [INFO] Webapp assembled in [5826 msecs]
529 [exec] [INFO] Building war: C:\development\source\myu\uportal-portlets-overlay\FunctionalTestsPortlet\target\FunctionalTestsPortlet.war
530 [exec] [INFO] Packaging classes
531 [exec] [INFO] Building jar: C:\development\source\myu\uportal-portlets-overlay\FunctionalTestsPortlet\target\FunctionalTestsPortlet-classes.jar
532 [exec] [INFO]
533 [exec] [INFO] --- maven-site-plugin:3.4:attach-descriptor (attach-descriptor) @ FunctionalTestsPortlet ---
534 [exec] [INFO]
535 [exec] [INFO] --- maven-pluto-plugin:2.1.0-M3:assemble (default) @ FunctionalTestsPortlet ---
536 [exec] [INFO] Assembling archive file C:\development\source\myu\uportal-portlets-overlay\FunctionalTestsPortlet\target\FunctionalTestsPortlet.war to directory C:\development\source\myu\uportal-portlets-overlay\FunctionalTestsPortlet\target
537 [exec] [INFO]
538 [exec] [INFO] ------------------------------------------------------------------------
539 [exec] [INFO] Building Jasig Widget Portlets 4.3.1-SNAPSHOT
540 [exec] [INFO] ------------------------------------------------------------------------
541 [exec] [INFO]
542 [exec] [INFO] --- maven-enforcer-plugin:1.2:enforce (enforce-maven) @ jasig-widget-portlets ---
543 [exec] [INFO]
544 [exec] [INFO] --- maven-enforcer-plugin:1.2:enforce (enforce-versions) @ jasig-widget-portlets ---
545 [exec] [INFO]
546 [exec] [INFO] --- maven-resources-plugin:2.6:resources (default-resources) @ jasig-widget-portlets ---
547 [exec] [INFO] Using 'UTF-8' encoding to copy filtered resources.
548 [exec] [INFO] Copying 0 resource
549 [exec] [INFO] Copying 1 resource
550 [exec] [INFO]
551 [exec] [INFO] --- maven-compiler-plugin:3.0:compile (default-compile) @ jasig-widget-portlets ---
552 [exec] [INFO] No sources to compile
553 [exec] [INFO]
554 [exec] [INFO] --- maven-resources-plugin:2.6:testResources (default-testResources) @ jasig-widget-portlets ---
555 [exec] [INFO] Using 'UTF-8' encoding to copy filtered resources.
556 [exec] [INFO] skip non existing resourceDirectory C:\development\source\myu\uportal-portlets-overlay\jasig-widget-portlets\src\test\resources
557 [exec] [INFO]
558 [exec] [INFO] --- maven-compiler-plugin:3.0:testCompile (default-testCompile) @ jasig-widget-portlets ---
559 [exec] [INFO] No sources to compile
560 [exec] [INFO]
561 [exec] [INFO] --- maven-surefire-plugin:2.13:test (default-test) @ jasig-widget-portlets ---
562 [exec] [INFO] No tests to run.
563 [exec] [INFO]
564 [exec] [INFO] --- maven-war-plugin:2.3:war (default-war) @ jasig-widget-portlets ---
565 [exec] [INFO] Packaging webapp
566 [exec] [INFO] Assembling webapp [jasig-widget-portlets] in [C:\development\source\myu\uportal-portlets-overlay\jasig-widget-portlets\target\jasig-widget-portlets]
567 [exec] [INFO] Processing war project
568 [exec] [INFO] Copying webapp resources [C:\development\source\myu\uportal-portlets-overlay\jasig-widget-portlets\src\main\webapp]
569 [exec] [INFO] Processing overlay [ id org.jasig.portlet:jasig-widget-portlets]
570 [exec] [INFO] Webapp assembled in [19887 msecs]
571 [exec] [INFO] Building war: C:\development\source\myu\uportal-portlets-overlay\jasig-widget-portlets\target\jasig-widget-portlets.war
572 [exec] [WARNING] Warning: selected war files include a META-INF/INDEX.LIST which will be replaced by a newly generated one.
573 [exec] [INFO] Packaging classes
574 [exec] [INFO] Building jar: C:\development\source\myu\uportal-portlets-overlay\jasig-widget-portlets\target\jasig-widget-portlets-classes.jar
575 [exec] [INFO]
576 [exec] [INFO] --- maven-site-plugin:3.4:attach-descriptor (attach-descriptor) @ jasig-widget-portlets ---
577 [exec] [INFO]
578 [exec] [INFO] --- maven-pluto-plugin:2.1.0-M3:assemble (default) @ jasig-widget-portlets ---
579 [exec] [INFO] Assembling archive file C:\development\source\myu\uportal-portlets-overlay\jasig-widget-portlets\target\jasig-widget-portlets.war to directory C:\development\source\myu\uportal-portlets-overlay\jasig-widget-portlets\target
580 [exec] [INFO]
581 [exec] [INFO] ------------------------------------------------------------------------
582 [exec] [INFO] Building Pluto Test Suite Portlet 4.3.1-SNAPSHOT
583 [exec] [INFO] ------------------------------------------------------------------------
584 [exec] [INFO]
585 [exec] [INFO] --- maven-enforcer-plugin:1.2:enforce (enforce-maven) @ pluto-testsuite ---
586 [exec] [INFO]
587 [exec] [INFO] --- maven-enforcer-plugin:1.2:enforce (enforce-versions) @ pluto-testsuite ---
588 [exec] [INFO]
589 [exec] [INFO] --- maven-resources-plugin:2.6:resources (default-resources) @ pluto-testsuite ---
590 [exec] [INFO] Using 'UTF-8' encoding to copy filtered resources.
591 [exec] [INFO] Copying 3 resources
592 [exec] [INFO]
593 [exec] [INFO] --- maven-compiler-plugin:3.0:compile (default-compile) @ pluto-testsuite ---
594 [exec] [INFO] No sources to compile
595 [exec] [INFO]
596 [exec] [INFO] --- maven-resources-plugin:2.6:testResources (default-testResources) @ pluto-testsuite ---
597 [exec] [INFO] Using 'UTF-8' encoding to copy filtered resources.
598 [exec] [INFO] skip non existing resourceDirectory C:\development\source\myu\uportal-portlets-overlay\pluto-testsuite\src\test\resources
599 [exec] [INFO]
600 [exec] [INFO] --- maven-compiler-plugin:3.0:testCompile (default-testCompile) @ pluto-testsuite ---
601 [exec] [INFO] No sources to compile
602 [exec] [INFO]
603 [exec] [INFO] --- maven-surefire-plugin:2.13:test (default-test) @ pluto-testsuite ---
604 [exec] [INFO] No tests to run.
605 [exec] [INFO]
606 [exec] [INFO] --- maven-war-plugin:2.3:war (default-war) @ pluto-testsuite ---
607 [exec] [INFO] Packaging webapp
608 [exec] [INFO] Assembling webapp [pluto-testsuite] in [C:\development\source\myu\uportal-portlets-overlay\pluto-testsuite\target\pluto-testsuite]
609 [exec] [INFO] Processing war project
610 [exec] [INFO] Copying webapp resources [C:\development\source\myu\uportal-portlets-overlay\pluto-testsuite\src\main\webapp]
611 [exec] [INFO] Processing overlay [ id org.apache.portals.pluto:pluto-testsuite]
612 [exec] [INFO] Webapp assembled in [2914 msecs]
613 [exec] [INFO] Building war: C:\development\source\myu\uportal-portlets-overlay\pluto-testsuite\target\pluto-testsuite.war
614 [exec] [INFO] Packaging classes
615 [exec] [INFO] Building jar: C:\development\source\myu\uportal-portlets-overlay\pluto-testsuite\target\pluto-testsuite-classes.jar
616 [exec] [INFO]
617 [exec] [INFO] --- maven-site-plugin:3.4:attach-descriptor (attach-descriptor) @ pluto-testsuite ---
618 [exec] [INFO]
619 [exec] [INFO] ------------------------------------------------------------------------
620 [exec] [INFO] Building News Reader Portlet 4.3.1-SNAPSHOT
621 [exec] [INFO] ------------------------------------------------------------------------
622 [exec] [INFO]
623 [exec] [INFO] --- maven-enforcer-plugin:1.2:enforce (enforce-maven) @ NewsReaderPortlet ---
624 [exec] [INFO]
625 [exec] [INFO] --- maven-enforcer-plugin:1.2:enforce (enforce-versions) @ NewsReaderPortlet ---
626 [exec] [INFO]
627 [exec] [INFO] --- maven-resources-plugin:2.6:resources (default-resources) @ NewsReaderPortlet ---
628 [exec] [INFO] Using 'UTF-8' encoding to copy filtered resources.
629 [exec] [INFO] Copying 0 resource
630 [exec] [INFO] Copying 2 resources
631 [exec] [INFO]
632 [exec] [INFO] --- maven-compiler-plugin:3.0:compile (default-compile) @ NewsReaderPortlet ---
633 [exec] [INFO] No sources to compile
634 [exec] [INFO]
635 [exec] [INFO] --- maven-resources-plugin:2.6:testResources (default-testResources) @ NewsReaderPortlet ---
636 [exec] [INFO] Using 'UTF-8' encoding to copy filtered resources.
637 [exec] [INFO] skip non existing resourceDirectory C:\development\source\myu\uportal-portlets-overlay\NewsReaderPortlet\src\test\resources
638 [exec] [INFO]
639 [exec] [INFO] --- maven-compiler-plugin:3.0:testCompile (default-testCompile) @ NewsReaderPortlet ---
640 [exec] [INFO] No sources to compile
641 [exec] [INFO]
642 [exec] [INFO] --- maven-surefire-plugin:2.13:test (default-test) @ NewsReaderPortlet ---
643 [exec] [INFO] No tests to run.
644 [exec] [INFO]
645 [exec] [INFO] --- maven-war-plugin:2.3:war (default-war) @ NewsReaderPortlet ---
646 [exec] [INFO] Packaging webapp
647 [exec] [INFO] Assembling webapp [NewsReaderPortlet] in [C:\development\source\myu\uportal-portlets-overlay\NewsReaderPortlet\target\NewsReaderPortlet]
648 [exec] [INFO] Processing war project
649 [exec] [INFO] Copying webapp resources [C:\development\source\myu\uportal-portlets-overlay\NewsReaderPortlet\src\main\webapp]
650 [exec] [INFO] Processing overlay [ id org.jasig.portlet:NewsReaderPortlet]
651 [exec] [INFO] Webapp assembled in [20202 msecs]
652 [exec] [INFO] Building war: C:\development\source\myu\uportal-portlets-overlay\NewsReaderPortlet\target\NewsReaderPortlet.war
653 [exec] [WARNING] Warning: selected war files include a META-INF/INDEX.LIST which will be replaced by a newly generated one.
654 [exec] [INFO] Packaging classes
655 [exec] [INFO] Building jar: C:\development\source\myu\uportal-portlets-overlay\NewsReaderPortlet\target\NewsReaderPortlet-classes.jar
656 [exec] [INFO]
657 [exec] [INFO] --- maven-site-plugin:3.4:attach-descriptor (attach-descriptor) @ NewsReaderPortlet ---
658 [exec] [INFO]
659 [exec] [INFO] --- maven-pluto-plugin:2.1.0-M3:assemble (default) @ NewsReaderPortlet ---
660 [exec] [INFO] Assembling archive file C:\development\source\myu\uportal-portlets-overlay\NewsReaderPortlet\target\NewsReaderPortlet.war to directory C:\development\source\myu\uportal-portlets-overlay\NewsReaderPortlet\target
661 [exec] [INFO]
662 [exec] [INFO] >>> hibernate3-maven-plugin:2.2:hbm2ddl (default) > process-resources @ NewsReaderPortlet >>>
663 [exec] [INFO]
664 [exec] [INFO] --- maven-enforcer-plugin:1.2:enforce (enforce-maven) @ NewsReaderPortlet ---
665 [exec] [INFO]
666 [exec] [INFO] --- maven-enforcer-plugin:1.2:enforce (enforce-versions) @ NewsReaderPortlet ---
667 [exec] [INFO]
668 [exec] [INFO] --- maven-resources-plugin:2.6:resources (default-resources) @ NewsReaderPortlet ---
669 [exec] [INFO] Using 'UTF-8' encoding to copy filtered resources.
670 [exec] [INFO] Copying 0 resource
671 [exec] [INFO] Copying 2 resources
672 [exec] [INFO]
673 [exec] [INFO] <<< hibernate3-maven-plugin:2.2:hbm2ddl (default) < process-resources @ NewsReaderPortlet <<<
674 [exec] [INFO]
675 [exec] [INFO] --- hibernate3-maven-plugin:2.2:hbm2ddl (default) @ NewsReaderPortlet ---
676 [exec] [INFO] Hibernate 3.3.1.GA
677 [exec] [INFO] hibernate.properties not found
678 [exec] [INFO] Bytecode provider name : javassist
679 [exec] [INFO] using JDK 1.4 java.sql.Timestamp handling
680 [exec] [INFO] Configuration XML file loaded: jar:file:/C:/Users/toben.archer/.m2/repository/org/jasig/portlet/NewsReaderPortlet/4.1.2/NewsReaderPortlet-4.1.2-classes.jar!/hibernate.cfg.xml
681 [exec] [INFO] configuring from url: jar:file:/C:/Users/toben.archer/.m2/repository/org/jasig/portlet/NewsReaderPortlet/4.1.2/NewsReaderPortlet-4.1.2-classes.jar!/hibernate.cfg.xml
682 [exec] [INFO] Reading mappings from resource : hibernate-mappings/NewsSet.hbm.xml
683 [exec] [INFO] Mapping class: org.jasig.portlet.newsreader.NewsSet -> NEWS_SET
684 [exec] [INFO] Reading mappings from resource : hibernate-mappings/NewsDefinition.hbm.xml
685 [exec] [INFO] Mapping class: org.jasig.portlet.newsreader.NewsDefinition -> NEWS_DEFINITION
686 [exec] [INFO] Mapping collection: org.jasig.portlet.newsreader.NewsDefinition.parameters -> NEWS_PARAMETER
687 [exec] [INFO] Mapping subclass: org.jasig.portlet.newsreader.UserDefinedNewsDefinition -> NEWS_DEFINITION
688 [exec] [INFO] Mapping subclass: org.jasig.portlet.newsreader.PredefinedNewsDefinition -> NEWS_DEFINITION
689 [exec] [INFO] Mapping collection: org.jasig.portlet.newsreader.PredefinedNewsDefinition.defaultRoles -> NEWS_ROLE
690 [exec] [INFO] Reading mappings from resource : hibernate-mappings/NewsConfiguration.hbm.xml
691 [exec] [INFO] Mapping class: org.jasig.portlet.newsreader.NewsConfiguration -> NEWS_CONFIGURATION
692 [exec] [INFO] Mapping subclass: org.jasig.portlet.newsreader.PredefinedNewsConfiguration -> NEWS_CONFIGURATION
693 [exec] [INFO] Mapping collection: org.jasig.portlet.newsreader.PredefinedNewsConfiguration.preferences -> NEWS_PREFERENCE
694 [exec] [INFO] Mapping subclass: org.jasig.portlet.newsreader.UserDefinedNewsConfiguration -> NEWS_CONFIGURATION
695 [exec] [INFO] Configured SessionFactory: null
696 [exec] [INFO] Configuration Properties file loaded: C:\development\source\myu\uportal-portlets-overlay\NewsReaderPortlet\target\classes\datasource.properties
697 [exec] [INFO] Mapping collection: org.jasig.portlet.newsreader.NewsSet.newsConfigurations -> NEWS_CONFIGURATION
698 [exec] [INFO] Mapping collection: org.jasig.portlet.newsreader.PredefinedNewsDefinition.userConfigurations -> NEWS_CONFIGURATION
699 [exec] [INFO] Using dialect: org.hibernate.dialect.HSQLDialect
700 [exec] [INFO] Running hbm2ddl schema export
701 [exec] [INFO] exporting generated schema to database
702 [exec] [INFO] Using Hibernate built-in connection pool (not for production use!)
703 [exec] [INFO] Hibernate connection pool size: 20
704 [exec] [INFO] autocommit mode: false
705 [exec] [INFO] using driver: org.hsqldb.jdbc.JDBCDriver at URL: jdbc:hsqldb:hsql://localhost:8887/uPortal
706 [exec] [INFO] connection properties: {validationQuery=select 1 from INFORMATION_SCHEMA.SYSTEM_USERS, user=sa, password=****}
707 [exec] alter table NEWS_CONFIGURATION drop constraint FK6B30F46AB3EC1261;
708 [exec] alter table NEWS_CONFIGURATION drop constraint FK6B30F46AA3A489B9;
709 [exec] alter table NEWS_CONFIGURATION drop constraint FK6B30F46A9BF7DB25;
710 [exec] alter table NEWS_PARAMETER drop constraint FKC041151DAEBF5193;
711 [exec] alter table NEWS_PREFERENCE drop constraint FKD58689C7884F6B27;
712 [exec] alter table NEWS_ROLE drop constraint FKB9CC7A62A3A489B9;
713 [exec] drop table NEWS_CONFIGURATION if exists;
714 [exec] drop table NEWS_DEFINITION if exists;
715 [exec] drop table NEWS_PARAMETER if exists;
716 [exec] drop table NEWS_PREFERENCE if exists;
717 [exec] drop table NEWS_ROLE if exists;
718 [exec] drop table NEWS_SET if exists;
719 [exec] create table NEWS_CONFIGURATION (NEWS_CONFIGURATION_ID bigint generated by default as identity (start with 1), NEWS_CONFIGURATION_TYPE varchar(255) not null, DISPLAYED bit, ACTIVE bit, SET_ID bigint, NEWS_ID bigint, primary key (NEWS_CONFIGURATION_ID));
720 [exec] create table NEWS_DEFINITION (NEWS_ID bigint generated by default as identity (start with 1), NEWS_LISTING_TYPE varchar(255) not null, NEWS_NAME varchar(100), NEWS_CLASS varchar(100), NEWS_FNAME varchar(100), primary key (NEWS_ID));
721 [exec] create table NEWS_PARAMETER (NEWS_ID bigint not null, NEWS_PARAMETER_VALUE longvarchar not null, NEWS_PARAMETER_NAME varchar(255) not null, primary key (NEWS_ID, NEWS_PARAMETER_NAME));
722 [exec] create table NEWS_PREFERENCE (NEWS_CONFIGURATION_ID bigint not null, NEWS_PREFERENCE_VALUE longvarchar not null, NEWS_PREFERENCE_NAME varchar(255) not null, primary key (NEWS_CONFIGURATION_ID, NEWS_PREFERENCE_NAME));
723 [exec] create table NEWS_ROLE (NEWS_ID bigint not null, ROLE_NAME varchar(255) not null, primary key (NEWS_ID, ROLE_NAME));
724 [exec] create table NEWS_SET (SET_ID bigint generated by default as identity (start with 1), NEWS_NAME varchar(100), USER_ID varchar(50), primary key (SET_ID), unique (NEWS_NAME, USER_ID));
725 [exec] alter table NEWS_CONFIGURATION add constraint FK6B30F46AB3EC1261 foreign key (SET_ID) references NEWS_SET;
726 [exec] alter table NEWS_CONFIGURATION add constraint FK6B30F46AA3A489B9 foreign key (NEWS_ID) references NEWS_DEFINITION;
727 [exec] alter table NEWS_CONFIGURATION add constraint FK6B30F46A9BF7DB25 foreign key (NEWS_ID) references NEWS_DEFINITION;
728 [exec] [ERROR] Unsuccessful: alter table NEWS_CONFIGURATION add constraint FK6B30F46A9BF7DB25 foreign key (NEWS_ID) references NEWS_DEFINITION
729 [exec] [ERROR] a FOREIGN KEY constraint already exists on the set of columns: FK6B30F46A9BF7DB25 in statement [alter table NEWS_CONFIGURATION add constraint FK6B30F46A9BF7DB25 foreign key (NEWS_ID) references NEWS_DEFINITION]
730 [exec] alter table NEWS_PARAMETER add constraint FKC041151DAEBF5193 foreign key (NEWS_ID) references NEWS_DEFINITION;
731 [exec] alter table NEWS_PREFERENCE add constraint FKD58689C7884F6B27 foreign key (NEWS_CONFIGURATION_ID) references NEWS_CONFIGURATION;
732 [exec] alter table NEWS_ROLE add constraint FKB9CC7A62A3A489B9 foreign key (NEWS_ID) references NEWS_DEFINITION;
733 [exec] create index user_idx on NEWS_SET (USER_ID);
734 [exec] [INFO] schema export complete
735 [exec] [INFO] cleaning up connection pool: jdbc:hsqldb:hsql://localhost:8887/uPortal
736 [exec] [WARNING] 2 errors occurred while performing <hbm2ddl>.
737 [exec] [ERROR] Error #1: java.sql.SQLSyntaxErrorException: user lacks privilege or object not found: FK6B30F46A9BF7DB25
738 [exec] [ERROR] Error #1: java.sql.SQLSyntaxErrorException: a FOREIGN KEY constraint already exists on the set of columns: FK6B30F46A9BF7DB25 in statement [alter table NEWS_CONFIGURATION add constraint FK6B30F46A9BF7DB25 foreign key (NEWS_ID) references NEWS_DEFINITION]
739 [exec] [INFO]
740 [exec] [INFO] ------------------------------------------------------------------------
741 [exec] [INFO] Building Jasig Notification Portlet 4.3.1-SNAPSHOT
742 [exec] [INFO] ------------------------------------------------------------------------
743 [exec] [INFO] cleaning up connection pool: jdbc:hsqldb:hsql://localhost:8887/uPortal
744 [exec] [INFO]
745 [exec] [INFO] --- maven-enforcer-plugin:1.2:enforce (enforce-maven) @ NotificationPortlet ---
746 [exec] [INFO]
747 [exec] [INFO] --- maven-enforcer-plugin:1.2:enforce (enforce-versions) @ NotificationPortlet ---
748 [exec] [INFO]
749 [exec] [INFO] --- lesscss-maven-plugin:1.3.3:compile (default) @ NotificationPortlet ---
750 [exec] [INFO] Nothing to compile - no LESS sources found
751 [exec] [INFO]
752 [exec] [INFO] --- maven-resources-plugin:2.6:resources (default-resources) @ NotificationPortlet ---
753 [exec] [INFO] Using 'UTF-8' encoding to copy filtered resources.
754 [exec] [INFO] Copying 0 resource
755 [exec] [INFO] Copying 3 resources
756 [exec] [INFO]
757 [exec] [INFO] --- maven-compiler-plugin:3.0:compile (default-compile) @ NotificationPortlet ---
758 [exec] [INFO] No sources to compile
759 [exec] [INFO]
760 [exec] [INFO] --- maven-resources-plugin:2.6:testResources (default-testResources) @ NotificationPortlet ---
761 [exec] [INFO] Using 'UTF-8' encoding to copy filtered resources.
762 [exec] [INFO] skip non existing resourceDirectory C:\development\source\myu\uportal-portlets-overlay\NotificationPortlet\src\test\resources
763 [exec] [INFO]
764 [exec] [INFO] --- maven-compiler-plugin:3.0:testCompile (default-testCompile) @ NotificationPortlet ---
765 [exec] [INFO] No sources to compile
766 [exec] [INFO]
767 [exec] [INFO] --- maven-surefire-plugin:2.13:test (default-test) @ NotificationPortlet ---
768 [exec] [INFO] No tests to run.
769 [exec] [INFO]
770 [exec] [INFO] --- maven-war-plugin:2.3:war (default-war) @ NotificationPortlet ---
771 [exec] [INFO] Packaging webapp
772 [exec] [INFO] Assembling webapp [NotificationPortlet] in [C:\development\source\myu\uportal-portlets-overlay\NotificationPortlet\target\NotificationPortlet]
773 [exec] [INFO] Processing war project
774 [exec] [INFO] Copying webapp resources [C:\development\source\myu\uportal-portlets-overlay\NotificationPortlet\src\main\webapp]
775 [exec] [INFO] Processing overlay [ id org.jasig.portlet.notification:notification-portlet-webapp]
776 [exec] [INFO] Webapp assembled in [10741 msecs]
777 [exec] [INFO] Building war: C:\development\source\myu\uportal-portlets-overlay\NotificationPortlet\target\NotificationPortlet.war
778 [exec] [WARNING] Warning: selected war files include a META-INF/INDEX.LIST which will be replaced by a newly generated one.
779 [exec] [INFO] Packaging classes
780 [exec] [INFO] Building jar: C:\development\source\myu\uportal-portlets-overlay\NotificationPortlet\target\NotificationPortlet-classes.jar
781 [exec] [INFO]
782 [exec] [INFO] --- maven-site-plugin:3.4:attach-descriptor (attach-descriptor) @ NotificationPortlet ---
783 [exec] [INFO]
784 [exec] [INFO] --- maven-pluto-plugin:2.1.0-M3:assemble (default) @ NotificationPortlet ---
785 [exec] [INFO] Assembling archive file C:\development\source\myu\uportal-portlets-overlay\NotificationPortlet\target\NotificationPortlet.war to directory C:\development\source\myu\uportal-portlets-overlay\NotificationPortlet\target
786 [exec] [INFO]
787 [exec] [INFO] ------------------------------------------------------------------------
788 [exec] [INFO] Building Sakai Connector Portlet 4.3.1-SNAPSHOT
789 [exec] [INFO] ------------------------------------------------------------------------
790 [exec] [INFO]
791 [exec] [INFO] --- maven-enforcer-plugin:1.2:enforce (enforce-maven) @ sakai-connector ---
792 [exec] [INFO]
793 [exec] [INFO] --- maven-enforcer-plugin:1.2:enforce (enforce-versions) @ sakai-connector ---
794 [exec] [INFO]
795 [exec] [INFO] --- maven-resources-plugin:2.6:resources (default-resources) @ sakai-connector ---
796 [exec] [INFO] Using 'UTF-8' encoding to copy filtered resources.
797 [exec] [INFO] skip non existing resourceDirectory C:\development\source\myu\uportal-portlets-overlay\sakai-connector-portlet\src\main\resources
798 [exec] [INFO]
799 [exec] [INFO] --- maven-compiler-plugin:3.0:compile (default-compile) @ sakai-connector ---
800 [exec] [INFO] No sources to compile
801 [exec] [INFO]
802 [exec] [INFO] --- maven-resources-plugin:2.6:testResources (default-testResources) @ sakai-connector ---
803 [exec] [INFO] Using 'UTF-8' encoding to copy filtered resources.
804 [exec] [INFO] skip non existing resourceDirectory C:\development\source\myu\uportal-portlets-overlay\sakai-connector-portlet\src\test\resources
805 [exec] [INFO]
806 [exec] [INFO] --- maven-compiler-plugin:3.0:testCompile (default-testCompile) @ sakai-connector ---
807 [exec] [INFO] No sources to compile
808 [exec] [INFO]
809 [exec] [INFO] --- maven-surefire-plugin:2.13:test (default-test) @ sakai-connector ---
810 [exec] [INFO] No tests to run.
811 [exec] [INFO]
812 [exec] [INFO] --- maven-war-plugin:2.3:war (default-war) @ sakai-connector ---
813 [exec] [INFO] Packaging webapp
814 [exec] [INFO] Assembling webapp [sakai-connector] in [C:\development\source\myu\uportal-portlets-overlay\sakai-connector-portlet\target\sakai-connector]
815 [exec] [INFO] Processing war project
816 [exec] [INFO] Copying webapp webResources [C:\development\source\myu\uportal-portlets-overlay\sakai-connector-portlet/src/main/webapp/WEB-INF] to [C:\development\source\myu\uportal-portlets-overlay\sakai-connector-portlet\target\sakai-connector]
817 [exec] [INFO] Copying webapp resources [C:\development\source\myu\uportal-portlets-overlay\sakai-connector-portlet\src\main\webapp]
818 [exec] [INFO] Processing overlay [ id org.jasig.portlet:sakai-connector]
819 [exec] [INFO] Webapp assembled in [6944 msecs]
820 [exec] [INFO] Building war: C:\development\source\myu\uportal-portlets-overlay\sakai-connector-portlet\target\sakai-connector.war
821 [exec] [WARNING] Warning: selected war files include a META-INF/INDEX.LIST which will be replaced by a newly generated one.
822 [exec] [INFO] Packaging classes
823 [exec] [INFO] Building jar: C:\development\source\myu\uportal-portlets-overlay\sakai-connector-portlet\target\sakai-connector-classes.jar
824 [exec] [INFO]
825 [exec] [INFO] --- maven-site-plugin:3.4:attach-descriptor (attach-descriptor) @ sakai-connector ---
826 [exec] [INFO]
827 [exec] [INFO] --- maven-pluto-plugin:2.1.0-M3:assemble (default) @ sakai-connector ---
828 [exec] [INFO] Assembling archive file C:\development\source\myu\uportal-portlets-overlay\sakai-connector-portlet\target\sakai-connector.war to directory C:\development\source\myu\uportal-portlets-overlay\sakai-connector-portlet\target
829 [exec] [INFO]
830 [exec] [INFO] ------------------------------------------------------------------------
831 [exec] [INFO] Building Simple Content Portlet 4.3.1-SNAPSHOT
832 [exec] [INFO] ------------------------------------------------------------------------
833 [exec] [INFO]
834 [exec] [INFO] --- maven-enforcer-plugin:1.2:enforce (enforce-maven) @ SimpleContentPortlet ---
835 [exec] [INFO]
836 [exec] [INFO] --- maven-enforcer-plugin:1.2:enforce (enforce-versions) @ SimpleContentPortlet ---
837 [exec] [INFO]
838 [exec] [INFO] --- maven-resources-plugin:2.6:resources (default-resources) @ SimpleContentPortlet ---
839 [exec] [INFO] Using 'UTF-8' encoding to copy filtered resources.
840 [exec] [INFO] Copying 0 resource
841 [exec] [INFO] Copying 2 resources
842 [exec] [INFO]
843 [exec] [INFO] --- maven-compiler-plugin:3.0:compile (default-compile) @ SimpleContentPortlet ---
844 [exec] [INFO] No sources to compile
845 [exec] [INFO]
846 [exec] [INFO] --- maven-resources-plugin:2.6:testResources (default-testResources) @ SimpleContentPortlet ---
847 [exec] [INFO] Using 'UTF-8' encoding to copy filtered resources.
848 [exec] [INFO] skip non existing resourceDirectory C:\development\source\myu\uportal-portlets-overlay\SimpleContentPortlet\src\test\resources
849 [exec] [INFO]
850 [exec] [INFO] --- maven-compiler-plugin:3.0:testCompile (default-testCompile) @ SimpleContentPortlet ---
851 [exec] [INFO] No sources to compile
852 [exec] [INFO]
853 [exec] [INFO] --- maven-surefire-plugin:2.13:test (default-test) @ SimpleContentPortlet ---
854 [exec] [INFO] No tests to run.
855 [exec] [INFO]
856 [exec] [INFO] --- maven-war-plugin:2.3:war (default-war) @ SimpleContentPortlet ---
857 [exec] [INFO] Packaging webapp
858 [exec] [INFO] Assembling webapp [SimpleContentPortlet] in [C:\development\source\myu\uportal-portlets-overlay\SimpleContentPortlet\target\SimpleContentPortlet]
859 [exec] [INFO] Processing war project
860 [exec] [INFO] Copying webapp resources [C:\development\source\myu\uportal-portlets-overlay\SimpleContentPortlet\src\main\webapp]
861 [exec] [INFO] Processing overlay [ id org.jasig.portlet.simplecontent:SimpleContentPortlet]
862 [exec] [INFO] Webapp assembled in [132176 msecs]
863 [exec] [INFO] Building war: C:\development\source\myu\uportal-portlets-overlay\SimpleContentPortlet\target\SimpleContentPortlet.war
864 [exec] [WARNING] Warning: selected war files include a META-INF/INDEX.LIST which will be replaced by a newly generated one.
865 [exec] [INFO] Packaging classes
866 [exec] [INFO] Building jar: C:\development\source\myu\uportal-portlets-overlay\SimpleContentPortlet\target\SimpleContentPortlet-classes.jar
867 [exec] [INFO]
868 [exec] [INFO] --- maven-site-plugin:3.4:attach-descriptor (attach-descriptor) @ SimpleContentPortlet ---
869 [exec] [INFO]
870 [exec] [INFO] --- maven-pluto-plugin:2.1.0-M3:assemble (default) @ SimpleContentPortlet ---
871 [exec] [INFO] Assembling archive file C:\development\source\myu\uportal-portlets-overlay\SimpleContentPortlet\target\SimpleContentPortlet.war to directory C:\development\source\myu\uportal-portlets-overlay\SimpleContentPortlet\target
872 [exec] [INFO]
873 [exec] [INFO] >>> hibernate3-maven-plugin:2.2:hbm2ddl (default) > process-resources @ SimpleContentPortlet >>>
874 [exec] [INFO]
875 [exec] [INFO] --- maven-enforcer-plugin:1.2:enforce (enforce-maven) @ SimpleContentPortlet ---
876 [exec] [INFO]
877 [exec] [INFO] --- maven-enforcer-plugin:1.2:enforce (enforce-versions) @ SimpleContentPortlet ---
878 [exec] [INFO]
879 [exec] [INFO] --- maven-resources-plugin:2.6:resources (default-resources) @ SimpleContentPortlet ---
880 [exec] [INFO] Using 'UTF-8' encoding to copy filtered resources.
881 [exec] [INFO] Copying 0 resource
882 [exec] [INFO] Copying 2 resources
883 [exec] [INFO]
884 [exec] [INFO] <<< hibernate3-maven-plugin:2.2:hbm2ddl (default) < process-resources @ SimpleContentPortlet <<<
885 [exec] [INFO]
886 [exec] [INFO] --- hibernate3-maven-plugin:2.2:hbm2ddl (default) @ SimpleContentPortlet ---
887 [exec] [INFO] Hibernate Annotations 3.4.0.GA
888 [exec] [INFO] Hibernate 3.3.1.GA
889 [exec] [INFO] loaded properties from resource hibernate.properties: {hibernate.attachments.batch.fetch.size=100, hibernate.connection.username=sa, hibernate.connection.password=****, hibernate.dialect=org.hibernate.dialect.HSQLDialect, hibernate.connection.url=jdbc:hsqldb:mem:simplecontent, hibernate.connection.validationQuery=select 1 from INFORMATION_SCHEMA.SYSTEM_USERS, hibernate.bytecode.use_reflection_optimizer=false, hibernate.connection.driver_class=org.hsqldb.jdbc.JDBCDriver}
890 [exec] [INFO] Bytecode provider name : javassist
891 [exec] [INFO] using JDK 1.4 java.sql.Timestamp handling
892 [exec] [INFO] Hibernate Commons Annotations 3.1.0.GA
893 [exec] [INFO] Hibernate EntityManager 3.4.0.GA
894 [exec] [INFO] configuring from resource: /properties/db/hibernate-attachments.cfg.xml
895 [exec] [INFO] Configuration resource: /properties/db/hibernate-attachments.cfg.xml
896 [exec] [INFO] Configured SessionFactory: PortalDb
897 [exec] [INFO] Binding entity from annotated class: org.jasig.portlet.attachment.model.Attachment
898 [exec] [INFO] Binding Named query: Attachment.getByGuid => SELECT a FROM Attachment a WHERE a.guid = :guid
899 [exec] [INFO] Binding Named query: Attachment.findByCreator => SELECT a FROM Attachment a WHERE a.createdBy = :creator
900 [exec] [INFO] Binding Named query: Attachment.findByFilename => SELECT a FROM Attachment a WHERE a.createdBy = :creator AND a.filename = :filename
901 [exec] [INFO] Binding Named query: Attachment.findAll => SELECT a FROM Attachment a order by a.id
902 [exec] [INFO] Bind entity org.jasig.portlet.attachment.model.Attachment on table SCM_ATTACHMENT
903 [exec] [INFO] Hibernate Validator not found: ignoring
904 [exec] [INFO] No hibernate configuration file loaded.
905 [exec] [INFO] Configuration Properties file loaded: C:\development\source\myu\uportal-portlets-overlay\SimpleContentPortlet\target\classes\hibernate.properties
906 [exec] [INFO] Using dialect: org.hibernate.dialect.HSQLDialect
907 [exec] [INFO] Running hbm2ddl schema export
908 [exec] [INFO] exporting generated schema to database
909 [exec] [INFO] Using Hibernate built-in connection pool (not for production use!)
910 [exec] [INFO] Hibernate connection pool size: 20
911 [exec] [INFO] autocommit mode: false
912 [exec] [INFO] using driver: org.hsqldb.jdbc.JDBCDriver at URL: jdbc:hsqldb:hsql://localhost:8887/uPortal
913 [exec] [INFO] connection properties: {validationQuery=select 1 from INFORMATION_SCHEMA.SYSTEM_USERS, user=sa, password=****}
914 [exec] drop table SCM_ATTACHMENT if exists;
915 [exec] create table SCM_ATTACHMENT (ID bigint generated by default as identity (start with 1), CHECKSUM varchar(64) not null, CREATED_AT timestamp not null, CREATED_BY varchar(128) not null, BDATA longvarbinary, FILENAME varchar(128) not null, GUID varchar(64) not null, MODIFIED_AT timestamp not null, MODIFIED_BY varchar(128) not null, PATH varchar(255) not null, SOURCE varchar(255), primary key (ID));
916 [exec] create index IDX_SCM_ATTACHMENT_GUID on SCM_ATTACHMENT (GUID);
917 [exec] create index IDX_SCM_ATTACHMENT_FILENAME on SCM_ATTACHMENT (FILENAME);
918 [exec] [INFO] schema export complete
919 [exec] [INFO] cleaning up connection pool: jdbc:hsqldb:hsql://localhost:8887/uPortal
920 [exec] [INFO]
921 [exec] [INFO] ------------------------------------------------------------------------
922 [exec] [INFO] Building Weather Portlet 4.3.1-SNAPSHOT
923 [exec] [INFO] ------------------------------------------------------------------------
924 [exec] [INFO]
925 [exec] [INFO] --- maven-enforcer-plugin:1.2:enforce (enforce-maven) @ WeatherPortlet ---
926 [exec] [INFO]
927 [exec] [INFO] --- maven-enforcer-plugin:1.2:enforce (enforce-versions) @ WeatherPortlet ---
928 [exec] [INFO]
929 [exec] [INFO] --- maven-resources-plugin:2.6:resources (default-resources) @ WeatherPortlet ---
930 [exec] [INFO] Using 'UTF-8' encoding to copy filtered resources.
931 [exec] [INFO] Copying 0 resource
932 [exec] [INFO] Copying 1 resource
933 [exec] [INFO]
934 [exec] [INFO] --- maven-compiler-plugin:3.0:compile (default-compile) @ WeatherPortlet ---
935 [exec] [INFO] No sources to compile
936 [exec] [INFO]
937 [exec] [INFO] --- maven-resources-plugin:2.6:testResources (default-testResources) @ WeatherPortlet ---
938 [exec] [INFO] Using 'UTF-8' encoding to copy filtered resources.
939 [exec] [INFO] skip non existing resourceDirectory C:\development\source\myu\uportal-portlets-overlay\WeatherPortlet\src\test\resources
940 [exec] [INFO]
941 [exec] [INFO] --- maven-compiler-plugin:3.0:testCompile (default-testCompile) @ WeatherPortlet ---
942 [exec] [INFO] No sources to compile
943 [exec] [INFO]
944 [exec] [INFO] --- maven-surefire-plugin:2.13:test (default-test) @ WeatherPortlet ---
945 [exec] [INFO] No tests to run.
946 [exec] [INFO]
947 [exec] [INFO] --- maven-war-plugin:2.3:war (default-war) @ WeatherPortlet ---
948 [exec] [INFO] Packaging webapp
949 [exec] [INFO] Assembling webapp [WeatherPortlet] in [C:\development\source\myu\uportal-portlets-overlay\WeatherPortlet\target\WeatherPortlet]
950 [exec] [INFO] Processing war project
951 [exec] [INFO] Copying webapp resources [C:\development\source\myu\uportal-portlets-overlay\WeatherPortlet\src\main\webapp]
952 [exec] [INFO] Processing overlay [ id org.jasig.portlet:WeatherPortlet]
953 [exec] [INFO] Webapp assembled in [8008 msecs]
954 [exec] [INFO] Building war: C:\development\source\myu\uportal-portlets-overlay\WeatherPortlet\target\WeatherPortlet.war
955 [exec] [WARNING] Warning: selected war files include a META-INF/INDEX.LIST which will be replaced by a newly generated one.
956 [exec] [INFO] Packaging classes
957 [exec] [INFO] Building jar: C:\development\source\myu\uportal-portlets-overlay\WeatherPortlet\target\WeatherPortlet-classes.jar
958 [exec] [INFO]
959 [exec] [INFO] --- maven-site-plugin:3.4:attach-descriptor (attach-descriptor) @ WeatherPortlet ---
960 [exec] [INFO]
961 [exec] [INFO] --- maven-pluto-plugin:2.1.0-M3:assemble (default) @ WeatherPortlet ---
962 [exec] [INFO] Assembling archive file C:\development\source\myu\uportal-portlets-overlay\WeatherPortlet\target\WeatherPortlet.war to directory C:\development\source\myu\uportal-portlets-overlay\WeatherPortlet\target
963 [exec] [INFO] cleaning up connection pool: jdbc:hsqldb:hsql://localhost:8887/uPortal
964 [exec] [INFO]
965 [exec] [INFO] ------------------------------------------------------------------------
966 [exec] [INFO] Building Web Proxy Portlet 4.3.1-SNAPSHOT
967 [exec] [INFO] ------------------------------------------------------------------------
968 [exec] [INFO]
969 [exec] [INFO] --- maven-enforcer-plugin:1.2:enforce (enforce-maven) @ WebProxyPortlet ---
970 [exec] [INFO]
971 [exec] [INFO] --- maven-enforcer-plugin:1.2:enforce (enforce-versions) @ WebProxyPortlet ---
972 [exec] [INFO]
973 [exec] [INFO] --- maven-resources-plugin:2.6:resources (default-resources) @ WebProxyPortlet ---
974 [exec] [INFO] Using 'UTF-8' encoding to copy filtered resources.
975 [exec] [INFO] Copying 0 resource
976 [exec] [INFO] Copying 2 resources
977 [exec] [INFO]
978 [exec] [INFO] --- maven-compiler-plugin:3.0:compile (default-compile) @ WebProxyPortlet ---
979 [exec] [INFO] Changes detected - recompiling the module!
980 [exec] [INFO] Compiling 2 source files to C:\development\source\myu\uportal-portlets-overlay\WebProxyPortlet\target\classes
981 [exec] [INFO] cleaning up connection pool: jdbc:hsqldb:hsql://localhost:8887/uPortal
982 [exec] [WARNING] /C:/development/source/myu/uportal-portlets-overlay/WebProxyPortlet/src/main/java/org/jasig/portlet/proxy/service/web/UsdLeaveRequestFormModifier.java:[27,91] sun.net.www.protocol.https.Handler is internal proprietary API and may be removed in a future release
983 [exec] [INFO]
984 [exec] [INFO] --- maven-resources-plugin:2.6:testResources (default-testResources) @ WebProxyPortlet ---
985 [exec] [INFO] Using 'UTF-8' encoding to copy filtered resources.
986 [exec] [INFO] skip non existing resourceDirectory C:\development\source\myu\uportal-portlets-overlay\WebProxyPortlet\src\test\resources
987 [exec] [INFO]
988 [exec] [INFO] --- maven-compiler-plugin:3.0:testCompile (default-testCompile) @ WebProxyPortlet ---
989 [exec] [INFO] No sources to compile
990 [exec] [INFO]
991 [exec] [INFO] --- maven-surefire-plugin:2.13:test (default-test) @ WebProxyPortlet ---
992 [exec] [INFO] No tests to run.
993 [exec] [INFO]
994 [exec] [INFO] --- maven-war-plugin:2.3:war (default-war) @ WebProxyPortlet ---
995 [exec] [INFO] Packaging webapp
996 [exec] [INFO] Assembling webapp [WebProxyPortlet] in [C:\development\source\myu\uportal-portlets-overlay\WebProxyPortlet\target\WebProxyPortlet]
997 [exec] [INFO] Processing war project
998 [exec] [INFO] Copying webapp webResources [C:\development\source\myu\uportal-portlets-overlay\WebProxyPortlet/src/main/webapp/WEB-INF] to [C:\development\source\myu\uportal-portlets-overlay\WebProxyPortlet\target\WebProxyPortlet]
999 [exec] [INFO] Copying webapp resources [C:\development\source\myu\uportal-portlets-overlay\WebProxyPortlet\src\main\webapp]
1000 [exec] [INFO] Processing overlay [ id org.jasig.portlet.proxy:WebProxyPortlet]
1001 [exec] [INFO] Webapp assembled in [8197 msecs]
1002 [exec] [INFO] Building war: C:\development\source\myu\uportal-portlets-overlay\WebProxyPortlet\target\WebProxyPortlet.war
1003 [exec] [WARNING] Warning: selected war files include a META-INF/INDEX.LIST which will be replaced by a newly generated one.
1004 [exec] [INFO] Packaging classes
1005 [exec] [INFO] Building jar: C:\development\source\myu\uportal-portlets-overlay\WebProxyPortlet\target\WebProxyPortlet-classes.jar
1006 [exec] [INFO]
1007 [exec] [INFO] --- maven-site-plugin:3.4:attach-descriptor (attach-descriptor) @ WebProxyPortlet ---
1008 [exec] [INFO]
1009 [exec] [INFO] --- maven-pluto-plugin:2.1.0-M3:assemble (default) @ WebProxyPortlet ---
1010 [exec] [INFO] Assembling archive file C:\development\source\myu\uportal-portlets-overlay\WebProxyPortlet\target\WebProxyPortlet.war to directory C:\development\source\myu\uportal-portlets-overlay\WebProxyPortlet\target
1011 [exec] [INFO] ------------------------------------------------------------------------
1012 [exec] [INFO] Reactor Summary:
1013 [exec] [INFO]
1014 [exec] [INFO] uPortal Portlets ................................... SUCCESS [ 17.568 s]
1015 [exec] [INFO] Announcements Portlet .............................. SUCCESS [ 40.977 s]
1016 [exec] [INFO] Basic LTI Portlet .................................. SUCCESS [ 2.507 s]
1017 [exec] [INFO] Bookmarks Portlet .................................. SUCCESS [ 8.436 s]
1018 [exec] [INFO] Calendar Portlet ................................... SUCCESS [01:42 min]
1019 [exec] [INFO] CAS Proxy Test Portlet ............................. SUCCESS [ 3.510 s]
1020 [exec] [INFO] Email Preview Portlet .............................. SUCCESS [ 46.374 s]
1021 [exec] [INFO] Functional Tests Portlet ........................... SUCCESS [ 6.950 s]
1022 [exec] [INFO] Jasig Widget Portlets .............................. SUCCESS [ 24.523 s]
1023 [exec] [INFO] Pluto Test Suite Portlet ........................... SUCCESS [ 3.299 s]
1024 [exec] [INFO] News Reader Portlet ................................ SUCCESS [ 34.588 s]
1025 [exec] [INFO] Jasig Notification Portlet ......................... SUCCESS [ 16.483 s]
1026 [exec] [INFO] Sakai Connector Portlet ............................ SUCCESS [ 9.219 s]
1027 [exec] [INFO] Simple Content Portlet ............................. SUCCESS [02:29 min]
1028 [exec] [INFO] Weather Portlet .................................... SUCCESS [ 10.816 s]
1029 [exec] [INFO] Web Proxy Portlet .................................. SUCCESS [ 19.630 s]
1030 [exec] [INFO] ------------------------------------------------------------------------
1031 [exec] [INFO] BUILD SUCCESS
1032 [exec] [INFO] ------------------------------------------------------------------------
1033 [exec] [INFO] Total time: 08:22 min
1034 [exec] [INFO] Finished at: 2016-10-26T15:35:26-05:00
1035 [exec] [INFO] Final Memory: 49M/189M
1036 [exec] [INFO] ------------------------------------------------------------------------
1037
1038prodPrompt:
1039
1040db-import:
1041
1042prodPrompt:
1043
1044db-import-required:
1045
1046prodPrompt:
1047
1048data-import:
1049 [echo] Creating Data Import Script
1050
1051up-shell:
1052
1053prodPrompt:
1054
1055db-import-default:
1056
1057prodPrompt:
1058
1059data-import:
1060 [echo] Creating Data Import Script
1061
1062up-shell:
1063
1064prodPrompt:
1065
1066db-import-quickstart:
1067
1068prodPrompt:
1069
1070data-import:
1071 [echo] Creating Data Import Script
1072
1073up-shell:
1074
1075prodPrompt:
1076
1077portlet-data-import:
1078 [echo] Importing portlet-specific data [skipPackage=true]
1079
1080mvn:
1081 [echo] Running mvn in C:\development\source\myu/uportal-portlets-overlay for goals: -Djasig.ignore data-import -Djasig.ignore
1082 [exec] [INFO] Scanning for projects...
1083 [exec] [INFO] ------------------------------------------------------------------------
1084 [exec] [INFO] Reactor Build Order:
1085 [exec] [INFO]
1086 [exec] [INFO] uPortal Portlets
1087 [exec] [INFO] Announcements Portlet
1088 [exec] [INFO] Basic LTI Portlet
1089 [exec] [INFO] Bookmarks Portlet
1090 [exec] [INFO] Calendar Portlet
1091 [exec] [INFO] CAS Proxy Test Portlet
1092 [exec] [INFO] Email Preview Portlet
1093 [exec] [INFO] Functional Tests Portlet
1094 [exec] [INFO] Jasig Widget Portlets
1095 [exec] [INFO] Pluto Test Suite Portlet
1096 [exec] [INFO] News Reader Portlet
1097 [exec] [INFO] Jasig Notification Portlet
1098 [exec] [INFO] Sakai Connector Portlet
1099 [exec] [INFO] Simple Content Portlet
1100 [exec] [INFO] Weather Portlet
1101 [exec] [INFO] Web Proxy Portlet
1102 [exec] [INFO]
1103 [exec] [INFO] ------------------------------------------------------------------------
1104 [exec] [INFO] Building uPortal Portlets 4.3.1-SNAPSHOT
1105 [exec] [INFO] ------------------------------------------------------------------------
1106 [exec] [INFO]
1107 [exec] [INFO] ------------------------------------------------------------------------
1108 [exec] [INFO] Building Announcements Portlet 4.3.1-SNAPSHOT
1109 [exec] [INFO] ------------------------------------------------------------------------
1110 [exec] [INFO]
1111 [exec] [INFO] --- maven-antrun-plugin:1.3:run (data-import) @ Announcements ---
1112 [exec] [INFO] Executing tasks
1113 [exec] AnnouncementPortlet: INFO org.jasig.portlet.announcements.spring.PortletApplicationContextLocator Creating new lazily initialized GenericApplicationContext for the portal
1114 [exec] AnnouncementPortlet: INFO org.springframework.beans.factory.xml.XmlBeanDefinitionReader Loading XML bean definitions from URL [file:/C:/development/source/myu/uportal-portlets-overlay/AnnouncementsPortlet/target/Announcements/WEB-INF/context/importExportContext.xml]
1115 [exec] AnnouncementPortlet: INFO org.springframework.beans.factory.xml.XmlBeanDefinitionReader Loading XML bean definitions from URL [file:/C:/development/source/myu/uportal-portlets-overlay/AnnouncementsPortlet/target/Announcements/WEB-INF/context/databaseContext.xml]
1116 [exec] AnnouncementPortlet: INFO org.springframework.context.support.GenericApplicationContext Refreshing org.springframework.context.support.GenericApplicationContext@ccd1bc3: startup date [Wed Oct 26 15:35:36 CDT 2016]; root of context hierarchy
1117 [exec] AnnouncementPortlet: INFO org.jasig.portlet.announcements.spring.PortletApplicationContextLocator Created new lazily initialized GenericApplicationContext for the portal in 1304ms
1118 [exec] SLF4J: Class path contains multiple SLF4J bindings.
1119 [exec] SLF4J: Found binding in [jar:file:/C:/Users/toben.archer/.m2/repository/org/slf4j/slf4j-log4j12/1.7.10/slf4j-log4j12-1.7.10.jar!/org/slf4j/impl/StaticLoggerBinder.class]
1120 [exec] SLF4J: Found binding in [jar:file:/C:/Users/toben.archer/.m2/repository/org/slf4j/slf4j-log4j12/1.7.10/slf4j-log4j12-1.7.10.jar!/org/slf4j/impl/StaticLoggerBinder.class]
1121 [exec] SLF4J: See http://www.slf4j.org/codes.html#multiple_bindings for an explanation.
1122 [exec] AnnouncementPortlet: INFO org.hibernate.annotations.common.Version Hibernate Commons Annotations 3.2.0.Final
1123 [exec] AnnouncementPortlet: INFO org.hibernate.cfg.Environment Hibernate 3.6.10.Final
1124 [exec] AnnouncementPortlet: INFO org.hibernate.cfg.Environment hibernate.properties not found
1125 [exec] AnnouncementPortlet: INFO org.hibernate.cfg.Environment Bytecode provider name : javassist
1126 [exec] AnnouncementPortlet: INFO org.hibernate.cfg.Environment using JDK 1.4 java.sql.Timestamp handling
1127 [exec] AnnouncementPortlet: INFO org.hibernate.cfg.Configuration configuring from url: jar:file:/C:/Users/toben.archer/.m2/repository/org/jasig/portlet/Announcements/2.2.0-M2/Announcements-2.2.0-M2-classes.jar!/hibernate.cfg.xml
1128 [exec] AnnouncementPortlet: INFO org.hibernate.cfg.Configuration Reading mappings from resource : hibernate-mappings/Announcement.hbm.xml
1129 [exec] AnnouncementPortlet: INFO org.hibernate.cfg.Configuration Reading mappings from resource : hibernate-mappings/Topic.hbm.xml
1130 [exec] AnnouncementPortlet: INFO org.hibernate.cfg.Configuration Reading mappings from resource : hibernate-mappings/TopicSubscription.hbm.xml
1131 [exec] AnnouncementPortlet: INFO org.hibernate.cfg.Configuration Configured SessionFactory: null
1132 [exec] AnnouncementPortlet: INFO org.hibernate.cfg.HbmBinder Mapping class: org.jasig.portlet.announcements.model.Announcement -> ANNOUNCEMENT
1133 [exec] AnnouncementPortlet: INFO org.hibernate.cfg.HbmBinder Mapping collection: org.jasig.portlet.announcements.model.Announcement.attachments -> ANNOUNCEMENT_ATTACHMENT
1134 [exec] AnnouncementPortlet: INFO org.hibernate.cfg.HbmBinder Mapping class: org.jasig.portlet.announcements.model.Topic -> TOPIC
1135 [exec] AnnouncementPortlet: INFO org.hibernate.cfg.HbmBinder Mapping collection: org.jasig.portlet.announcements.model.Topic.audience -> AUDIENCE
1136 [exec] AnnouncementPortlet: INFO org.hibernate.cfg.HbmBinder Mapping collection: org.jasig.portlet.announcements.model.Topic.admins -> ADMINS
1137 [exec] AnnouncementPortlet: INFO org.hibernate.cfg.HbmBinder Mapping collection: org.jasig.portlet.announcements.model.Topic.authors -> AUTHORS
1138 [exec] AnnouncementPortlet: INFO org.hibernate.cfg.HbmBinder Mapping collection: org.jasig.portlet.announcements.model.Topic.moderators -> MODERATORS
1139 [exec] AnnouncementPortlet: INFO org.hibernate.cfg.HbmBinder Mapping class: org.jasig.portlet.announcements.model.TopicSubscription -> SUBSCRIPTION
1140 [exec] AnnouncementPortlet: INFO org.hibernate.cfg.HbmBinder Mapping collection: org.jasig.portlet.announcements.model.Topic.announcements -> ANNOUNCEMENT
1141 [exec] AnnouncementPortlet: INFO org.hibernate.cfg.HbmBinder Mapping collection: org.jasig.portlet.announcements.model.Topic.subscriptions -> SUBSCRIPTION
1142 [exec] AnnouncementPortlet: INFO org.hibernate.cfg.Configuration Hibernate Validator not found: ignoring
1143 [exec] AnnouncementPortlet: INFO org.springframework.orm.hibernate3.LocalSessionFactoryBean Building new Hibernate SessionFactory
1144 [exec] AnnouncementPortlet: INFO org.hibernate.cfg.search.HibernateSearchEventListenerRegister Unable to find org.hibernate.search.event.FullTextIndexEventListener on the classpath. Hibernate Search is not enabled.
1145 [exec] AnnouncementPortlet: INFO org.hibernate.connection.ConnectionProviderFactory Initializing connection provider: org.springframework.orm.hibernate3.LocalDataSourceConnectionProvider
1146 [exec] AnnouncementPortlet: WARN org.hibernate.util.JDBCExceptionReporter SQL Error: 0, SQLState: null
1147 [exec] AnnouncementPortlet: ERROR org.hibernate.util.JDBCExceptionReporter Cannot load JDBC driver class '${hibernate.connection.driver_class}'
1148 [exec] AnnouncementPortlet: WARN org.hibernate.cfg.SettingsFactory Could not obtain connection to query metadata
1149 [exec] org.apache.commons.dbcp.SQLNestedException: Cannot load JDBC driver class '${hibernate.connection.driver_class}'
1150 [exec] at org.apache.commons.dbcp.BasicDataSource.createConnectionFactory(BasicDataSource.java:1429)
1151 [exec] at org.apache.commons.dbcp.BasicDataSource.createDataSource(BasicDataSource.java:1371)
1152 [exec] at org.apache.commons.dbcp.BasicDataSource.getConnection(BasicDataSource.java:1044)
1153 [exec] at org.springframework.orm.hibernate3.LocalDataSourceConnectionProvider.getConnection(LocalDataSourceConnectionProvider.java:85)
1154 [exec] at org.hibernate.cfg.SettingsFactory.buildSettings(SettingsFactory.java:113)
1155 [exec] at org.hibernate.cfg.Configuration.buildSettingsInternal(Configuration.java:2863)
1156 [exec] at org.hibernate.cfg.Configuration.buildSettings(Configuration.java:2859)
1157 [exec] at org.hibernate.cfg.Configuration.buildSessionFactory(Configuration.java:1870)
1158 [exec] at org.springframework.orm.hibernate3.LocalSessionFactoryBean.newSessionFactory(LocalSessionFactoryBean.java:793)
1159 [exec] at org.springframework.orm.hibernate3.LocalSessionFactoryBean.buildSessionFactory(LocalSessionFactoryBean.java:715)
1160 [exec] at org.springframework.orm.hibernate3.AbstractSessionFactoryBean.afterPropertiesSet(AbstractSessionFactoryBean.java:189)
1161 [exec] at org.springframework.beans.factory.support.AbstractAutowireCapableBeanFactory$6.run(AbstractAutowireCapableBeanFactory.java:1615)
1162 [exec] at java.security.AccessController.doPrivileged(Native Method)
1163 [exec] at org.springframework.beans.factory.support.AbstractAutowireCapableBeanFactory.invokeInitMethods(AbstractAutowireCapableBeanFactory.java:1612)
1164 [exec] at org.springframework.beans.factory.support.AbstractAutowireCapableBeanFactory.initializeBean(AbstractAutowireCapableBeanFactory.java:1562)
1165 [exec] at org.springframework.beans.factory.support.AbstractAutowireCapableBeanFactory.doCreateBean(AbstractAutowireCapableBeanFactory.java:539)
1166 [exec] at org.springframework.beans.factory.support.AbstractAutowireCapableBeanFactory.createBean(AbstractAutowireCapableBeanFactory.java:476)
1167 [exec] at org.springframework.beans.factory.support.AbstractBeanFactory$1.getObject(AbstractBeanFactory.java:303)
1168 [exec] at org.springframework.beans.factory.support.DefaultSingletonBeanRegistry.getSingleton(DefaultSingletonBeanRegistry.java:230)
1169 [exec] at org.springframework.beans.factory.support.AbstractBeanFactory.doGetBean(AbstractBeanFactory.java:299)
1170 [exec] at org.springframework.beans.factory.support.AbstractBeanFactory.getBean(AbstractBeanFactory.java:194)
1171 [exec] at org.springframework.beans.factory.support.BeanDefinitionValueResolver.resolveReference(BeanDefinitionValueResolver.java:351)
1172 [exec] at org.springframework.beans.factory.support.BeanDefinitionValueResolver.resolveValueIfNecessary(BeanDefinitionValueResolver.java:108)
1173 [exec] at org.springframework.beans.factory.support.AbstractAutowireCapableBeanFactory.applyPropertyValues(AbstractAutowireCapableBeanFactory.java:1469)
1174 [exec] at org.springframework.beans.factory.support.AbstractAutowireCapableBeanFactory.populateBean(AbstractAutowireCapableBeanFactory.java:1214)
1175 [exec] at org.springframework.beans.factory.support.AbstractAutowireCapableBeanFactory.doCreateBean(AbstractAutowireCapableBeanFactory.java:537)
1176 [exec] at org.springframework.beans.factory.support.AbstractAutowireCapableBeanFactory.createBean(AbstractAutowireCapableBeanFactory.java:476)
1177 [exec] at org.springframework.beans.factory.support.AbstractBeanFactory$1.getObject(AbstractBeanFactory.java:303)
1178 [exec] at org.springframework.beans.factory.support.DefaultSingletonBeanRegistry.getSingleton(DefaultSingletonBeanRegistry.java:230)
1179 [exec] at org.springframework.beans.factory.support.AbstractBeanFactory.doGetBean(AbstractBeanFactory.java:299)
1180 [exec] at org.springframework.beans.factory.support.AbstractBeanFactory.getBean(AbstractBeanFactory.java:199)
1181 [exec] at org.springframework.context.support.AbstractApplicationContext.getBean(AbstractApplicationContext.java:962)
1182 [exec] at org.jasig.portlet.announcements.Importer.main(Importer.java:91)
1183 [exec] at sun.reflect.NativeMethodAccessorImpl.invoke0(Native Method)
1184 [exec] at sun.reflect.NativeMethodAccessorImpl.invoke(NativeMethodAccessorImpl.java:62)
1185 [exec] at sun.reflect.DelegatingMethodAccessorImpl.invoke(DelegatingMethodAccessorImpl.java:43)
1186 [exec] at java.lang.reflect.Method.invoke(Method.java:498)
1187 [exec] at org.apache.tools.ant.taskdefs.ExecuteJava.run(ExecuteJava.java:217)
1188 [exec] at org.apache.tools.ant.taskdefs.ExecuteJava.execute(ExecuteJava.java:152)
1189 [exec] at org.apache.tools.ant.taskdefs.Java.run(Java.java:764)
1190 [exec] at org.apache.tools.ant.taskdefs.Java.executeJava(Java.java:218)
1191 [exec] at org.apache.tools.ant.taskdefs.Java.executeJava(Java.java:132)
1192 [exec] at org.apache.tools.ant.taskdefs.Java.execute(Java.java:105)
1193 [exec] at org.apache.tools.ant.UnknownElement.execute(UnknownElement.java:288)
1194 [exec] at sun.reflect.NativeMethodAccessorImpl.invoke0(Native Method)
1195 [exec] at sun.reflect.NativeMethodAccessorImpl.invoke(NativeMethodAccessorImpl.java:62)
1196 [exec] at sun.reflect.DelegatingMethodAccessorImpl.invoke(DelegatingMethodAccessorImpl.java:43)
1197 [exec] at java.lang.reflect.Method.invoke(Method.java:498)
1198 [exec] at org.apache.tools.ant.dispatch.DispatchUtils.execute(DispatchUtils.java:106)
1199 [exec] at org.apache.tools.ant.Task.perform(Task.java:348)
1200 [exec] at org.apache.tools.ant.Target.execute(Target.java:357)
1201 [exec] at org.apache.maven.plugin.antrun.AbstractAntMojo.executeTasks(AbstractAntMojo.java:118)
1202 [exec] at org.apache.maven.plugin.antrun.AntRunMojo.execute(AntRunMojo.java:98)
1203 [exec] at org.apache.maven.plugin.DefaultBuildPluginManager.executeMojo(DefaultBuildPluginManager.java:134)
1204 [exec] at org.apache.maven.lifecycle.internal.MojoExecutor.execute(MojoExecutor.java:207)
1205 [exec] at org.apache.maven.lifecycle.internal.MojoExecutor.execute(MojoExecutor.java:153)
1206 [exec] at org.apache.maven.lifecycle.internal.MojoExecutor.execute(MojoExecutor.java:145)
1207 [exec] at org.apache.maven.lifecycle.internal.LifecycleModuleBuilder.buildProject(LifecycleModuleBuilder.java:116)
1208 [exec] at org.apache.maven.lifecycle.internal.LifecycleModuleBuilder.buildProject(LifecycleModuleBuilder.java:80)
1209 [exec] at org.apache.maven.lifecycle.internal.builder.singlethreaded.SingleThreadedBuilder.build(SingleThreadedBuilder.java:51)
1210 [exec] at org.apache.maven.lifecycle.internal.LifecycleStarter.execute(LifecycleStarter.java:128)
1211 [exec] at org.apache.maven.DefaultMaven.doExecute(DefaultMaven.java:307)
1212 [exec] at org.apache.maven.DefaultMaven.doExecute(DefaultMaven.java:193)
1213 [exec] at org.apache.maven.DefaultMaven.execute(DefaultMaven.java:106)
1214 [exec] at org.apache.maven.cli.MavenCli.execute(MavenCli.java:863)
1215 [exec] at org.apache.maven.cli.MavenCli.doMain(MavenCli.java:288)
1216 [exec] at org.apache.maven.cli.MavenCli.main(MavenCli.java:199)
1217 [exec] at sun.reflect.NativeMethodAccessorImpl.invoke0(Native Method)
1218 [exec] at sun.reflect.NativeMethodAccessorImpl.invoke(NativeMethodAccessorImpl.java:62)
1219 [exec] at sun.reflect.DelegatingMethodAccessorImpl.invoke(DelegatingMethodAccessorImpl.java:43)
1220 [exec] at java.lang.reflect.Method.invoke(Method.java:498)
1221 [exec] at org.codehaus.plexus.classworlds.launcher.Launcher.launchEnhanced(Launcher.java:289)
1222 [exec] at org.codehaus.plexus.classworlds.launcher.Launcher.launch(Launcher.java:229)
1223 [exec] at org.codehaus.plexus.classworlds.launcher.Launcher.mainWithExitCode(Launcher.java:415)
1224 [exec] at org.codehaus.plexus.classworlds.launcher.Launcher.main(Launcher.java:356)
1225 [exec] Caused by: java.lang.ClassNotFoundException: ${hibernate.connection.driver_class}
1226 [exec] at org.apache.tools.ant.AntClassLoader.findClassInComponents(AntClassLoader.java:1400)
1227 [exec] at org.apache.tools.ant.AntClassLoader.findClass(AntClassLoader.java:1341)
1228 [exec] at org.apache.tools.ant.AntClassLoader.loadClass(AntClassLoader.java:1094)
1229 [exec] at java.lang.ClassLoader.loadClass(ClassLoader.java:357)
1230 [exec] at org.apache.commons.dbcp.BasicDataSource.createConnectionFactory(BasicDataSource.java:1420)
1231 [exec] ... 74 more
1232 [exec] [INFO] ------------------------------------------------------------------------
1233 [exec] [INFO] Reactor Summary:
1234 [exec] [INFO]
1235 [exec] [INFO] uPortal Portlets ................................... SUCCESS [ 0.074 s]
1236 [exec] [INFO] Announcements Portlet .............................. FAILURE [ 8.120 s]
1237 [exec] [INFO] Basic LTI Portlet .................................. SKIPPED
1238 [exec] [INFO] Bookmarks Portlet .................................. SKIPPED
1239 [exec] [INFO] Calendar Portlet ................................... SKIPPED
1240 [exec] [INFO] CAS Proxy Test Portlet ............................. SKIPPED
1241 [exec] [INFO] Email Preview Portlet .............................. SKIPPED
1242 [exec] [INFO] Functional Tests Portlet ........................... SKIPPED
1243 [exec] [INFO] Jasig Widget Portlets .............................. SKIPPED
1244 [exec] [INFO] Pluto Test Suite Portlet ........................... SKIPPED
1245 [exec] [INFO] News Reader Portlet ................................ SKIPPED
1246 [exec] [INFO] Jasig Notification Portlet ......................... SKIPPED
1247 [exec] [INFO] Sakai Connector Portlet ............................ SKIPPED
1248 [exec] [INFO] Simple Content Portlet ............................. SKIPPED
1249 [exec] [INFO] Weather Portlet .................................... SKIPPED
1250 [exec] [INFO] Web Proxy Portlet .................................. SKIPPED
1251 [exec] [INFO] ------------------------------------------------------------------------
1252 [exec] [INFO] BUILD FAILURE
1253 [exec] [INFO] ------------------------------------------------------------------------
1254 [exec] [INFO] Total time: 9.319 s
1255 [exec] [INFO] Finished at: 2016-10-26T15:35:39-05:00
1256 [exec] [INFO] Final Memory: 27M/382M
1257 [exec] [INFO] ------------------------------------------------------------------------
1258 [exec] [ERROR] Failed to execute goal org.apache.maven.plugins:maven-antrun-plugin:1.3:run (data-import) on project Announcements: An Ant BuildException has occured: org.springframework.beans.factory.BeanCreationException: Error creating bean with name 'announcementService' defined in URL [file:/C:/development/source/myu/uportal-portlets-overlay/AnnouncementsPortlet/target/Announcements/WEB-INF/context/databaseContext.xml]: Cannot resolve reference to bean 'sessionFactory' while setting bean property 'sessionFactory'; nested exception is org.springframework.beans.factory.BeanCreationException: Error creating bean with name 'sessionFactory' defined in URL [file:/C:/development/source/myu/uportal-portlets-overlay/AnnouncementsPortlet/target/Announcements/WEB-INF/context/databaseContext.xml]: Invocation of init method failed; nested exception is org.hibernate.HibernateException: 'hibernate.dialect' must be set when no Connection available -> [Help 1]
1259 [exec] [ERROR]
1260 [exec] [ERROR] To see the full stack trace of the errors, re-run Maven with the -e switch.
1261 [exec] [ERROR] Re-run Maven using the -X switch to enable full debug logging.
1262 [exec] [ERROR]
1263 [exec] [ERROR] For more information about the errors and possible solutions, please read the following articles:
1264 [exec] [ERROR] [Help 1] http://cwiki.apache.org/confluence/display/MAVEN/MojoExecutionException
1265 [exec] [ERROR]
1266 [exec] [ERROR] After correcting the problems, you can resume the build with the command
1267 [exec] [ERROR] mvn <goals> -rf :Announcements
1268 [exec] AnnouncementPortlet: INFO org.springframework.context.support.GenericApplicationContext Closing org.springframework.context.support.GenericApplicationContext@ccd1bc3: startup date [Wed Oct 26 15:35:36 CDT 2016]; root of context hierarchy
1269
1270BUILD FAILED
1271C:\development\source\myu\build.xml:173: The following error occurred while executing this line:
1272C:\development\source\myu\build.xml:176: The following error occurred while executing this line:
1273C:\development\source\myu\build.xml:1049: The following error occurred while executing this line:
1274C:\development\source\myu\build.xml:1104: The following error occurred while executing this line:
1275C:\development\source\myu\build.xml:1750: exec returned: 1
1276
1277Total time: 8 minutes 42 seconds